source\blender\blenkernel\intern\writeffmpeg.c:35:28: ffmpeg/swscale.h: No such
file or directory
source\blender\blenkernel\intern\writeffmpeg.c: In function `generate_video_fram
e':
source\blender\blenkernel\intern\writeffmpeg.c:322: warning: implicit declaratio
n of function `sws_scale'
source\blender\blenkernel\intern\writeffmpeg.c: In function `alloc_video_stream'
:
source\blender\blenkernel\intern\writeffmpeg.c:427: warning: implicit declaratio
n of function `sws_getContext'
source\blender\blenkernel\intern\writeffmpeg.c:431: error: `SWS_BICUBIC' undecla
red (first use in this function)
source\blender\blenkernel\intern\writeffmpeg.c:431: error: (Each undeclared iden
tifier is reported only once
source\blender\blenkernel\intern\writeffmpeg.c:431: error: for each function it
appears in.)
source\blender\blenkernel\intern\writeffmpeg.c:432: warning: assignment makes po
inter from integer without a cast
source\blender\blenkernel\intern\writeffmpeg.c: In function `end_ffmpeg':
source\blender\blenkernel\intern\writeffmpeg.c:814: warning: implicit declaratio
n of function `sws_freeContext'
=====
scons: *** [C:\bf-blender\build\win32-mingw\source\blender\blenkernel\intern\wri
teffmpeg.o] Error 1
scons: building terminated because of errors.