All pastes #719833 Raw Edit

Unnamed

public text v1 · immutable
#719833 ·published 2007-09-29 17:59 UTC
rendered paste body
are/wv\" -I/usr/include/libpng12     -I/usr/include/libxml2 -I/usr/include/glib-2.0 -I/usr/lib/glib-2.0/include     -O2 -march=i486 -mtune=i686 -ansi -pedantic  -c ../wv/plcf.c 
gcc -O2 -march=i486 -mtune=i686 -ansi -pedantic  -I/usr/include/libpng12     -I/usr/include/libxml2 -I/usr/include/glib-2.0 -I/usr/lib/glib-2.0/include      -c -o libole2/ms-ole.o libole2/ms-ole.c
libole2/ms-ole.c:18:28: error: libole2/ms-ole.h: No such file or directory
libole2/ms-ole.c:118: error: expected specifier-qualifier-list before 'gboolean'
libole2/ms-ole.c:139: error: expected '=', ',', ';', 'asm' or '__attribute__' before 'open2_wrap'
libole2/ms-ole.c:154: error: expected '=', ',', ';', 'asm' or '__attribute__' before 'open3_wrap'
libole2/ms-ole.c:169: error: expected ')' before 'fd'
libole2/ms-ole.c:175: error: expected ')' before 'fd'
libole2/ms-ole.c:181: error: expected ')' before 'fd'
libole2/ms-ole.c:188: error: expected ')' before 'fd'
libole2/ms-ole.c:194: error: expected ')' before 'fd'
libole2/ms-ole.c:205: error: expected ')' before 'fd'
libole2/ms-ole.c:231: error: expected '=', ',', ';', 'asm' or '__attribute__' before 'ms_ole_default_wrappers'
libole2/ms-ole.c:249: warning: ISO C does not allow extra ';' outside of a function
libole2/ms-ole.c:254: error: expected '=', ',', ';', 'asm' or '__attribute__' before '*' token
libole2/ms-ole.c:257: error: expected ')' before '*' token
libole2/ms-ole.c:271: error: expected ')' before '*' token
libole2/ms-ole.c:284: error: expected '=', ',', ';', 'asm' or '__attribute__' before '*' token
libole2/ms-ole.c:290: error: expected '=', ',', ';', 'asm' or '__attribute__' before 'ms_ole_stream_read_copy'
libole2/ms-ole.c:298: error: expected '=', ',', ';', 'asm' or '__attribute__' before '*' token
libole2/ms-ole.c:305: error: expected '=', ',', ';', 'asm' or '__attribute__' before 'ms_ole_stream_lseek'
libole2/ms-ole.c:313: error: expected '=', ',', ';', 'asm' or '__attribute__' before 'ms_ole_stream_tell'
libole2/ms-ole.c:319: error: expected '=', ',', ';', 'asm' or '__attribute__' before 'ms_ole_stream_write'
libole2/ms-ole.c:332: error: expected '=', ',', ';', 'asm' or '__attribute__' before 'libole2_debug'
libole2/ms-ole.c:334: error: expected '=', ',', ';', 'asm' or '__attribute__' before 'PPS_IDX'
libole2/ms-ole.c:355: error: expected '=', ',', ';', 'asm' or '__attribute__' before 'BLP'
libole2/ms-ole.c:372: error: expected specifier-qualifier-list before 'GList'
libole2/ms-ole.c:393: error: expected specifier-qualifier-list before 'guint32'
libole2/ms-ole.c:397: warning: struct has no members
libole2/ms-ole.c:400: error: expected ')' before 'blk'
libole2/ms-ole.c:411: error: expected ')' before '*' token
libole2/ms-ole.c:430: error: expected '=', ',', ';', 'asm' or '__attribute__' before '*' token
libole2/ms-ole.c:559: error: expected ')' before '*' token
libole2/ms-ole.c:590: error: expected ')' before '*' token
libole2/ms-ole.c:602: error: expected ')' before '*' token
libole2/ms-ole.c:645: error: expected ')' before '*' token
libole2/ms-ole.c:670: error: expected ')' before '*' token
libole2/ms-ole.c:700: error: expected ')' before '*' token
libole2/ms-ole.c:726: error: expected '=', ',', ';', 'asm' or '__attribute__' before 'get_next_block'
libole2/ms-ole.c:742: error: expected ')' before '*' token
gcc -O2 -march=i486 -mtune=i686 -ansi -pedantic  -I/usr/include/libpng12     -I/usr/include/libxml2 -I/usr/include/glib-2.0 -I/usr/lib/glib-2.0/include      -c -o libole2/ms-ole-summary.o libole2/ms-ole-summary.c
libole2/ms-ole.c:872: error: expected ')' before '*' token
libole2/ms-ole.c:943: error: expected ')' before '*' token
libole2/ms-ole.c:967: error: expected '=', ',', ';', 'asm' or '__attribute__' before 'next_free_bb'
libole2/ms-ole.c:990: error: expected ')' before '*' token
libole2/ms-ole.c:1030: error: expected '=', ',', ';', 'asm' or '__attribute__' before 'next_free_sb'
libole2/ms-ole.c:1065: error: expected '=', ',', ';', 'asm' or '__attribute__' before '*' token
libole2/ms-ole.c:1102: error: expected '=', ',', ';', 'asm' or '__attribute__' before 'pps_compare_func'
libole2/ms-ole.c:1113: error: expected ')' before '*' token
libole2/ms-ole.c:1192: error: expected ')' before '*' token
libole2/ms-ole.c:1244: error: expected ')' before '*' token
libole2/ms-ole.c:1318: error: expected ')' before '*' token
libole2/ms-ole.c:1415: error: expected ')' before '*' token
libole2/ms-ole.c:1437: error: expected ')' before '*' token
libole2/ms-ole.c:1473: error: expected ')' before '*' token
libole2/ms-ole.c:1555: error: expected ')' before '*' token
libole2/ms-ole.c:1625: error: expected ')' before '*' token
libole2/ms-ole.c:1647: error: expected ')' before '*' token
libole2/ms-ole.c:1662: error: expected '=', ',', ';', 'asm' or '__attribute__' before '*' token
libole2/ms-ole.c:1688: error: expected ')' before '*' token
libole2/ms-ole.c:1702: error: expected ')' before '*' token
libole2/ms-ole.c:1722: error: expected '=', ',', ';', 'asm' or '__attribute__' before 'ms_ole_open_vfs'
libole2/ms-ole.c:1858: error: expected '=', ',', ';', 'asm' or '__attribute__' before 'ms_ole_create_vfs'
libole2/ms-ole.c:1980: error: expected ')' before '*' token
libole2/ms-ole.c:2049: error: expected ')' before 'const'
libole2/ms-ole.c:2075: error: expected ')' before '*' token
libole2/ms-ole.c:2116: error: expected '=', ',', ';', 'asm' or '__attribute__' before 'tell_pos'
libole2/ms-ole.c:2128: error: expected ')' before '*' token
libole2/ms-ole.c:2218: error: expected '=', ',', ';', 'asm' or '__attribute__' before 'ms_ole_lseek'
libole2/ms-ole.c:2245: error: expected '=', ',', ';', 'asm' or '__attribute__' before '*' token
libole2/ms-ole.c:2291: error: expected '=', ',', ';', 'asm' or '__attribute__' before '*' token
libole2/ms-ole.c:2339: error: expected '=', ',', ';', 'asm' or '__attribute__' before 'ms_ole_read_copy_bb'
libole2/ms-ole.c:2395: error: expected '=', ',', ';', 'asm' or '__attribute__' before 'ms_ole_read_copy_sb'
libole2/ms-ole.c:2445: error: expected ')' before '*' token
libole2/ms-ole.c:2512: error: expected '=', ',', ';', 'asm' or '__attribute__' before 'ms_ole_write_bb'
libole2/ms-ole.c:2561: error: expected '=', ',', ';', 'asm' or '__attribute__' before 'ms_ole_write_sb'
libole2/ms-ole.c:2665: error: expected '=', ',', ';', 'asm' or '__attribute__' before 'pps_create'
libole2/ms-ole.c:2706: error: expected '=', ',', ';', 'asm' or '__attribute__' before '*' token
libole2/ms-ole.c:2753: error: expected '=', ',', ';', 'asm' or '__attribute__' before 'path_to_pps'
libole2/ms-ole.c:2838: error: expected '=', ',', ';', 'asm' or '__attribute__' before 'ms_ole_unlink'
libole2/ms-ole.c:2858: error: expected '=', ',', ';', 'asm' or '__attribute__' before 'ms_ole_directory'
libole2/ms-ole.c:2909: error: expected '=', ',', ';', 'asm' or '__attribute__' before 'ms_ole_stat'
libole2/ms-ole.c:2949: error: expected '=', ',', ';', 'asm' or '__attribute__' before 'ms_ole_stream_open'
libole2/ms-ole.c:3106: error: expected '=', ',', ';', 'asm' or '__attribute__' before 'ms_ole_stream_close'
making libole2 in libole2
make[1]: *** [libole2/ms-ole.o] Error 1
make[1]: *** Waiting for unfinished jobs....
make[2]: Entering directory `/usr/local/src/temp/abiword-2.4.6/wv/libole2'
gcc -I.. -I../../wv/libole2 -I../../wv/libole2/..   -I/usr/include/libpng12   -O2 -march=i486 -mtune=i686 -DHAVE_CONFIG_H -I/usr/include/glib-2.0 -I/usr/lib/glib-2.0/include    -c ../../wv/libole2/ms-ole.c 
gcc -I.. -I../../wv/libole2 -I../../wv/libole2/..   -I/usr/include/libpng12   -O2 -march=i486 -mtune=i686 -DHAVE_CONFIG_H -I/usr/include/glib-2.0 -I/usr/lib/glib-2.0/include    -c ../../wv/libole2/ms-ole-summary.c
In file included from libole2/ms-ole-summary.c:16:
libole2/ms-ole-summary.h:18:28: error: libole2/ms-ole.h: No such file or directory
In file included from libole2/ms-ole-summary.c:16:
libole2/ms-ole-summary.h:42: error: expected specifier-qualifier-list before 'MsOleStream'
libole2/ms-ole-summary.h:54: error: expected ')' before '*' token
libole2/ms-ole-summary.h:55: error: expected ')' before '*' token
libole2/ms-ole-summary.h:56: error: expected ')' before '*' token
libole2/ms-ole-summary.h:58: error: expected ')' before '*' token
libole2/ms-ole-summary.h:59: error: expected ')' before '*' token
libole2/ms-ole-summary.h:60: error: expected ')' before '*' token
libole2/ms-ole-summary.c: In function 'read_items':
libole2/ms-ole-summary.c:68: error: 'MsOleSummary' has no member named 's'
libole2/ms-ole-summary.c:68: error: 'MsOleSummary' has no member named 's'
libole2/ms-ole-summary.c:68: error: 'MsOleSeekSet' undeclared (first use in this function)
libole2/ms-ole-summary.c:68: error: (Each undeclared identifier is reported only once
libole2/ms-ole-summary.c:68: error: for each function it appears in.)
libole2/ms-ole-summary.c:69: error: 'MsOleSummary' has no member named 's'
libole2/ms-ole-summary.c:69: error: 'MsOleSummary' has no member named 's'
libole2/ms-ole-summary.c:80: error: 'MsOleSummary' has no member named 's'
libole2/ms-ole-summary.c:80: error: 'MsOleSummary' has no member named 's'
libole2/ms-ole-summary.c: In function 'write_items':
libole2/ms-ole-summary.c:105: error: 'MsOlePos' undeclared (first use in this function)
libole2/ms-ole-summary.c:105: error: expected ';' before 'cur_pos'
libole2/ms-ole-summary.c:106: error: expected ';' before 'pos'
libole2/ms-ole-summary.c:107: warning: ISO C90 forbids mixed declarations and code
libole2/ms-ole-summary.c:117: error: 'MsOleSummary' has no member named 's'
libole2/ms-ole-summary.c:117: error: 'MsOleSummary' has no member named 's'
libole2/ms-ole-summary.c:117: error: 'pos' undeclared (first use in this function)
libole2/ms-ole-summary.c:117: error: 'MsOleSeekSet' undeclared (first use in this function)
libole2/ms-ole-summary.c:135: error: 'MsOleSummary' has no member named 's'
libole2/ms-ole-summary.c:135: error: 'MsOleSummary' has no member named 's'
libole2/ms-ole-summary.c:151: error: 'MsOleSummary' has no member named 's'
libole2/ms-ole-summary.c:151: error: 'MsOleSummary' has no member named 's'
libole2/ms-ole-summary.c:154: error: 'MsOleSummary' has no member named 's'
libole2/ms-ole-summary.c:154: error: 'MsOleSummary' has no member named 's'
libole2/ms-ole-summary.c:160: error: 'cur_pos' undeclared (first use in this function)
libole2/ms-ole-summary.c:161: error: 'MsOleSummary' has no member named 's'
libole2/ms-ole-summary.c:161: error: 'MsOleSummary' has no member named 's'
libole2/ms-ole-summary.c:165: error: 'MsOleSummary' has no member named 's'
libole2/ms-ole-summary.c:165: error: 'MsOleSummary' has no member named 's'
libole2/ms-ole-summary.c:174: error: 'MsOleSummary' has no member named 's'
libole2/ms-ole-summary.c:174: error: 'MsOleSummary' has no member named 's'
libole2/ms-ole-summary.c:185: error: 'MsOleSummary' has no member named 's'
libole2/ms-ole-summary.c:185: error: 'MsOleSummary' has no member named 's'
libole2/ms-ole-summary.c: At top level:
libole2/ms-ole-summary.c:201: error: expected ')' before '*' token
libole2/ms-ole-summary.c:317: error: expected ')' before '*' token
libole2/ms-ole-summary.c:342: error: expected ')' before '*' token
libole2/ms-ole-summary.c:372: error: expected ')' before '*' token
libole2/ms-ole-summary.c:439: error: expected ')' before '*' token
libole2/ms-ole-summary.c:467: error: expected ')' before '*' token
libole2/ms-ole-summary.c: In function 'ms_ole_summary_close':
libole2/ms-ole-summary.c:524: error: 'MsOleSummary' has no member named 's'
libole2/ms-ole-summary.c:537: error: 'MsOleSummary' has no member named 's'
libole2/ms-ole-summary.c:538: error: 'MsOleSummary' has no member named 's'
libole2/ms-ole-summary.c:539: error: 'MsOleSummary' has no member named 's'
libole2/ms-ole-summary.c: In function 'seek_to_record':
libole2/ms-ole-summary.c:568: error: 'MsOleSummary' has no member named 'ps_id'
libole2/ms-ole-summary.c:570: error: 'MsOleSummary' has no member named 'ps_id'
libole2/ms-ole-summary.c:573: error: 'MsOleSummary' has no member named 's'
libole2/ms-ole-summary.c:573: error: 'MsOleSummary' has no member named 's'
libole2/ms-ole-summary.c:573: error: 'MsOleSeekSet' undeclared (first use in this function)
libole2/ms-ole-summary.c: In function 'ms_ole_summary_get_string':
libole2/ms-ole-summary.c:611: error: 'MsOleSummary' has no member named 's'
libole2/ms-ole-summary.c:611: error: 'MsOleSummary' has no member named 's'
libole2/ms-ole-summary.c:624: error: 'MsOleSummary' has no member named 's'
libole2/ms-ole-summary.c:624: error: 'MsOleSummary' has no member named 's'
libole2/ms-ole-summary.c: In function 'ms_ole_summary_get_short':
libole2/ms-ole-summary.c:664: error: 'MsOleSummary' has no member named 's'
libole2/ms-ole-summary.c:664: error: 'MsOleSummary' has no member named 's'
libole2/ms-ole-summary.c: In function 'ms_ole_summary_get_boolean':
libole2/ms-ole-summary.c:708: error: 'MsOleSummary' has no member named 's'
libole2/ms-ole-summary.c:708: error: 'MsOleSummary' has no member named 's'
libole2/ms-ole-summary.c: In function 'ms_ole_summary_get_long':
libole2/ms-ole-summary.c:751: error: 'MsOleSummary' has no member named 's'
libole2/ms-ole-summary.c:751: error: 'MsOleSummary' has no member named 's'
libole2/ms-ole-summary.c: In function 'ms_ole_summary_get_preview':
libole2/ms-ole-summary.c:1049: error: 'MsOleSummary' has no member named 's'
libole2/ms-ole-summary.c:1049: error: 'MsOleSummary' has no member named 's'
libole2/ms-ole-summary.c:1062: error: 'MsOleSummary' has no member named 's'
libole2/ms-ole-summary.c:1062: error: 'MsOleSummary' has no member named 's'
make[1]: *** [libole2/ms-ole-summary.o] Error 1
make[2]: Leaving directory `/usr/local/src/temp/abiword-2.4.6/wv/libole2'
make[1]: Leaving directory `/usr/local/src/temp/abiword-2.4.6/wv'
make: *** [wv] Error 2
bash-3.1#