$ make
g++ -c -O2 -I./src/include -I./src/parse/conf -I./src/parse/extract -I./src/parse/merge -I./src/parse/load_table -g -Wall src/splash_main.cpp -o src/obj/splash_main.o
g++ -c -O2 -I./src/include -I./src/parse/conf -I./src/parse/extract -I./src/parse/merge -I./src/parse/load_table -g -Wall src/splash_hasher.cpp -o src/obj/splash_hasher.o
g++ -c -O2 -I./src/include -I./src/parse/conf -I./src/parse/extract -I./src/parse/merge -I./src/parse/load_table -g -Wall src/splash_io_file_stat.cpp -o src/obj/splash_io_file_stat.o
g++ -c -O2 -I./src/include -I./src/parse/conf -I./src/parse/extract -I./src/parse/merge -I./src/parse/load_table -g -Wall src/splash_io_file_common.cpp -o src/obj/splash_io_file_common.o
g++ -c -O2 -I./src/include -I./src/parse/conf -I./src/parse/extract -I./src/parse/merge -I./src/parse/load_table -g -Wall src/splash_io_dir.cpp -o src/obj/splash_io_dir.o
g++ -c -O2 -I./src/include -I./src/parse/conf -I./src/parse/extract -I./src/parse/merge -I./src/parse/load_table -g -Wall src/splash_io_file.cpp -o src/obj/splash_io_file.o
g++ -c -O2 -I./src/include -I./src/parse/conf -I./src/parse/extract -I./src/parse/merge -I./src/parse/load_table -g -Wall src/config.cpp -o src/obj/config.o
bison -o src/parse/conf/conf_parser.cc src/parse/conf/conf_parser.yy
g++ -c -O2 -I./src/include -I./src/parse/conf -I./src/parse/extract -I./src/parse/merge -I./src/parse/load_table -g -Wall -o src/obj/conf_parser.o -c src/parse/conf/conf_parser.cc
flex++ -Cfe -osrc/parse/conf/conf_scanner.cc src/parse/conf/conf_scanner.ll
g++ -c -O2 -I./src/include -I./src/parse/conf -I./src/parse/extract -I./src/parse/merge -I./src/parse/load_table -g -Wall -o src/obj/conf_scanner.o -c src/parse/conf/conf_scanner.cc
src/parse/conf/conf_scanner.cc: In member function 'virtual conf::Parser::token::yytokentype conf::Scanner::lex(conf::Parser::semantic_type*, conf::location*)':
src/parse/conf/conf_scanner.cc:768: error: 'yy_buffer_stack' was not declared in this scope
src/parse/conf/conf_scanner.cc:768: error: 'yy_buffer_stack_top' was not declared in this scope
src/parse/conf/conf_scanner.cc:769: error: 'yyensure_buffer_stack' was not declared in this scope
src/parse/conf/conf_scanner.cc:919: error: 'yy_buffer_stack' was not declared in this scope
src/parse/conf/conf_scanner.cc:919: error: 'yy_buffer_stack_top' was not declared in this scope
src/parse/conf/conf_scanner.cc:942: error: 'yy_buffer_stack' was not declared in this scope
src/parse/conf/conf_scanner.cc:942: error: 'yy_buffer_stack_top' was not declared in this scope
src/parse/conf/conf_scanner.cc: In constructor 'ConfFlexLexer::ConfFlexLexer(std::istream*, std::ostream*)':
src/parse/conf/conf_scanner.cc:1064: error: 'yy_buffer_stack' was not declared in this scope
src/parse/conf/conf_scanner.cc:1065: error: 'yy_buffer_stack_top' was not declared in this scope
src/parse/conf/conf_scanner.cc:1066: error: 'yy_buffer_stack_max' was not declared in this scope
src/parse/conf/conf_scanner.cc: In member function 'virtual void ConfFlexLexer::switch_streams(std::istream*, std::ostream*)':
src/parse/conf/conf_scanner.cc:1076: error: 'yy_buffer_stack' was not declared in this scope
src/parse/conf/conf_scanner.cc:1076: error: 'yy_buffer_stack_top' was not declared in this scope
src/parse/conf/conf_scanner.cc: In member function 'int ConfFlexLexer::yy_get_next_buffer()':
src/parse/conf/conf_scanner.cc:1135: error: 'yy_buffer_stack' was not declared in this scope
src/parse/conf/conf_scanner.cc:1135: error: 'yy_buffer_stack_top' was not declared in this scope
src/parse/conf/conf_scanner.cc: In member function 'void ConfFlexLexer::yyunput(int, char*)':
src/parse/conf/conf_scanner.cc:1330: error: 'yy_buffer_stack' was not declared in this scope
src/parse/conf/conf_scanner.cc:1330: error: 'yy_buffer_stack_top' was not declared in this scope
src/parse/conf/conf_scanner.cc: In member function 'int ConfFlexLexer::yyinput()':
src/parse/conf/conf_scanner.cc:1378: error: 'yy_buffer_stack' was not declared in this scope
src/parse/conf/conf_scanner.cc:1378: error: 'yy_buffer_stack_top' was not declared in this scope
src/parse/conf/conf_scanner.cc: In member function 'virtual void ConfFlexLexer::yyrestart(std::istream*)':
src/parse/conf/conf_scanner.cc:1449: error: 'yy_buffer_stack' was not declared in this scope
src/parse/conf/conf_scanner.cc:1449: error: 'yy_buffer_stack_top' was not declared in this scope
src/parse/conf/conf_scanner.cc:1450: error: 'yyensure_buffer_stack' was not declared in this scope
src/parse/conf/conf_scanner.cc:1455: error: 'yy_buffer_stack' was not declared in this scope
src/parse/conf/conf_scanner.cc:1455: error: 'yy_buffer_stack_top' was not declared in this scope
src/parse/conf/conf_scanner.cc: In member function 'virtual void ConfFlexLexer::yy_switch_to_buffer(yy_buffer_state*)':
src/parse/conf/conf_scanner.cc:1475: error: 'yyensure_buffer_stack' was not declared in this scope
src/parse/conf/conf_scanner.cc:1476: error: 'yy_buffer_stack' was not declared in this scope
src/parse/conf/conf_scanner.cc:1476: error: 'yy_buffer_stack_top' was not declared in this scope
src/parse/conf/conf_scanner.cc:1479: error: 'yy_buffer_stack' was not declared in this scope
src/parse/conf/conf_scanner.cc:1479: error: 'yy_buffer_stack_top' was not declared in this scope
src/parse/conf/conf_scanner.cc:1487: error: 'yy_buffer_stack' was not declared in this scope
src/parse/conf/conf_scanner.cc:1487: error: 'yy_buffer_stack_top' was not declared in this scope
src/parse/conf/conf_scanner.cc: In member function 'void ConfFlexLexer::yy_load_buffer_state()':
src/parse/conf/conf_scanner.cc:1504: error: 'yy_buffer_stack' was not declared in this scope
src/parse/conf/conf_scanner.cc:1504: error: 'yy_buffer_stack_top' was not declared in this scope
src/parse/conf/conf_scanner.cc: In member function 'virtual void ConfFlexLexer::yy_delete_buffer(yy_buffer_state*)':
src/parse/conf/conf_scanner.cc:1558: error: 'yy_buffer_stack' was not declared in this scope
src/parse/conf/conf_scanner.cc:1558: error: 'yy_buffer_stack_top' was not declared in this scope
src/parse/conf/conf_scanner.cc: In member function 'void ConfFlexLexer::yy_init_buffer(yy_buffer_state*, std::istream*)':
src/parse/conf/conf_scanner.cc:1598: error: 'yy_buffer_stack' was not declared in this scope
src/parse/conf/conf_scanner.cc:1598: error: 'yy_buffer_stack_top' was not declared in this scope
src/parse/conf/conf_scanner.cc: In member function 'void ConfFlexLexer::yy_flush_buffer(yy_buffer_state*)':
src/parse/conf/conf_scanner.cc:1638: error: 'yy_buffer_stack' was not declared in this scope
src/parse/conf/conf_scanner.cc:1638: error: 'yy_buffer_stack_top' was not declared in this scope
src/parse/conf/conf_scanner.cc: At global scope:
src/parse/conf/conf_scanner.cc:1652: error: no 'void ConfFlexLexer::yypush_buffer_state(yy_buffer_state*)' member function declared in class 'ConfFlexLexer'
src/parse/conf/conf_scanner.cc: In member function 'void ConfFlexLexer::yypush_buffer_state(yy_buffer_state*)':
src/parse/conf/conf_scanner.cc:1658: error: 'yyensure_buffer_stack' was not declared in this scope
src/parse/conf/conf_scanner.cc:1661: error: 'yy_buffer_stack' was not declared in this scope
src/parse/conf/conf_scanner.cc:1661: error: 'yy_buffer_stack_top' was not declared in this scope
src/parse/conf/conf_scanner.cc:1670: error: 'yy_buffer_stack' was not declared in this scope
src/parse/conf/conf_scanner.cc:1670: error: 'yy_buffer_stack_top' was not declared in this scope
src/parse/conf/conf_scanner.cc:1672: error: 'yy_buffer_stack' was not declared in this scope
src/parse/conf/conf_scanner.cc:1672: error: 'yy_buffer_stack_top' was not declared in this scope
src/parse/conf/conf_scanner.cc: At global scope:
src/parse/conf/conf_scanner.cc:1688: error: no 'void ConfFlexLexer::yypop_buffer_state()' member function declared in class 'ConfFlexLexer'
src/parse/conf/conf_scanner.cc: In member function 'void ConfFlexLexer::yypop_buffer_state()':
src/parse/conf/conf_scanner.cc:1691: error: 'yy_buffer_stack' was not declared in this scope
src/parse/conf/conf_scanner.cc:1691: error: 'yy_buffer_stack_top' was not declared in this scope
src/parse/conf/conf_scanner.cc:1694: error: 'yy_buffer_stack' was not declared in this scope
src/parse/conf/conf_scanner.cc:1694: error: 'yy_buffer_stack_top' was not declared in this scope
src/parse/conf/conf_scanner.cc: At global scope:
src/parse/conf/conf_scanner.cc:1713: error: no 'void ConfFlexLexer::yyensure_buffer_stack()' member function declared in class 'ConfFlexLexer'
src/parse/conf/conf_scanner.cc: In member function 'void ConfFlexLexer::yyensure_buffer_stack()':
src/parse/conf/conf_scanner.cc:1718: error: 'yy_buffer_stack' was not declared in this scope
src/parse/conf/conf_scanner.cc:1731: error: 'yy_buffer_stack_max' was not declared in this scope
src/parse/conf/conf_scanner.cc:1732: error: 'yy_buffer_stack_top' was not declared in this scope
src/parse/conf/conf_scanner.cc:1736: error: 'yy_buffer_stack_top' was not declared in this scope
src/parse/conf/conf_scanner.cc:1736: error: 'yy_buffer_stack_max' was not declared in this scope
src/parse/conf/conf_scanner.cc:1742: error: 'yy_buffer_stack' was not declared in this scope
src/parse/conf/conf_scanner.cc: In destructor 'virtual ConfFlexLexer::~ConfFlexLexer()':
src/parse/conf/conf_scanner.cc:1870: error: 'yy_buffer_stack' was not declared in this scope
src/parse/conf/conf_scanner.cc:1870: error: 'yy_buffer_stack_top' was not declared in this scope
src/parse/conf/conf_scanner.cc:1877: error: 'yy_buffer_stack' was not declared in this scope
make: *** [src/obj/conf_scanner.o] Erreur 1