All pastes #719389 Raw Edit

Someone

public text v1 · immutable
#719389 ·published 2007-09-29 07:23 UTC
rendered paste body
[ 30%] Building CXX object soprano/soprano/CMakeFiles/soprano.dir/inference/inferenceruleparser.o
/usr/bin/c++   -DMAKE_SOPRANO_LIB   -Wnon-virtual-dtor -Wno-long-long -ansi -Wundef -Wcast-align -Wchar-subscripts -Wall -W -Wpointer-arith -Wformat-security -fno-check-new -fno-common -fPIC -I/home/kde-devel/qt-copy/include/QtCore -I/home/kde-devel/kde/src/kdesupport/soprano -I/home/kde-devel/kde/build/kdesupport/soprano/soprano -I/home/kde-devel/kde/src/kdesupport/soprano/soprano -I/home/kde-devel/kde/src/kdesupport/soprano/soprano/query -I/home/kde-devel/kde/src/kdesupport/soprano/soprano/vocabulary -I/home/kde-devel/qt-copy/include -I/home/kde-devel/kde/include   -o soprano/soprano/CMakeFiles/soprano.dir/inference/inferenceruleparser.o -c /home/kde-devel/kde/src/kdesupport/soprano/soprano/inference/inferenceruleparser.cpp
/home/kde-devel/kde/src/kdesupport/soprano/soprano/inference/inferencemodel.cpp: In member function ‘virtual Soprano::Error::ErrorCode Soprano::Inference::InferenceModel::addStatement(const Soprano::Statement&)’:
/home/kde-devel/kde/src/kdesupport/soprano/soprano/inference/inferencemodel.cpp:127: error: ‘ErrorNone’ is not a member of ‘Soprano::Error’
/home/kde-devel/kde/src/kdesupport/soprano/soprano/inference/inferencemodel.cpp: In member function ‘virtual Soprano::Error::ErrorCode Soprano::Inference::InferenceModel::removeAllStatements(const Soprano::Statement&)’:
/home/kde-devel/kde/src/kdesupport/soprano/soprano/inference/inferencemodel.cpp:149: error: ‘ErrorNone’ is not a member of ‘Soprano::Error’
/home/kde-devel/kde/src/kdesupport/soprano/soprano/inference/inferencemodel.cpp:155: error: ‘ErrorNone’ is not a member of ‘Soprano::Error’
/home/kde-devel/kde/src/kdesupport/soprano/soprano/inference/inferencemodel.cpp: In member function ‘virtual Soprano::Error::ErrorCode Soprano::Inference::InferenceModel::removeStatement(const Soprano::Statement&)’:
/home/kde-devel/kde/src/kdesupport/soprano/soprano/inference/inferencemodel.cpp:162: error: ‘ErrorNone’ is not a member of ‘Soprano::Error’
/home/kde-devel/kde/src/kdesupport/soprano/soprano/inference/inferencemodel.cpp:179: error: ‘ErrorNone’ is not a member of ‘Soprano::Error’
/home/kde-devel/kde/src/kdesupport/soprano/soprano/inference/inferencemodel.cpp:188: error: ‘ErrorNone’ is not a member of ‘Soprano::Error’
/home/kde-devel/kde/src/kdesupport/soprano/soprano/inference/inferencemodel.cpp:194: error: ‘ErrorNone’ is not a member of ‘Soprano::Error’
/home/kde-devel/kde/src/kdesupport/soprano/soprano/inference/inferencemodel.cpp:199: error: ‘ErrorNone’ is not a member of ‘Soprano::Error’
make[2]: *** [soprano/soprano/CMakeFiles/soprano.dir/inference/inferencemodel.o] Error 1
make[2]: *** Waiting for unfinished jobs....
/usr/bin/make -f soprano/test/CMakeFiles/multithreadingtest.dir/build.make soprano/test/CMakeFiles/multithreadingtest.dir/depend
make[2]: Entering directory `/home/kde-devel/kde/build/kdesupport'
/usr/bin/cmake -E cmake_progress_report /home/kde-devel/kde/build/kdesupport/CMakeFiles
[ 30%] Generating multithreadingtest.moc
cd /home/kde-devel/kde/build/kdesupport/soprano/test && /home/kde-devel/qt-copy/bin/moc -I /home/kde-devel/kde/src/kdesupport/soprano -I /home/kde-devel/kde/build/kdesupport/soprano -I /home/kde-devel/kde/src/kdesupport/soprano/data -I /home/kde-devel/kde/src/kdesupport/soprano/soprano -I /home/kde-devel/kde/src/kdesupport/soprano/soprano/query -I /home/kde-devel/kde/src/kdesupport/soprano/soprano/vocabulary -I /home/kde-devel/kde/build/kdesupport/soprano/soprano -I /home/kde-devel/qt-copy/include -I /home/kde-devel/qt-copy/include/Qt -I /home/kde-devel/qt-copy/mkspecs/default -I /home/kde-devel/qt-copy/include/QtCore -I /home/kde-devel/qt-copy/include/QtGui -I /home/kde-devel/qt-copy/include/Qt3Support -I /home/kde-devel/qt-copy/include/QtAssistant -I /home/kde-devel/qt-copy/include/QtDesigner -I /home/kde-devel/qt-copy/include/QtNetwork -I /home/kde-devel/qt-copy/include/QtOpenGL -I /home/kde-devel/qt-copy/include/QtSql -I /home/kde-devel/qt-copy/include/QtXml -I /home/kde-devel/qt-copy/include/QtSvg -I /home/kde-devel/qt-copy/include/QtScript -I /home/kde-devel/qt-copy/include/QtUiTools -I /home/kde-devel/qt-copy/include/QtTest -I /home/kde-devel/qt-copy/include/QtDBus -I /home/kde-devel/kde/build/kdesupport/soprano/test /home/kde-devel/kde/src/kdesupport/soprano/test/multithreadingtest.h -o /home/kde-devel/kde/build/kdesupport/soprano/test/multithreadingtest.moc
Scanning dependencies of target multithreadingtest
cd /home/kde-devel/kde/build/kdesupport && /usr/bin/cmake -E cmake_depends "Unix Makefiles" /home/kde-devel/kde/src/kdesupport /home/kde-devel/kde/src/kdesupport/soprano/test /home/kde-devel/kde/build/kdesupport /home/kde-devel/kde/build/kdesupport/soprano/test /home/kde-devel/kde/build/kdesupport/soprano/test/CMakeFiles/multithreadingtest.dir/DependInfo.cmake
make[2]: Leaving directory `/home/kde-devel/kde/build/kdesupport'
/usr/bin/make -f soprano/test/CMakeFiles/multithreadingtest.dir/build.make soprano/test/CMakeFiles/multithreadingtest.dir/build
make[2]: Entering directory `/home/kde-devel/kde/build/kdesupport'
/usr/bin/cmake -E cmake_progress_report /home/kde-devel/kde/build/kdesupport/CMakeFiles
[ 30%] Building CXX object soprano/test/CMakeFiles/multithreadingtest.dir/multithreadingtest.o
/usr/bin/c++   -Wnon-virtual-dtor -Wno-long-long -ansi -Wundef -Wcast-align -Wchar-subscripts -Wall -W -Wpointer-arith -Wformat-security -fno-check-new -fno-common -I/home/kde-devel/kde/src/kdesupport/soprano -I/home/kde-devel/kde/build/kdesupport/soprano -I/home/kde-devel/kde/src/kdesupport/soprano/data -I/home/kde-devel/kde/src/kdesupport/soprano/soprano -I/home/kde-devel/kde/src/kdesupport/soprano/soprano/query -I/home/kde-devel/kde/src/kdesupport/soprano/soprano/vocabulary -I/home/kde-devel/kde/build/kdesupport/soprano/soprano -I/home/kde-devel/qt-copy/include -I/home/kde-devel/qt-copy/include/Qt -I/home/kde-devel/qt-copy/mkspecs/default -I/home/kde-devel/qt-copy/include/QtCore -I/home/kde-devel/qt-copy/include/QtGui -I/home/kde-devel/qt-copy/include/Qt3Support -I/home/kde-devel/qt-copy/include/QtAssistant -I/home/kde-devel/qt-copy/include/QtDesigner -I/home/kde-devel/qt-copy/include/QtNetwork -I/home/kde-devel/qt-copy/include/QtOpenGL -I/home/kde-devel/qt-copy/include/QtSql -I/home/kde-devel/qt-copy/include/QtXml -I/home/kde-devel/qt-copy/include/QtSvg -I/home/kde-devel/qt-copy/include/QtScript -I/home/kde-devel/qt-copy/include/QtUiTools -I/home/kde-devel/qt-copy/include/QtTest -I/home/kde-devel/qt-copy/include/QtDBus -I/home/kde-devel/kde/build/kdesupport/soprano/test   -o soprano/test/CMakeFiles/multithreadingtest.dir/multithreadingtest.o -c /home/kde-devel/kde/src/kdesupport/soprano/test/multithreadingtest.cpp
make[2]: Leaving directory `/home/kde-devel/kde/build/kdesupport'
make[1]: *** [soprano/soprano/CMakeFiles/soprano.dir/all] Error 2
make[1]: *** Waiting for unfinished jobs....
Linking CXX static library libmultithreadingtest.a
cd /home/kde-devel/kde/build/kdesupport/soprano/test && /usr/bin/cmake -P CMakeFiles/multithreadingtest.dir/cmake_clean_target.cmake
cd /home/kde-devel/kde/build/kdesupport/soprano/test && /usr/bin/cmake -E cmake_link_script CMakeFiles/multithreadingtest.dir/link.txt --verbose=1
/usr/bin/ar cr libmultithreadingtest.a  "CMakeFiles/multithreadingtest.dir/multithreadingtest.o"
/usr/bin/ranlib libmultithreadingtest.a
make[2]: Leaving directory `/home/kde-devel/kde/build/kdesupport'
/usr/bin/cmake -E cmake_progress_report /home/kde-devel/kde/build/kdesupport/CMakeFiles
[ 30%] Built target multithreadingtest
make[1]: Leaving directory `/home/kde-devel/kde/build/kdesupport'
make: *** [all] Error 2
makeobj[0]: Leaving directory `/home/kde-devel/kde/build/kdesupport'