g++ -O2 -Wall -Wcast-align -Wconversion -Wpointer-arith -Wformat-security -Wmissing-format-attribute -W -MMD -I. -DEXV_LOCALEDIR=\"/usr/share/locale\" -DEXV_HAVE_XMP_TOOLKIT -DUNIX_ENV -I../XMP-SDK/public/include -c xmp.cpp -fPIC -DPIC -o .libs/xmp.o
xmp.cpp:48:20: warning: XMP.hpp: No such file or directory
xmp.cpp:49:25: warning: XMP.incl_cpp: No such file or directory
xmp.cpp:74: error: expected ',' or '...' before '&' token
xmp.cpp:74: error: ISO C++ forbids declaration of 'XMP_OptionBits' with no type
xmp.cpp:77: error: 'XMP_OptionBits' does not name a type
xmp.cpp:80: error: expected ',' or '...' before '&' token
xmp.cpp:80: error: ISO C++ forbids declaration of 'XMP_OptionBits' with no type
xmp.cpp:83: error: expected ',' or '...' before '&' token
xmp.cpp:83: error: ISO C++ forbids declaration of 'XMP_OptionBits' with no type
xmp.cpp:86: error: 'XMP_OptionBits' does not name a type
xmp.cpp: In static member function 'static bool Exiv2::XmpParser::initialize()':
xmp.cpp:372: error: 'SXMPMeta' has not been declared
xmp.cpp: In static member function 'static void Exiv2::XmpParser::terminate()':
xmp.cpp:384: error: 'SXMPMeta' has not been declared
xmp.cpp: In static member function 'static bool Exiv2::XmpParser::registerNs(const std::string&, const std::string&)':
xmp.cpp:395: error: 'SXMPMeta' has not been declared
xmp.cpp: In static member function 'static int Exiv2::XmpParser::decode(Exiv2::XmpData&, const std::string&)':
xmp.cpp:415: error: 'SXMPMeta' was not declared in this scope
xmp.cpp:415: error: expected `;' before 'meta'
xmp.cpp:416: error: 'SXMPIterator' was not declared in this scope
xmp.cpp:416: error: expected `;' before 'iter'
xmp.cpp:418: error: 'XMP_OptionBits' was not declared in this scope
xmp.cpp:418: error: expected `;' before 'opt'
xmp.cpp:419: error: 'iter' was not declared in this scope
xmp.cpp:419: error: 'opt' was not declared in this scope
xmp.cpp:423: error: 'XMP_PropIsAlias' was not declared in this scope
xmp.cpp:427: error: 'XMP_NodeIsSchema' was not declared in this scope
xmp.cpp:432: error: 'meta' was not declared in this scope
xmp.cpp:440: error: 'XMP_ArrayIsAltText' was not declared in this scope
xmp.cpp:443: error: 'XMP_Index' was not declared in this scope
xmp.cpp:443: error: expected `;' before 'count'
xmp.cpp:444: error: 'count' was not declared in this scope
xmp.cpp:451: error: 'XMP_PropIsSimple' was not declared in this scope
xmp.cpp:452: error: 'XMP_PropHasLang' was not declared in this scope
xmp.cpp:462: error: 'XMP_PropIsSimple' was not declared in this scope
xmp.cpp:463: error: 'XMP_PropIsQualifier' was not declared in this scope
xmp.cpp:472: error: 'XMP_PropIsArray' was not declared in this scope
xmp.cpp:473: error: 'XMP_PropHasQualifiers' was not declared in this scope
xmp.cpp:474: error: 'XMP_ArrayIsAltText' was not declared in this scope
xmp.cpp:477: error: expected `;' before 'aIter'
xmp.cpp:479: error: expected `;' before 'aOpt'
xmp.cpp:480: error: 'aIter' was not declared in this scope
xmp.cpp:480: error: 'aOpt' was not declared in this scope
xmp.cpp:482: error: 'XMP_PropIsSimple' was not declared in this scope
xmp.cpp:484: error: 'XMP_PropIsQualifier' was not declared in this scope
xmp.cpp:485: error: 'XMP_NodeIsSchema' was not declared in this scope
xmp.cpp:486: error: 'XMP_PropIsAlias' was not declared in this scope
xmp.cpp:494: error: 'XMP_Index' was not declared in this scope
xmp.cpp:494: error: expected `;' before 'count'
xmp.cpp:495: error: 'count' was not declared in this scope
xmp.cpp:507: error: 'XMP_PropIsStruct' was not declared in this scope
xmp.cpp:508: error: 'XMP_PropIsArray' was not declared in this scope
xmp.cpp:515: error: 'XMP_PropIsSimple' was not declared in this scope
xmp.cpp:516: error: 'XMP_PropIsQualifier' was not declared in this scope
xmp.cpp:527: error: ISO C++ forbids declaration of 'XMP_Error' with no type
xmp.cpp:527: error: expected `)' before '&' token
xmp.cpp:527: error: expected `{' before '&' token
xmp.cpp:527: error: 'e' was not declared in this scope
xmp.cpp:527: error: expected `;' before ')' token
xmp.cpp: In static member function 'static int Exiv2::XmpParser::encode(std::string&, const Exiv2::XmpData&)':
xmp.cpp:562: error: 'SXMPMeta' was not declared in this scope
xmp.cpp:562: error: expected `;' before 'meta'
xmp.cpp:565: error: 'XMP_OptionBits' was not declared in this scope
xmp.cpp:565: error: expected `;' before 'options'
xmp.cpp:578: error: 'meta' was not declared in this scope
xmp.cpp:578: error: 'kXMP_PropArrayIsAlternate' was not declared in this scope
xmp.cpp:580: error: 'kXMP_NS_XML' was not declared in this scope
xmp.cpp:587: error: 'meta' was not declared in this scope
xmp.cpp:587: error: 'kXMP_PropArrayIsAlternate' was not declared in this scope
xmp.cpp:589: error: 'kXMP_NS_XML' was not declared in this scope
xmp.cpp:596: error: 'options' was not declared in this scope
xmp.cpp:596: error: 'xmpOptionBits' was not declared in this scope
xmp.cpp:604: error: 'meta' was not declared in this scope
xmp.cpp:619: error: 'meta' was not declared in this scope
xmp.cpp:625: error: 'meta' was not declared in this scope
xmp.cpp:632: error: 'meta' was not declared in this scope
xmp.cpp:632: error: 'kXMP_UseCompactFormat' was not declared in this scope
xmp.cpp:636: error: ISO C++ forbids declaration of 'XMP_Error' with no type
xmp.cpp:636: error: expected `)' before '&' token
xmp.cpp:636: error: expected `{' before '&' token
xmp.cpp:636: error: 'e' was not declared in this scope
xmp.cpp:636: error: expected `;' before ')' token
xmp.cpp: At global scope:
xmp.cpp:671: error: expected ',' or '...' before '&' token
xmp.cpp:671: error: ISO C++ forbids declaration of 'XMP_OptionBits' with no type
xmp.cpp: In function 'Exiv2::XmpValue::XmpStruct<unnamed>::xmpStruct(int)':
xmp.cpp:674: error: 'opt' was not declared in this scope
xmp.cpp:674: error: 'XMP_PropIsStruct' was not declared in this scope
xmp.cpp: At global scope:
xmp.cpp:671: warning: unused parameter 'XMP_OptionBits'
xmp.cpp:680: error: 'XMP_OptionBits' does not name a type
xmp.cpp:693: error: expected ',' or '...' before '&' token
xmp.cpp:693: error: ISO C++ forbids declaration of 'XMP_OptionBits' with no type
xmp.cpp: In function 'Exiv2::TypeId<unnamed>::arrayValueTypeId(int)':
xmp.cpp:696: error: 'opt' was not declared in this scope
xmp.cpp:696: error: 'XMP_PropIsArray' was not declared in this scope
xmp.cpp:697: error: 'XMP_ArrayIsAlternate' was not declared in this scope
xmp.cpp:698: error: 'XMP_ArrayIsOrdered' was not declared in this scope
xmp.cpp:699: error: 'XMP_ArrayIsUnordered' was not declared in this scope
xmp.cpp: At global scope:
xmp.cpp:693: warning: unused parameter 'XMP_OptionBits'
xmp.cpp:704: error: expected ',' or '...' before '&' token
xmp.cpp:704: error: ISO C++ forbids declaration of 'XMP_OptionBits' with no type
xmp.cpp: In function 'Exiv2::XmpValue::XmpArrayType<unnamed>::xmpArrayType(int)':
xmp.cpp:706: error: 'opt' was not declared in this scope
xmp.cpp: At global scope:
xmp.cpp:704: warning: unused parameter 'XMP_OptionBits'
xmp.cpp:709: error: 'XMP_OptionBits' does not name a type
make[1]: *** [xmp.o] Error 1
make[1]: Leaving directory `/home/avp/soft/svn/exiv2/src'
make: *** [all] Error 2