All pastes #718682 Raw Edit

Someone

public text v1 · immutable
#718682 ·published 2007-09-28 16:47 UTC
rendered paste body
 i686-pc-linux-gnu-gcc -shared  .libs/tibetan-fc.o  -Wl,--rpath -Wl,/var/tmp/por
tage/x11-libs/pango-1.16.5/work/pango-1.16.5/pango/.libs -L/var/tmp/portage/x11-
libs/pango-1.16.5/work/pango-1.16.5/pango/.libs /usr/lib/libgobject-2.0.so -L/us
r/lib /usr/lib/libgmodule-2.0.so -ldl /usr/lib/libglib-2.0.so ../../pango/.libs/
libpango-1.0.so -L/usr/lib/gcc/i686-pc-linux-gnu/4.1.2/../../../ ../../pango/.li
bs/libpangoft2-1.0.so /usr/lib/libfontconfig.so /usr/lib/libfreetype.so -lz  -ma
rch=athlon64 -Wl,-soname -Wl,pango-tibetan-fc.so -Wl,-version-script -Wl,.libs/p
ango-tibetan-fc.ver -o .libs/pango-tibetan-fc.so
creating pango-tibetan-fc.la
(cd .libs && rm -f pango-tibetan-fc.la && ln -s ../pango-tibetan-fc.la pango-tib
etan-fc.la)
make[3]: Leaving directory `/var/tmp/portage/x11-libs/pango-1.16.5/work/pango-1.
16.5/modules/tibetan'
make[3]: Entering directory `/var/tmp/portage/x11-libs/pango-1.16.5/work/pango-1
.16.5/modules'
Writing a pango.modules file to use with tests/examples.
/var/tmp/portage/x11-libs/pango-1.16.5/work/pango-1.16.5/pango/.libs/lt-pango-qu
erymodules: error while loading shared libraries: libexpat.so.0: cannot open sha
red object file: No such file or directory
make[3]: *** [pango.modules] Error 127
make[3]: Leaving directory `/var/tmp/portage/x11-libs/pango-1.16.5/work/pango-1.
16.5/modules'
make[2]: *** [all-recursive] Error 1
make[2]: Leaving directory `/var/tmp/portage/x11-libs/pango-1.16.5/work/pango-1.
16.5/modules'
make[1]: *** [all-recursive] Error 1
make[1]: Leaving directory `/var/tmp/portage/x11-libs/pango-1.16.5/work/pango-1.
16.5'
make: *** [all] Error 2
 * 
 * ERROR: x11-libs/pango-1.16.5 failed.
 * Call stack:
 *   ebuild.sh, line 1654:   Called dyn_compile
 *   ebuild.sh, line 990:   Called qa_call 'src_compile'
 *   ebuild.sh, line 44:   Called src_compile
 *   ebuild.sh, line 1334:   Called gnome2_src_compile
 *   gnome2.eclass, line 71:   Called die
 * 
 * compile failure
 * If you need support, post the topmost build error, and the call stack if rele
vant.
 * A complete build log is located at '/var/tmp/portage/x11-libs/pango-1.16.5/te
mp/build.log'.
 * 

 * Messages for package x11-libs/pango-1.16.5:

 * 
 * ERROR: x11-libs/pango-1.16.5 failed.
 * Call stack:
 *   ebuild.sh, line 1654:   Called dyn_compile
 *   ebuild.sh, line 990:   Called qa_call 'src_compile'
 *   ebuild.sh, line 44:   Called src_compile
 *   ebuild.sh, line 1334:   Called gnome2_src_compile
 *   gnome2.eclass, line 71:   Called die
 * 
 * compile failure
 * If you need support, post the topmost build error, and the call stack if rele
vant.
 * A complete build log is located at '/var/tmp/portage/x11-libs/pango-1.16.5/te
mp/build.log'.
 * 
localhost brandon #