All pastes #717193 Raw Edit

Mine

public text v1 · immutable
#717193 ·published 2007-09-27 13:28 UTC
rendered paste body

configure: creating ./config.status
config.status: creating auto/config.mk
config.status: creating auto/config.h
+ make
mkdir objects
CC="gcc -Iproto -DHAVE_CONFIG_H -DFEAT_GUI_GTK  -I/usr/include/gtk-2.0 -I/usr/lib64/gtk-2.0/include -I/usr/include/atk-1.0 -I/usr/include/cairo -I/usr/include/pango-1.0 -I/usr/include/glib-2.0 -I/usr/lib64/glib-2.0/include -I/usr/include/freetype2 -I/usr/include/libpng12     -I/usr/include64   -D_REENTRANT -D_GNU_SOURCE   -I/usr/local/include -D_LARGEFILE_SOURCE -D_FILE_OFFSET_BITS=64 -I/usr/include/gdbm  -I/usr/lib64/perl5/5.8.8/x86_64-linux-thread-multi/CORE  -I/usr/include/python2.4 -pthread   " srcdir=. sh ./osdef.sh
osdef0.c:23:28: error: X11/Intrinsic.h: No such file or directory
gcc -c -I. -Iproto -DHAVE_CONFIG_H -DFEAT_GUI_GTK  -I/usr/include/gtk-2.0 -I/usr/lib64/gtk-2.0/include -I/usr/include/atk-1.0 -I/usr/include/cairo -I/usr/include/pango-1.0 -I/usr/include/glib-2.0 -I/usr/lib64/glib-2.0/include -I/usr/include/freetype2 -I/usr/include/libpng12     -O2 -g -pipe -Wall -Wp,-D_FORTIFY_SOURCE=2 -fexceptions -fstack-protector --param=ssp-buffer-size=4 -m64 -mtune=generic -D_GNU_SOURCE -D_FILE_OFFSET_BITS=64 -D_FORTIFY_SOURCE=2  -I/usr/include64   -D_REENTRANT -D_GNU_SOURCE   -I/usr/local/include -D_LARGEFILE_SOURCE -D_FILE_OFFSET_BITS=64 -I/usr/include/gdbm  -I/usr/lib64/perl5/5.8.8/x86_64-linux-thread-multi/CORE  -I/usr/include/python2.4 -pthread    -o objects/buffer.o buffer.c
In file included from structs.h:81,
                 from vim.h:1559,
                 from buffer.c:28:
gui.h:32:28: error: X11/Intrinsic.h: No such file or directory
In file included from buffer.c:28:
vim.h:1741: error: expected specifier-qualifier-list before 'Atom'
In file included from proto.h:157,
                 from vim.h:1775,
                 from buffer.c:28:
proto/ui.pro:49: error: expected ')' before '*' token
proto/ui.pro:50: error: expected ')' before 'myShell'
proto/ui.pro:51: error: expected ')' before 'myShell'
proto/ui.pro:52: error: expected ')' before 'myShell'
In file included from proto.h:202,
                 from vim.h:1775,
                 from buffer.c:28:
proto/gui_gtk_x11.pro:41: error: expected ')' before '*' token
proto/gui_gtk_x11.pro:42: error: expected '=', ',', ';', 'asm' or '__attribute__' before '*' token
In file included from proto.h:238,
                 from vim.h:1775,
                 from buffer.c:28:
proto/if_xcmdsrv.pro:2: error: expected ')' before '*' token
proto/if_xcmdsrv.pro:3: error: expected ')' before '*' token
proto/if_xcmdsrv.pro:4: error: expected ')' before '*' token
proto/if_xcmdsrv.pro:5: error: expected ')' before '*' token
proto/if_xcmdsrv.pro:6: error: expected '=', ',', ';', 'asm' or '__attribute__'before 'serverStrToWin'
proto/if_xcmdsrv.pro:8: error: expected ')' before '*' token
proto/if_xcmdsrv.pro:9: error: expected ')' before '*' token
proto/if_xcmdsrv.pro:10: error: expected ')' before '*' token
In file included from vim.h:1801,
                 from buffer.c:28:
globals.h:1248: error: expected '=', ',', ';', 'asm' or '__attribute__' before '*' token
globals.h:1251: error: expected '=', ',', ';', 'asm' or '__attribute__' before 'app_context'
globals.h:1267: error: expected '=', ',', ';', 'asm' or '__attribute__' before 'commWindow'
globals.h:1268: error: expected '=', ',', ';', 'asm' or '__attribute__' before 'clientWindow'
globals.h:1269: error: expected '=', ',', ';', 'asm' or '__attribute__' before 'commProperty'
make: *** [objects/buffer.o] Error 1
error: Bad exit status from /var/tmp/rpm-tmp.23826 (%build)


RPM build errors:
    user mockbuild does not exist - using root
    group mockbuild does not exist - using root
    user mockbuild does not exist - using root
    group mockbuild does not exist - using root
    user mockbuild does not exist - using root