All pastes #717062 Raw Edit

amule

public text v1 · immutable
#717062 ·published 2007-09-27 11:14 UTC
rendered paste body
make[3]: Entering directory `/home/pkgs/amule-cvs/src'
if g++ -DHAVE_CONFIG_H -I. -I. -I..    -I/usr/local/lib/wx/include/gtk2-unicode-release-2.8 -I/usr/local/include/wx-2.8 -D_FILE_OFFSET_BITS=64 -D_LARGE_FILES -D_LARGEFILE_SOURCE=1 -D__WXGTK__ -pthread -I./libs -DENABLE_UPNP=1 -DUSE_EMBEDDED_CRYPTO -W -Wall -Wshadow -Wundef -g -ggdb -fno-inline -D__DEBUG__ -fmessage-length=0 -D_GLIBCXX_DEBUG -D_GLIBCXX_DEBUG_PEDANTIC   -DUSE_WX_EXTENSIONS -MT libmuleappcore_a-AsyncDNS.o -MD -MP -MF ".deps/libmuleappcore_a-AsyncDNS.Tpo" -c -o libmuleappcore_a-AsyncDNS.o `test -f 'AsyncDNS.cpp' || echo './'`AsyncDNS.cpp; \
        then mv -f ".deps/libmuleappcore_a-AsyncDNS.Tpo" ".deps/libmuleappcore_a-AsyncDNS.Po"; else rm -f ".deps/libmuleappcore_a-AsyncDNS.Tpo"; exit 1; fi
In file included from /usr/local/include/wx-2.8/wx/event.h:21,
                 from InternalEvents.h:29,
                 from AsyncDNS.cpp:29:
/usr/local/include/wx-2.8/wx/gdicmn.h: In member function `bool wxRect::Inside(int, int) const':
/usr/local/include/wx-2.8/wx/gdicmn.h:486: warning: declaration of 'y' shadows a member of 'this'
/usr/local/include/wx-2.8/wx/gdicmn.h:486: warning: declaration of 'x' shadows a member of 'this'
if g++ -DHAVE_CONFIG_H -I. -I. -I..    -I/usr/local/lib/wx/include/gtk2-unicode-release-2.8 -I/usr/local/include/wx-2.8 -D_FILE_OFFSET_BITS=64 -D_LARGE_FILES -D_LARGEFILE_SOURCE=1 -D__WXGTK__ -pthread -I./libs -DENABLE_UPNP=1 -DUSE_EMBEDDED_CRYPTO -W -Wall -Wshadow -Wundef -g -ggdb -fno-inline -D__DEBUG__ -fmessage-length=0 -D_GLIBCXX_DEBUG -D_GLIBCXX_DEBUG_PEDANTIC   -DUSE_WX_EXTENSIONS -MT libmuleappcore_a-DeadSourceList.o -MD -MP -MF ".deps/libmuleappcore_a-DeadSourceList.Tpo" -c -o libmuleappcore_a-DeadSourceList.o `test -f 'DeadSourceList.cpp' || echo './'`DeadSourceList.cpp; \
        then mv -f ".deps/libmuleappcore_a-DeadSourceList.Tpo" ".deps/libmuleappcore_a-DeadSourceList.Po"; else rm -f ".deps/libmuleappcore_a-DeadSourceList.Tpo"; exit 1; fi
In file included from /usr/local/include/wx-2.8/wx/event.h:21,
                 from /usr/local/include/wx-2.8/wx/socket.h:23,
                 from /usr/local/include/wx-2.8/wx/protocol/protocol.h:24,
                 from /usr/local/include/wx-2.8/wx/url.h:20,
                 from ./libs/common/ConvAmule.h:31,
                 from ./libs/common/StringFunctions.h:35,
                 from MD4Hash.h:36,
                 from updownclient.h:30,
                 from DeadSourceList.cpp:30:
/usr/local/include/wx-2.8/wx/gdicmn.h: In member function `bool wxRect::Inside(int, int) const':
/usr/local/include/wx-2.8/wx/gdicmn.h:486: warning: declaration of 'y' shadows a member of 'this'
/usr/local/include/wx-2.8/wx/gdicmn.h:486: warning: declaration of 'x' shadows a member of 'this'
if g++ -DHAVE_CONFIG_H -I. -I. -I..    -I/usr/local/lib/wx/include/gtk2-unicode-release-2.8 -I/usr/local/include/wx-2.8 -D_FILE_OFFSET_BITS=64 -D_LARGE_FILES -D_LARGEFILE_SOURCE=1 -D__WXGTK__ -pthread -I./libs -DENABLE_UPNP=1 -DUSE_EMBEDDED_CRYPTO -W -Wall -Wshadow -Wundef -g -ggdb -fno-inline -D__DEBUG__ -fmessage-length=0 -D_GLIBCXX_DEBUG -D_GLIBCXX_DEBUG_PEDANTIC   -DUSE_WX_EXTENSIONS -MT libmuleappcore_a-Scanner.o -MD -MP -MF ".deps/libmuleappcore_a-Scanner.Tpo" -c -o libmuleappcore_a-Scanner.o `test -f 'Scanner.cpp' || echo './'`Scanner.cpp; \
        then mv -f ".deps/libmuleappcore_a-Scanner.Tpo" ".deps/libmuleappcore_a-Scanner.Po"; else rm -f ".deps/libmuleappcore_a-Scanner.Tpo"; exit 1; fi
In file included from /usr/local/include/wx-2.8/wx/event.h:21,
                 from /usr/local/include/wx-2.8/wx/socket.h:23,
                 from /usr/local/include/wx-2.8/wx/protocol/protocol.h:24,
                 from /usr/local/include/wx-2.8/wx/url.h:20,                 from ./libs/common/ConvAmule.h:31,
                 from ./libs/common/StringFunctions.h:35,
                 from MD4Hash.h:36,
                 from ED2KLink.h:30,
                 from ./Scanner.l:5:
/usr/local/include/wx-2.8/wx/gdicmn.h: In member function `bool wxRect::Inside(int, int) const':
/usr/local/include/wx-2.8/wx/gdicmn.h:486: warning: declaration of 'y' shadows a member of 'this'
/usr/local/include/wx-2.8/wx/gdicmn.h:486: warning: declaration of 'x' shadows a member of 'this'
Scanner.cpp:527:5: warning: "YY_STACK_USED" is not defined
Scanner.cpp:1461:5: warning: "YY_ALWAYS_INTERACTIVE" is not defined
Scanner.cpp:1755:5: warning: "YY_MAIN" is not defined
./Scanner.l: In function `void LexFree()':
./Scanner.l:191: error: `yylex_destroy' was not declared in this scope
./Scanner.l:205:5: warning: "YY_STACK_USED" is not defined
./Scanner.l:191: warning: unused variable 'yylex_destroy'
Scanner.cpp: At global scope:
Scanner.cpp:1659: warning: 'void yy_fatal_error(const char*)' defined but not used
make[3]: *** [libmuleappcore_a-Scanner.o] Error 1
make[3]: Leaving directory `/home/pkgs/amule-cvs/src'
make[2]: *** [all-recursive] Error 1
make[2]: Leaving directory `/home/pkgs/amule-cvs/src'
make[1]: *** [all-recursive] Error 1
make[1]: Leaving directory `/home/pkgs/amule-cvs'
make: *** [all] Error 2