rendered paste bodymake[5]: Entering directory `/home/chintu/src/svn/gnome/hal-0.5.9/hald/freebsd'
make[5]: Nothing to be done for `all-am'.
make[5]: Leaving directory `/home/chintu/src/svn/gnome/hal-0.5.9/hald/freebsd'
make[4]: Leaving directory `/home/chintu/src/svn/gnome/hal-0.5.9/hald/freebsd'
Making all in linux
make[4]: Entering directory `/home/chintu/src/svn/gnome/hal-0.5.9/hald/linux'
Making all in probing
make[5]: Entering directory `/home/chintu/src/svn/gnome/hal-0.5.9/hald/linux/probing'
gcc -DHAVE_CONFIG_H -I. -I../../.. -DPACKAGE_SYSCONF_DIR=\""/home/chintu/src/opt/gnome/etc"\" -DPACKAGE_DATA_DIR=\""/home/chintu/src/opt/gnome/share"\" -DPACKAGE_BIN_DIR=\""/home/chintu/src/opt/gnome/bin"\" -DPACKAGE_LOCALE_DIR=\""/home/chintu/src/opt/gnome/share/locale"\" -DPACKAGE_LOCALSTATEDIR=\""/home/chintu/src/opt/gnome/var"\" -I../../.. -I/home/chintu/src/opt/gnome/include/glib-2.0 -I/home/chintu/src/opt/gnome/lib/glib-2.0/include -I/home/chintu/src/opt/gnome/include/dbus-1.0 -I/home/chintu/src/opt/gnome/lib/dbus-1.0/include -I/home/chintu/src/opt/gnome/include/dbus-1.0 -I/home/chintu/src/opt/gnome/lib/dbus-1.0/include -I/home/chintu/src/opt/gnome/include -g -O2 -Wl,--allow-shlib-undefined -Wall -Wchar-subscripts -Wmissing-declarations -Wnested-externs -Wpointer-arith -Wcast-align -Wsign-compare -MT probe-input.o -MD -MP -MF .deps/probe-input.Tpo -c -o probe-input.o probe-input.c
probe-input.c: In function ‘main’:
probe-input.c:74: error: ‘SW_LID’ undeclared (first use in this function)
probe-input.c:74: error: (Each undeclared identifier is reported only once
probe-input.c:74: error: for each function it appears in.)
probe-input.c:76: error: ‘SW_TABLET_MODE’ undeclared (first use in this function)
probe-input.c:78: error: ‘SW_HEADPHONE_INSERT’ undeclared (first use in this function)
make[5]: *** [probe-input.o] Error 1
make[5]: Leaving directory `/home/chintu/src/svn/gnome/hal-0.5.9/hald/linux/probing'
make[4]: *** [all-recursive] Error 1
make[4]: Leaving directory `/home/chintu/src/svn/gnome/hal-0.5.9/hald/linux'
make[3]: *** [all-recursive] Error 1
make[3]: Leaving directory `/home/chintu/src/svn/gnome/hal-0.5.9/hald'
make[2]: *** [all] Error 2
make[2]: Leaving directory `/home/chintu/src/svn/gnome/hal-0.5.9/hald'
make[1]: *** [all-recursive] Error 1
make[1]: Leaving directory `/home/chintu/src/svn/gnome/hal-0.5.9'
make: *** [all] Error 2
*** error during stage build of hal: ########## Error running make *** [33/58]
[1] rerun stage build
[2] ignore error and continue to install
[3] give up on module
[4] start shell
choice: 4
exit shell to continue with build
chintu@linux-e8lx:~/src/svn/gnome/hal-0.5.9>