rendered paste body then mv -f ".deps/stdio.Tpo" ".deps/stdio.Po"; else rm -f ".deps/stdio.Tpo"; exit 1; fi
if ccache mipsel-linux-uclibc-gcc -DHAVE_CONFIG_H -I. -I. -I.. -I../include -I../include -I/home/ubuntu/openwrt/test/kamikaze_7.09_broadcom/staging_dir_mipsel/usr/include -I/home/ubuntu/openwrt/test/kamikaze_7.09_broadcom/staging_dir_mipsel/include -I/home/ubuntu/openwrt/test/kamikaze_7.09_broadcom/staging_dir_mipsel/usr/include -I/home/ubuntu/openwrt/test/kamikaze_7.09_broadcom/staging_dir_mipsel/include -I/home/ubuntu/openwrt/test/kamikaze_7.09_broadcom/staging_dir_mipsel/usr/include/uClibc++ -Os -pipe -mips32 -mtune=mips32 -funit-at-a-time -I/home/ubuntu/openwrt/test/kamikaze_7.09_broadcom/staging_dir_mipsel/usr/include -I/home/ubuntu/openwrt/test/kamikaze_7.09_broadcom/staging_dir_mipsel/include -MT tcp_window_size.o -MD -MP -MF ".deps/tcp_window_size.Tpo" -c -o tcp_window_size.o tcp_window_size.c; \
then mv -f ".deps/tcp_window_size.Tpo" ".deps/tcp_window_size.Po"; else rm -f ".deps/tcp_window_size.Tpo"; exit 1; fi
mipsel-linux-uclibc-g++ -fno-builtin -fno-rtti -nostdinc++ -L/home/ubuntu/openwrt/test/kamikaze_7.09_broadcom/staging_dir_mipsel/usr/lib -L/home/ubuntu/openwrt/test/kamikaze_7.09_broadcom/staging_dir_mipsel/lib -o iperf -Os -pipe -mips32 -mtune=mips32 -funit-at-a-time -I/home/ubuntu/openwrt/test/kamikaze_7.09_broadcom/staging_dir_mipsel/usr/include -I/home/ubuntu/openwrt/test/kamikaze_7.09_broadcom/staging_dir_mipsel/include -DHAVE_CONFIG_H Client.o Extractor.o Launch.o List.o Listener.o Locale.o PerfSocket.o ReportCSV.o ReportDefault.o Reporter.o Server.o Settings.o SocketAddr.o gnu_getopt.o gnu_getopt_long.o main.o service.o sockets.o stdio.o tcp_window_size.o ../compat/libcompat.a -nodefaultlibs -luClibc++ -lgcc
../compat/libcompat.a(Thread.o): In function `thread_start':
Thread.c:(.text+0x408): undefined reference to `pthread_create'
../compat/libcompat.a(Thread.o): In function `thread_run_wrapper':
Thread.c:(.text+0x570): undefined reference to `pthread_detach'
collect2: ld returned 1 exit status
make[5]: *** [iperf] Error 1
make[5]: Leaving directory `/home/ubuntu/openwrt/test/kamikaze_7.09_broadcom/build_mipsel/iperf-2.0.2/src'
make[4]: *** [all-recursive] Error 1
make[4]: Leaving directory `/home/ubuntu/openwrt/test/kamikaze_7.09_broadcom/build_mipsel/iperf-2.0.2'
make[3]: *** [all] Error 2
make[3]: Leaving directory `/home/ubuntu/openwrt/test/kamikaze_7.09_broadcom/build_mipsel/iperf-2.0.2'
make[2]: *** [/home/ubuntu/openwrt/test/kamikaze_7.09_broadcom/build_mipsel/iperf-2.0.2/.built-with-multithreads] Error 2
make[2]: Leaving directory `/home/ubuntu/openwrt/test/kamikaze_7.09_broadcom/feeds/packages/net/iperf'
*** iperf compile failed
make[1]: *** [iperf-compile] Error 1
make[1]: Leaving directory `/home/ubuntu/openwrt/test/kamikaze_7.09_broadcom/package'
Build failed. Please re-run make with V=99 to see what's going on
make: *** [package/iperf-compile] Fehler 1