All pastes #715560 Raw Edit

sss

public text v1 · immutable
#715560 ·published 2007-09-26 12:16 UTC
rendered paste body
maciek@MCX:~$ cd '/home/maciek/Desktop/eth1.4.1' 
maciek@MCX:~/Desktop/eth1.4.1$ make clean
rm -rf libETH.so aimbot.o backtrace.o commands.o drawtools.o engine.o eth.o g_functions.o hook.o hud.o medias.o medicbot.o menu.o net.o punkbuster.o spycam.o visuals.o windows.o tracer.o ghf eth.pk3 sdk \
         pk3/scripts/eth.shader shaders.h q_math.o private.o
maciek@MCX:~/Desktop/eth1.4.1$ make
mkdir sdk
/bin/sh et-linux-2.60-sdk.x86.run --tar xfC sdk
find sdk -not -name "q_math.c" -not -iname "*.h" -exec rm -f {} \; 2> /dev/null || /bin/true
find sdk -type d -exec rmdir -p {} \; 2> /dev/null || /bin/true
rm -rf sdk/src/botai
sed -i -e "s/Window/eth_Window/" sdk/src/ui/ui_shared.h
sed -i -e "s/DT_NUM/eth_DT_NUM/" sdk/src/game/q_shared.h
sed -i -e "s/EV_NONE/eth_EV_NONE/" sdk/src/game/bg_public.h
tar xzf ghf-0.5-2.tar.gz
make -C ghf clean all 
make[1]: Entering directory `/home/maciek/Desktop/eth1.4.1/ghf'
rm -rf  asm.o  elf.o  utils.o  vfunction.o libghf.a ghf-test.o ghf-test ghf-0.5-2.tar.gz ghf
cc -Wall -pipe -march=i686 -I/usr/include/libelf   -ggdb -c -o asm.o asm.c
cc -Wall -pipe -march=i686 -I/usr/include/libelf   -ggdb -c -o elf.o elf.c
cc -Wall -pipe -march=i686 -I/usr/include/libelf   -ggdb -c -o utils.o utils.c
g++ -Wall -pipe -march=i686 -I/usr/include/libelf   -ggdb -c -o vfunction.o vfunction.cpp
ar r libghf.a  asm.o  elf.o  utils.o  vfunction.o
ar: creating libghf.a
ranlib libghf.a
g++ -Wall -pipe -march=i686 -I/usr/include/libelf   -ggdb -c -o ghf-test.o ghf-test.cpp
cc ghf-test.o -o ghf-test -lz -ldl -L. -lghf -lstdc++ -lelf -lbfd -lopcodes -lcppunit
....

OK (4)
make[1]: Leaving directory `/home/maciek/Desktop/eth1.4.1/ghf'
/bin/sh makeshaders.sh
cd pk3 && zip -q9r ../eth.pk3 . -x '*.svn*' 
cc -Wall -fPIC -march=i686 -fno-strict-aliasing -fvisibility=hidden -g -ggdb3 -DETH_DEBUG -I/usr/include/libelf   -DETH_PK3_FILE=\"eth.pk3\" -DETH_VERSION=\"1.4.1\"  -c -o aimbot.o aimbot.c
aimbot.c: In function ‘doAutoShoot’:
aimbot.c:233: warning: implicit declaration of function ‘timenudge’
aimbot.c: At top level:
aimbot.c:856: error: redefinition of ‘doSatchelAutoShoot’
aimbot.c:250: error: previous definition of ‘doSatchelAutoShoot’ was here
aimbot.c:889: error: redefinition of ‘findTarget’
aimbot.c:283: error: previous definition of ‘findTarget’ was here
aimbot.c:1030: error: redefinition of ‘blockMouse’
aimbot.c:424: error: previous definition of ‘blockMouse’ was here
aimbot.c:1060: error: redefinition of ‘doAimbot’
aimbot.c:454: error: previous definition of ‘doAimbot’ was here
aimbot.c: In function ‘doAimbot’:
aimbot.c:1061: warning: unused variable ‘lastStime’
aimbot.c: At top level:
aimbot.c:1281: error: redefinition of ‘doVecZ’
aimbot.c:674: error: previous definition of ‘doVecZ’ was here
aimbot.c:1350:1: warning: "NEAR_TARGET_VECZ" redefined
aimbot.c:738:1: warning: this is the location of the previous definition
aimbot.c:1377: error: redefinition of ‘doPrediction’
aimbot.c:765: error: previous definition of ‘doPrediction’ was here
aimbot.c:1414: error: redefinition of ‘doPredictionStats’
aimbot.c:802: error: previous definition of ‘doPredictionStats’ was here
make: *** [aimbot.o] Error 1
maciek@MCX:~/Desktop/eth1.4.1$