float src # FEATURES="-*" emerge splashutils
Calculating dependencies... done!
>>> Emerging (1 of 1) media-gfx/splashutils-1.1.9.10-r1 to /
* Determining the location of the kernel source code
* Found kernel source directory:
* /usr/src/linux
* Found sources for kernel version:
* 2.6.17-no1
>>> Unpacking source...
>>> Unpacking splashutils-lite-1.1.9.10.tar.bz2 to /var/tmp/portage/splashutils-1.1.9.10-r1/work
bzip2: /var/tmp/portage/splashutils-1.1.9.10-r1/distdir/splashutils-lite-1.1.9.10.tar.bz2: trailing garbage after EOF ignored
>>> Unpacking splashutils-gentoo-0.1.14.tar.bz2 to /var/tmp/portage/splashutils-1.1.9.10-r1/work
>>> Unpacking miscsplashutils-0.1.3.tar.bz2 to /var/tmp/portage/splashutils-1.1.9.10-r1/work
>>> Unpacking libpng-1.2.8.tar.bz2 to /var/tmp/portage/splashutils-1.1.9.10-r1/work
>>> Unpacking jpegsrc.v6b.tar.gz to /var/tmp/portage/splashutils-1.1.9.10-r1/work
>>> Unpacking freetype-2.1.9.tar.bz2 to /var/tmp/portage/splashutils-1.1.9.10-r1/work
>>> Unpacking zlib-1.2.3.tar.bz2 to /var/tmp/portage/splashutils-1.1.9.10-r1/work
* Applying splashutils-depscan.patch ... [ ok ]
* Applying splashutils-1.1.9.10-ppc-2.6.14.patch ... [ ok ]
* Applying splashutils-1.1.9.10-makefile.patch ... [ ok ]
>>> Source unpacked.
>>> Compiling source in /var/tmp/portage/splashutils-1.1.9.10-r1/work/splashutils-1.1.9.10 ...
cc -O2 fbres.c -o fbres
strip fbres
make[1]: Entering directory `/var/tmp/portage/splashutils-1.1.9.10-r1/work/miscsplashutils-0.1.3/fbtruetype'
gcc -O2 -Wall -I/usr/include/freetype2 -c -o fbtruetype.o fbtruetype.c
gcc -O2 -Wall -I/usr/include/freetype2 -c -o messages.o messages.c
gcc -O2 -Wall -I/usr/include/freetype2 -c -o console.o console.c
gcc -O2 -Wall -I/usr/include/freetype2 -c -o ttf.o ttf.c
gcc -O2 -Wall -I/usr/include/freetype2 -c -o luxisri.o luxisri.c
fbtruetype.c:39: warning: pointer targets in initialization differ in signedness
fbtruetype.c: In function 'main':
fbtruetype.c:105: warning: pointer targets in assignment differ in signedness
fbtruetype.c:143: warning: pointer targets in passing argument 2 of 'rendertext' differ in signedness
ttf.c: In function 'rendertext':
ttf.c:799: warning: pointer targets in assignment differ in signedness
gcc -O2 -Wall -I/usr/include/freetype2 -L/usr/lib -o fbtruetype -L/usr/lib fbtruetype.o messages.o console.o ttf.o luxisri.o -lfreetype -lm
gcc -O2 -Wall -I/usr/include/freetype2 -L/usr/lib -static -o fbtruetype.static -L/usr/lib fbtruetype.o messages.o console.o ttf.o luxisri.o /usr/lib/libfreetype.a /usr/lib/libz.a -lm
strip -s fbtruetype fbtruetype.static
make[1]: Leaving directory `/var/tmp/portage/splashutils-1.1.9.10-r1/work/miscsplashutils-0.1.3/fbtruetype'
make[1]: Entering directory `/var/tmp/portage/splashutils-1.1.9.10-r1/work/miscsplashutils-0.1.3/kbd'
cc -O2 -march=athlon-xp -pipe -fomit-frame-pointer -c -o fgconsole.o fgconsole.c
cc -O2 -march=athlon-xp -pipe -fomit-frame-pointer -c -o getfd.o getfd.c
cc -O2 -march=athlon-xp -pipe -fomit-frame-pointer fgconsole.o getfd.o -o fgconsole
make[1]: Leaving directory `/var/tmp/portage/splashutils-1.1.9.10-r1/work/miscsplashutils-0.1.3/kbd'
CONF libjpeg
MAKE libjpeg
CONF freetype2
MAKE freetype2
CONF zlib
MAKE zlib
CONF libpng
MAKE libpng
CC kernel/kernel.o
In file included from /usr/lib/klibc/include/linux/device.h:14,
from /usr/lib/klibc/include/linux/backlight.h:11,
from /usr/lib/klibc/include/linux/fb.h:4,
from kernel.c:16:
/usr/lib/klibc/include/linux/ioport.h:18: error: expected specifier-qualifier-list before 'resource_size_t'
/usr/lib/klibc/include/linux/ioport.h:101: error: expected declaration specifiers or '...' before 'resource_size_t'
/usr/lib/klibc/include/linux/ioport.h:101: error: expected declaration specifiers or '...' before 'resource_size_t'
/usr/lib/klibc/include/linux/ioport.h:102: error: expected declaration specifiers or '...' before 'resource_size_t'
/usr/lib/klibc/include/linux/ioport.h:102: error: expected declaration specifiers or '...' before 'resource_size_t'
/usr/lib/klibc/include/linux/ioport.h:104: error: expected declaration specifiers or '...' before 'resource_size_t'
/usr/lib/klibc/include/linux/ioport.h:104: error: expected declaration specifiers or '...' before 'resource_size_t'
/usr/lib/klibc/include/linux/ioport.h:106: error: expected declaration specifiers or '...' before 'resource_size_t'
/usr/lib/klibc/include/linux/ioport.h:107: error: expected declaration specifiers or '...' before 'resource_size_t'
/usr/lib/klibc/include/linux/ioport.h:118: error: expected declaration specifiers or '...' before 'resource_size_t'
/usr/lib/klibc/include/linux/ioport.h:119: error: expected declaration specifiers or '...' before 'resource_size_t'
/usr/lib/klibc/include/linux/ioport.h:126: error: expected declaration specifiers or '...' before 'resource_size_t'
/usr/lib/klibc/include/linux/ioport.h:126: error: expected declaration specifiers or '...' before 'resource_size_t'
/usr/lib/klibc/include/linux/ioport.h:127: error: expected declaration specifiers or '...' before 'resource_size_t'
/usr/lib/klibc/include/linux/ioport.h:128: error: expected declaration specifiers or '...' before 'resource_size_t'
/usr/lib/klibc/include/linux/ioport.h:130: error: expected '=', ',', ';', 'asm' or '__attribute__' before 'check_region'
In file included from /usr/lib/klibc/include/linux/bitops.h:9,
from /usr/lib/klibc/include/linux/thread_info.h:20,
from /usr/lib/klibc/include/linux/preempt.h:9,
from /usr/lib/klibc/include/linux/spinlock.h:49,
from /usr/lib/klibc/include/linux/klist.h:15,
from /usr/lib/klibc/include/linux/device.h:16,
from /usr/lib/klibc/include/linux/backlight.h:11,
from /usr/lib/klibc/include/linux/fb.h:4,
from kernel.c:16:
/usr/lib/klibc/include/asm/bitops.h:244: error: expected '=', ',', ';', 'asm' or '__attribute__' before 'int'
In file included from /usr/lib/klibc/include/linux/spinlock.h:56,
from /usr/lib/klibc/include/linux/klist.h:15,
from /usr/lib/klibc/include/linux/device.h:16,
from /usr/lib/klibc/include/linux/backlight.h:11,
from /usr/lib/klibc/include/linux/fb.h:4,
from kernel.c:16:
/usr/lib/klibc/include/asm/system.h:301: error: expected declaration specifiers or '...' before 'u8'
/usr/lib/klibc/include/asm/system.h:301: error: expected declaration specifiers or '...' before 'u8'
/usr/lib/klibc/include/asm/system.h:302: error: expected declaration specifiers or '...' before 'u16'
/usr/lib/klibc/include/asm/system.h:302: error: expected declaration specifiers or '...' before 'u16'
/usr/lib/klibc/include/asm/system.h:303: error: expected declaration specifiers or '...' before 'u32'
/usr/lib/klibc/include/asm/system.h:303: error: expected declaration specifiers or '...' before 'u32'
/usr/lib/klibc/include/asm/system.h: In function 'cmpxchg_386':
/usr/lib/klibc/include/asm/system.h:310: error: too many arguments to function 'cmpxchg_386_u8'
/usr/lib/klibc/include/asm/system.h:312: error: too many arguments to function 'cmpxchg_386_u16'
/usr/lib/klibc/include/asm/system.h:314: error: too many arguments to function 'cmpxchg_386_u32'
In file included from /usr/lib/klibc/include/asm/processor.h:22,
from /usr/lib/klibc/include/asm/atomic.h:5,
from /usr/lib/klibc/include/linux/spinlock.h:282,
from /usr/lib/klibc/include/linux/klist.h:15,
from /usr/lib/klibc/include/linux/device.h:16,
from /usr/lib/klibc/include/linux/backlight.h:11,
from /usr/lib/klibc/include/linux/fb.h:4,
from kernel.c:16:
/usr/lib/klibc/include/linux/cpumask.h: At top level:
/usr/lib/klibc/include/linux/cpumask.h:88: error: expected specifier-qualifier-list before 'DECLARE_BITMAP'
/usr/lib/klibc/include/linux/cpumask.h: In function '__cpu_set':
/usr/lib/klibc/include/linux/cpumask.h:94: error: 'cpumask_t' has no member named 'bits'
/usr/lib/klibc/include/linux/cpumask.h: In function '__cpu_clear':
/usr/lib/klibc/include/linux/cpumask.h:100: error: 'cpumask_t' has no member named 'bits'
/usr/lib/klibc/include/linux/cpumask.h: In function '__cpus_setall':
/usr/lib/klibc/include/linux/cpumask.h:106: error: 'cpumask_t' has no member named 'bits'
/usr/lib/klibc/include/linux/cpumask.h: In function '__cpus_clear':
/usr/lib/klibc/include/linux/cpumask.h:112: error: 'cpumask_t' has no member named 'bits'
/usr/lib/klibc/include/linux/cpumask.h: In function '__cpu_test_and_set':
/usr/lib/klibc/include/linux/cpumask.h:121: error: 'cpumask_t' has no member named 'bits'
/usr/lib/klibc/include/linux/cpumask.h: In function '__cpus_and':
/usr/lib/klibc/include/linux/cpumask.h:128: error: 'cpumask_t' has no member named 'bits'
/usr/lib/klibc/include/linux/cpumask.h:128: error: 'cpumask_t' has no member named 'bits'
/usr/lib/klibc/include/linux/cpumask.h:128: error: 'cpumask_t' has no member named 'bits'
/usr/lib/klibc/include/linux/cpumask.h: In function '__cpus_or':
/usr/lib/klibc/include/linux/cpumask.h:135: error: 'cpumask_t' has no member named 'bits'
/usr/lib/klibc/include/linux/cpumask.h:135: error: 'cpumask_t' has no member named 'bits'
/usr/lib/klibc/include/linux/cpumask.h:135: error: 'cpumask_t' has no member named 'bits'
/usr/lib/klibc/include/linux/cpumask.h: In function '__cpus_xor':
/usr/lib/klibc/include/linux/cpumask.h:142: error: 'cpumask_t' has no member named 'bits'
/usr/lib/klibc/include/linux/cpumask.h:142: error: 'cpumask_t' has no member named 'bits'
/usr/lib/klibc/include/linux/cpumask.h:142: error: 'cpumask_t' has no member named 'bits'
/usr/lib/klibc/include/linux/cpumask.h: In function '__cpus_andnot':
/usr/lib/klibc/include/linux/cpumask.h:150: error: 'cpumask_t' has no member named 'bits'
/usr/lib/klibc/include/linux/cpumask.h:150: error: 'cpumask_t' has no member named 'bits'
/usr/lib/klibc/include/linux/cpumask.h:150: error: 'cpumask_t' has no member named 'bits'
/usr/lib/klibc/include/linux/cpumask.h: In function '__cpus_complement':
/usr/lib/klibc/include/linux/cpumask.h:157: error: 'cpumask_t' has no member named 'bits'
/usr/lib/klibc/include/linux/cpumask.h:157: error: 'cpumask_t' has no member named 'bits'
/usr/lib/klibc/include/linux/cpumask.h: In function '__cpus_equal':
/usr/lib/klibc/include/linux/cpumask.h:164: error: 'cpumask_t' has no member named 'bits'
/usr/lib/klibc/include/linux/cpumask.h:164: error: 'cpumask_t' has no member named 'bits'
/usr/lib/klibc/include/linux/cpumask.h: In function '__cpus_intersects':
/usr/lib/klibc/include/linux/cpumask.h:171: error: 'cpumask_t' has no member named 'bits'
/usr/lib/klibc/include/linux/cpumask.h:171: error: 'cpumask_t' has no member named 'bits'
/usr/lib/klibc/include/linux/cpumask.h: In function '__cpus_subset':
/usr/lib/klibc/include/linux/cpumask.h:178: error: 'cpumask_t' has no member named 'bits'
/usr/lib/klibc/include/linux/cpumask.h:178: error: 'cpumask_t' has no member named 'bits'
/usr/lib/klibc/include/linux/cpumask.h: In function '__cpus_empty':
/usr/lib/klibc/include/linux/cpumask.h:184: error: 'cpumask_t' has no member named 'bits'
/usr/lib/klibc/include/linux/cpumask.h: In function '__cpus_full':
/usr/lib/klibc/include/linux/cpumask.h:190: error: 'cpumask_t' has no member named 'bits'
/usr/lib/klibc/include/linux/cpumask.h: In function '__cpus_weight':
/usr/lib/klibc/include/linux/cpumask.h:196: error: 'cpumask_t' has no member named 'bits'
/usr/lib/klibc/include/linux/cpumask.h: In function '__cpus_shift_right':
/usr/lib/klibc/include/linux/cpumask.h:204: error: 'cpumask_t' has no member named 'bits'
/usr/lib/klibc/include/linux/cpumask.h:204: error: 'cpumask_t' has no member named 'bits'
/usr/lib/klibc/include/linux/cpumask.h: In function '__cpus_shift_left':
/usr/lib/klibc/include/linux/cpumask.h:212: error: 'cpumask_t' has no member named 'bits'
/usr/lib/klibc/include/linux/cpumask.h:212: error: 'cpumask_t' has no member named 'bits'
/usr/lib/klibc/include/linux/cpumask.h: In function '__cpumask_scnprintf':
/usr/lib/klibc/include/linux/cpumask.h:273: error: 'cpumask_t' has no member named 'bits'
/usr/lib/klibc/include/linux/cpumask.h: In function '__cpumask_parse':
/usr/lib/klibc/include/linux/cpumask.h:281: error: 'cpumask_t' has no member named 'bits'
/usr/lib/klibc/include/linux/cpumask.h: In function '__cpulist_scnprintf':
/usr/lib/klibc/include/linux/cpumask.h:289: error: 'cpumask_t' has no member named 'bits'
/usr/lib/klibc/include/linux/cpumask.h: In function '__cpulist_parse':
/usr/lib/klibc/include/linux/cpumask.h:295: error: 'cpumask_t' has no member named 'bits'
/usr/lib/klibc/include/linux/cpumask.h: In function '__cpu_remap':
/usr/lib/klibc/include/linux/cpumask.h:303: error: 'cpumask_t' has no member named 'bits'
/usr/lib/klibc/include/linux/cpumask.h:303: error: 'cpumask_t' has no member named 'bits'
/usr/lib/klibc/include/linux/cpumask.h: In function '__cpus_remap':
/usr/lib/klibc/include/linux/cpumask.h:311: error: 'cpumask_t' has no member named 'bits'
/usr/lib/klibc/include/linux/cpumask.h:311: error: 'cpumask_t' has no member named 'bits'
/usr/lib/klibc/include/linux/cpumask.h:311: error: 'cpumask_t' has no member named 'bits'
/usr/lib/klibc/include/linux/cpumask.h:311: error: 'cpumask_t' has no member named 'bits'
In file included from /usr/lib/klibc/include/asm/atomic.h:5,
from /usr/lib/klibc/include/linux/spinlock.h:282,
from /usr/lib/klibc/include/linux/klist.h:15,
from /usr/lib/klibc/include/linux/device.h:16,
from /usr/lib/klibc/include/linux/backlight.h:11,
from /usr/lib/klibc/include/linux/fb.h:4,
from kernel.c:16:
/usr/lib/klibc/include/asm/processor.h: At top level:
/usr/lib/klibc/include/asm/processor.h:80: error: 'CONFIG_X86_L1_CACHE_SHIFT' undeclared here (not in a function)
/usr/lib/klibc/include/asm/processor.h:80: error: requested alignment is not a constant
In file included from /usr/lib/klibc/include/linux/klist.h:16,
from /usr/lib/klibc/include/linux/device.h:16,
from /usr/lib/klibc/include/linux/backlight.h:11,
from /usr/lib/klibc/include/linux/fb.h:4,
from kernel.c:16:
/usr/lib/klibc/include/linux/completion.h:15: error: expected specifier-qualifier-list before 'wait_queue_head_t'
In file included from /usr/lib/klibc/include/linux/device.h:16,
from /usr/lib/klibc/include/linux/backlight.h:11,
from /usr/lib/klibc/include/linux/fb.h:4,
from kernel.c:16:
/usr/lib/klibc/include/linux/klist.h:23: error: field 'k_list' has incomplete type
/usr/lib/klibc/include/linux/klist.h:34: error: field 'n_node' has incomplete type
/usr/lib/klibc/include/linux/klist.h:35: error: field 'n_ref' has incomplete type
In file included from /usr/lib/klibc/include/asm/desc.h:13,
from /usr/lib/klibc/include/asm/elf.h:13,
from /usr/lib/klibc/include/linux/elf.h:7,
from /usr/lib/klibc/include/linux/module.h:16,
from /usr/lib/klibc/include/linux/device.h:19,
from /usr/lib/klibc/include/linux/backlight.h:11,
from /usr/lib/klibc/include/linux/fb.h:4,
from kernel.c:16:
/usr/lib/klibc/include/linux/percpu.h: In function '__alloc_percpu':
/usr/lib/klibc/include/linux/percpu.h:44: error: 'GFP_KERNEL' undeclared (first use in this function)
/usr/lib/klibc/include/linux/percpu.h:44: error: (Each undeclared identifier is reported only once
/usr/lib/klibc/include/linux/percpu.h:44: error: for each function it appears in.)
In file included from /usr/lib/klibc/include/asm/desc.h:15,
from /usr/lib/klibc/include/asm/elf.h:13,
from /usr/lib/klibc/include/linux/elf.h:7,
from /usr/lib/klibc/include/linux/module.h:16,
from /usr/lib/klibc/include/linux/device.h:19,
from /usr/lib/klibc/include/linux/backlight.h:11,
from /usr/lib/klibc/include/linux/fb.h:4,
from kernel.c:16:
/usr/lib/klibc/include/asm/mmu.h: At top level:
/usr/lib/klibc/include/asm/mmu.h:13: error: field 'sem' has incomplete type
In file included from /usr/lib/klibc/include/linux/utsname.h:6,
from /usr/lib/klibc/include/asm/elf.h:15,
from /usr/lib/klibc/include/linux/elf.h:7,
from /usr/lib/klibc/include/linux/module.h:16,
from /usr/lib/klibc/include/linux/device.h:19,
from /usr/lib/klibc/include/linux/backlight.h:11,
from /usr/lib/klibc/include/linux/fb.h:4,
from kernel.c:16:
/usr/lib/klibc/include/linux/nsproxy.h: In function 'exit_task_namespaces':
/usr/lib/klibc/include/linux/nsproxy.h:46: error: dereferencing pointer to incomplete type
/usr/lib/klibc/include/linux/nsproxy.h:49: error: dereferencing pointer to incomplete type
In file included from /usr/lib/klibc/include/asm/elf.h:15,
from /usr/lib/klibc/include/linux/elf.h:7,
from /usr/lib/klibc/include/linux/module.h:16,
from /usr/lib/klibc/include/linux/device.h:19,
from /usr/lib/klibc/include/linux/backlight.h:11,
from /usr/lib/klibc/include/linux/fb.h:4,
from kernel.c:16:
/usr/lib/klibc/include/linux/utsname.h: At top level:
/usr/lib/klibc/include/linux/utsname.h:39: error: field 'kref' has incomplete type
/usr/lib/klibc/include/linux/utsname.h: In function 'utsname':
/usr/lib/klibc/include/linux/utsname.h:76: error: 'current' undeclared (first use in this function)
In file included from /usr/lib/klibc/include/linux/module.h:22,
from /usr/lib/klibc/include/linux/device.h:19,
from /usr/lib/klibc/include/linux/backlight.h:11,
from /usr/lib/klibc/include/linux/fb.h:4,
from kernel.c:16:
/usr/lib/klibc/include/asm/module.h:60:2: error: #error unknown processor family
In file included from /usr/lib/klibc/include/linux/device.h:19,
from /usr/lib/klibc/include/linux/backlight.h:11,
from /usr/lib/klibc/include/linux/fb.h:4,
from kernel.c:16:
/usr/lib/klibc/include/linux/module.h: At top level:
/usr/lib/klibc/include/linux/module.h:49: error: field 'attr' has incomplete type
/usr/lib/klibc/include/linux/module.h:60: error: field 'kobj' has incomplete type
In file included from /usr/lib/klibc/include/linux/backlight.h:11,
from /usr/lib/klibc/include/linux/fb.h:4,
from kernel.c:16:
/usr/lib/klibc/include/linux/device.h:38: error: field 'subsys' has incomplete type
/usr/lib/klibc/include/linux/device.h:39: error: field 'drivers' has incomplete type
/usr/lib/klibc/include/linux/device.h:40: error: field 'devices' has incomplete type
/usr/lib/klibc/include/linux/device.h:54: error: expected declaration specifiers or '...' before 'pm_message_t'
/usr/lib/klibc/include/linux/device.h:77: error: field 'attr' has incomplete type
/usr/lib/klibc/include/linux/device.h:93: error: field 'kobj' has incomplete type
/usr/lib/klibc/include/linux/device.h:102: error: expected declaration specifiers or '...' before 'pm_message_t'
/usr/lib/klibc/include/linux/device.h:118: error: field 'attr' has incomplete type
/usr/lib/klibc/include/linux/device.h:143: error: field 'subsys' has incomplete type
/usr/lib/klibc/include/linux/device.h:144: error: field 'children' has incomplete type
/usr/lib/klibc/include/linux/device.h:145: error: field 'devices' has incomplete type
/usr/lib/klibc/include/linux/device.h:146: error: field 'interfaces' has incomplete type
/usr/lib/klibc/include/linux/device.h:147: error: field 'sem' has incomplete type
/usr/lib/klibc/include/linux/device.h:164: error: field 'attr' has incomplete type
/usr/lib/klibc/include/linux/device.h:176: error: field 'attr' has incomplete type
/usr/lib/klibc/include/linux/device.h:214: error: field 'node' has incomplete type
/usr/lib/klibc/include/linux/device.h:216: error: field 'kobj' has incomplete type
/usr/lib/klibc/include/linux/device.h:229: error: 'KOBJ_NAME_LEN' undeclared here (not in a function)
/usr/lib/klibc/include/linux/device.h:264: error: field 'node' has incomplete type
/usr/lib/klibc/include/linux/device.h:287: error: field 'attr' has incomplete type
/usr/lib/klibc/include/linux/device.h:306: error: field 'kobj' has incomplete type
/usr/lib/klibc/include/linux/device.h:311: error: field 'sem' has incomplete type
/usr/lib/klibc/include/linux/device.h:323: error: field 'power' has incomplete type
/usr/lib/klibc/include/linux/device.h:325: error: expected specifier-qualifier-list before 'u64'
In file included from /usr/lib/klibc/include/linux/notifier.h:13,
from /usr/lib/klibc/include/linux/backlight.h:12,
from /usr/lib/klibc/include/linux/fb.h:4,
from kernel.c:16:
/usr/lib/klibc/include/linux/mutex.h:51: error: field 'wait_list' has incomplete type
/usr/lib/klibc/include/linux/mutex.h:67: error: field 'list' has incomplete type
In file included from /usr/lib/klibc/include/linux/backlight.h:12,
from /usr/lib/klibc/include/linux/fb.h:4,
from kernel.c:16:
/usr/lib/klibc/include/linux/notifier.h:47: error: field 'rwsem' has incomplete type
In file included from /usr/lib/klibc/include/linux/fb.h:4,
from kernel.c:16:
/usr/lib/klibc/include/linux/backlight.h:47: error: field 'sem' has incomplete type
kernel.c: In function 'handle_init':
kernel.c:191: error: 'CONFIG_NR_TTY_DEVICES' undeclared (first use in this function)
make: *** [kernel/kernel.o] Error 1
!!! ERROR: media-gfx/splashutils-1.1.9.10-r1 failed.
Call stack:
ebuild.sh, line 1540: Called dyn_compile
ebuild.sh, line 940: Called src_compile
splashutils-1.1.9.10-r1.ebuild, line 139: Called die
!!! failed to build splashutils
!!! If you need support, post the topmost build error, and the call stack if relevant.