All pastes #710371 Raw Edit

Untitled

public text v1 · immutable
#710371 ·published 2007-09-25 13:57 UTC
rendered paste body
make -C /usr/src/linux M=`pwd`  modules
make[1]: Entering directory `/usr/src/linux-2.6.22-hardened-r4'

  WARNING: Symbol version dump /usr/src/linux-2.6.22-hardened-r4/Module.symvers
           is missing; modules will have no dependencies and modversions.

  CC [M]  /var/tmp/portage/sys-fs/fuse-2.7.0/work/fuse-2.7.0/kernel/dev.o
  CC [M]  /var/tmp/portage/sys-fs/fuse-2.7.0/work/fuse-2.7.0/kernel/dir.o
  CC [M]  /var/tmp/portage/sys-fs/fuse-2.7.0/work/fuse-2.7.0/kernel/file.o
  CC [M]  /var/tmp/portage/sys-fs/fuse-2.7.0/work/fuse-2.7.0/kernel/inode.o
  CC [M]  /var/tmp/portage/sys-fs/fuse-2.7.0/work/fuse-2.7.0/kernel/control.o
  LD [M]  /var/tmp/portage/sys-fs/fuse-2.7.0/work/fuse-2.7.0/kernel/fuse.o
  Building modules, stage 2.
  MODPOST 1 modules
/bin/sh: scripts/mod/modpost: No such file or directory
make[2]: *** [__modpost] Error 127
make[1]: *** [modules] Error 2
make[1]: Leaving directory `/usr/src/linux-2.6.22-hardened-r4'
make: *** [all-spec] Error 2
 * 
 * ERROR: sys-fs/fuse-2.7.0 failed.
 * Call stack:
 *   ebuild.sh, line 1654:   Called dyn_compile
 *   ebuild.sh, line 990:   Called qa_call 'src_compile'
 *   ebuild.sh, line 44:   Called src_compile
 *   fuse-2.7.0.ebuild, line 53:   Called linux-mod_src_compile
 *   linux-mod.eclass, line 516:   Called die
 * 
 * Unable to make  majver=2.6
                                        fusemoduledir=//lib/modules/2.6.22-hardened-r4/fs all.
 * If you need support, post the topmost build error, and the call stack if relevant.
 * A complete build log is located at '/var/log/portage/buildlogs/sys-fs:fuse-2.7.0:20070925-135045.log'.