rendered paste bodyedman007@mr-slack:~/downloads/gnash$ make
make all-recursive
make[1]: Entering directory `/home/edman007/downloads/gnash'
Making all in libbase
make[2]: Entering directory `/home/edman007/downloads/gnash/libbase'
/bin/sh ../libtool --tag=CXX --mode=compile g++ -DHAVE_CONFIG_H -I. -I. -I.. -DPLUGINSDIR=\"/usr/local//lib/gnash/plugins\" -I.. -I. -I.. -I../libamf -I../server -I../server/swf -pthread -I/usr/X11R6/include -I/usr/local/gnome2.18.1/include/libxml2 -I/usr/local/gnome2.18.1/include/glib-2.0 -I/usr/local/gnome2.18.1/lib/glib-2.0/include -pthread -I/usr/local/gnome2.18.1/include/gstreamer-0.10 -I/usr/local/gnome2.18.1/include/glib-2.0 -I/usr/local/gnome2.18.1/lib/glib-2.0/include -I/usr/local/gnome2.18.1/include/libxml2 -I/usr/local/include/boost-1_33_1 -pthread -I/usr/local/gnome2.18.1/include/gstreamer-0.10 -I/usr/local/gnome2.18.1/include/glib-2.0 -I/usr/local/gnome2.18.1/lib/glib-2.0/include -I/usr/local/gnome2.18.1/include/libxml2 -O3 -march=pentium4 -pthread -W -Wall -Wcast-align -Wcast-qual -Wpointer-arith -Wreturn-type -c -o libgnashbase_la-rc.lo `test -f 'rc.cpp' || echo './'`rc.cpp
g++ -DHAVE_CONFIG_H -I. -I. -I.. -DPLUGINSDIR=\"/usr/local//lib/gnash/plugins\" -I.. -I. -I.. -I../libamf -I../server -I../server/swf -pthread -I/usr/X11R6/include -I/usr/local/gnome2.18.1/include/libxml2 -I/usr/local/gnome2.18.1/include/glib-2.0 -I/usr/local/gnome2.18.1/lib/glib-2.0/include -pthread -I/usr/local/gnome2.18.1/include/gstreamer-0.10 -I/usr/local/gnome2.18.1/include/glib-2.0 -I/usr/local/gnome2.18.1/lib/glib-2.0/include -I/usr/local/gnome2.18.1/include/libxml2 -I/usr/local/include/boost-1_33_1 -pthread -I/usr/local/gnome2.18.1/include/gstreamer-0.10 -I/usr/local/gnome2.18.1/include/glib-2.0 -I/usr/local/gnome2.18.1/lib/glib-2.0/include -I/usr/local/gnome2.18.1/include/libxml2 -O3 -march=pentium4 -pthread -W -Wall -Wcast-align -Wcast-qual -Wpointer-arith -Wreturn-type -c rc.cpp -fPIC -DPIC -o .libs/libgnashbase_la-rc.o
rc.cpp: In constructor 'gnash::RcInitFile::RcInitFile()':
rc.cpp:61: error: expected `)' before 'DEFAULT_FLASH_MAJOR_VERSION'
make[2]: *** [libgnashbase_la-rc.lo] Error 1
make[2]: Leaving directory `/home/edman007/downloads/gnash/libbase'
make[1]: *** [all-recursive] Error 1
make[1]: Leaving directory `/home/edman007/downloads/gnash'
make: *** [all] Error 2