long-long -pedantic -fshort-wchar -pthread -pipe -DNDEBUG -DTRIMMED -O -fexceptions -Wno-unknown-pragmas -I/usr/X11R6/include -DMOZILLA_CLIENT -include ../../../../../mozilla-config.h -Wp,-MD,.deps/flockLuceneImpl.pp flockLuceneImpl.cpp
flockLuceneImpl.cpp:77:21: warning: anonymous variadic macros were introduced in C99
../../../../../../local/include/CLucene/index/FieldInfo.h: In constructor ‘lucene::index::FieldInfo::FieldInfo(const wchar_t*, bool, int32_t, bool)’:
../../../../../../local/include/CLucene/index/FieldInfo.h:23: warning: ‘lucene::index::FieldInfo::number’ will be initialized after
../../../../../../local/include/CLucene/index/FieldInfo.h:20: warning: ‘bool lucene::index::FieldInfo::storeTermVector’
../../../../../../local/include/CLucene/index/FieldInfo.h:27: warning: when initialized here
../../../../../../local/include/CLucene/analysis/AnalysisHeader.h: In member function ‘lucene::analysis::Token* lucene::analysis::TokenStream::next()’:
../../../../../../local/include/CLucene/analysis/AnalysisHeader.h:138: warning: statement has no effect
../../../../../../local/include/CLucene/store/RAMDirectory.h: At global scope:
../../../../../../local/include/CLucene/store/RAMDirectory.h:129: error: extra ‘;’
../../../../../../local/include/CLucene/search/Sort.h:86: warning: ‘virtual lucene::search::ScoreDocComparator* lucene::search::SortComparatorSource::newComparator(lucene::index::IndexReader*, const wchar_t*)’ was hidden
../../../../../../local/include/CLucene/search/Sort.h:106: warning: by ‘lucene::search::ScoreDocComparator* lucene::search::SortComparator::newComparator(lucene::index::IndexReader*, wchar_t*)’
../../../../../../local/include/CLucene/search/SearchHeader.h:228: warning: ‘virtual void lucene::search::Searchable::_search(lucene::search::Query*, lucene::search::Filter*, lucene::search::HitCollector*)’ was hidden
../../../../../../local/include/CLucene/search/SearchHeader.h:343: warning: by ‘void lucene::search::Searcher::_search(lucene::search::Query*, lucene::search::HitCollector*)’
../../../../../../local/include/CLucene/search/SearchHeader.h:256: warning: ‘virtual lucene::search::TopDocs* lucene::search::Searchable::_search(lucene::search::Query*, lucene::search::Filter*, int32_t)’ was hidden
../../../../../../local/include/CLucene/search/SearchHeader.h:343: warning: by ‘void lucene::search::Searcher::_search(lucene::search::Query*, lucene::search::HitCollector*)’
../../../../../../local/include/CLucene/search/SearchHeader.h:285: warning: ‘virtual lucene::search::TopFieldDocs* lucene::search::Searchable::_search(lucene::search::Query*, lucene::search::Filter*, int32_t, const lucene::search::Sort*)’ was hidden
../../../../../../local/include/CLucene/search/SearchHeader.h:343: warning: by ‘void lucene::search::Searcher::_search(lucene::search::Query*, lucene::search::HitCollector*)’
../../../../../../local/include/CLucene/search/FieldDoc.h: In destructor ‘virtual lucene::search::FieldDoc::~FieldDoc()’:
../../../../../../local/include/CLucene/search/FieldDoc.h:56: warning: statement has no effect
../../../../../../local/include/CLucene/search/BooleanClause.h: In constructor ‘lucene::search::BooleanClause::BooleanClause(lucene::search::Query*, bool, bool, bool)’:
../../../../../../local/include/CLucene/search/BooleanClause.h:35: warning: ‘lucene::search::BooleanClause::prohibited’ will be initialized after
../../../../../../local/include/CLucene/search/BooleanClause.h:22: warning: ‘bool lucene::search::BooleanClause::deleteQuery’
../../../../../../local/include/CLucene/search/BooleanClause.h:39: warning: when initialized here
../../../../../../local/include/CLucene/search/BooleanClause.h: In copy constructor ‘lucene::search::BooleanClause::BooleanClause(const lucene::search::BooleanClause&)’:
../../../../../../local/include/CLucene/search/BooleanClause.h:35: warning: ‘lucene::search::BooleanClause::prohibited’ will be initialized after
../../../../../../local/include/CLucene/search/BooleanClause.h:22: warning: ‘bool lucene::search::BooleanClause::deleteQuery’
../../../../../../local/include/CLucene/search/BooleanClause.h:47: warning: when initialized here
../../../../../../local/include/CLucene/search/BooleanClause.h: In destructor ‘virtual lucene::search::BooleanClause::~BooleanClause()’:
../../../../../../local/include/CLucene/search/BooleanClause.h:62: warning: statement has no effect
flockLuceneImpl.cpp: In member function ‘nsresult flockLuceneImpl::ReturnResults(lucene::search::Hits*, PRUint32, PRUint32*, nsIRDFDataSource*)’:
flockLuceneImpl.cpp:529: warning: comparison between signed and unsigned integer expressions
flockLuceneImpl.cpp:529: warning: comparison between signed and unsigned integer expressions
flockLuceneImpl.cpp:572: warning: comparison between signed and unsigned integer expressions
flockLuceneImpl.cpp:581: warning: comparison between signed and unsigned integer expressions
gmake[6]: *** [flockLuceneImpl.o] Fehler 1
gmake[6]: Leaving directory `/home/quentin/packmanbuild/flock/flock-mozilla/mozilla/browser/components/flock/lucene/src'
gmake[5]: *** [libs] Fehler 2
gmake[5]: Leaving directory `/home/quentin/packmanbuild/flock/flock-mozilla/mozilla/browser/components/flock/lucene'
gmake[4]: *** [libs] Fehler 2