make all-recursive
make[1]: Entering directory `/home/bjwebb2/gnash'
Making all in libbase
make[2]: Entering directory `/home/bjwebb2/gnash/libbase'
/bin/bash ../libtool --tag=CXX --mode=compile g++ -DHAVE_CONFIG_H -I. -I. -I.. -DPLUGINSDIR=\"/usr/local/lib/gnash/plugins\" -I.. -I. -I.. -I../libamf -I../server -I../server/swf -pthread -I/usr/include/libxml2 -D_GNU_SOURCE=1 -D_REENTRANT -I/usr/include/SDL -I/usr/include/glib-2.0 -I/usr/lib/glib-2.0/include -I/usr/include -g -O2 -pthread -W -Wall -Wcast-align -Wcast-qual -Wpointer-arith -Wreturn-type -c -o libgnashbase_la-extension.lo `test -f 'extension.cpp' || echo './'`extension.cpp
g++ -DHAVE_CONFIG_H -I. -I. -I.. -DPLUGINSDIR=\"/usr/local/lib/gnash/plugins\" -I.. -I. -I.. -I../libamf -I../server -I../server/swf -pthread -I/usr/include/libxml2 -D_GNU_SOURCE=1 -D_REENTRANT -I/usr/include/SDL -I/usr/include/glib-2.0 -I/usr/lib/glib-2.0/include -I/usr/include -g -O2 -pthread -W -Wall -Wcast-align -Wcast-qual -Wpointer-arith -Wreturn-type -c extension.cpp -fPIC -DPIC -o .libs/libgnashbase_la-extension.o
In file included from /usr/include/boost/multi_index/detail/node_type.hpp:23,
from /usr/include/boost/multi_index/detail/index_base.hpp:21,
from /usr/include/boost/multi_index/detail/base_type.hpp:21,
from /usr/include/boost/multi_index_container.hpp:32,
from ./string_table.h:26,
from ../server/as_object.h:27,
from sharedlib.h:28,
from extension.cpp:43:
/usr/include/boost/multi_index/detail/index_node_base.hpp:22:42: error: boost/serialization/access.hpp: No such file or directory
In file included from /usr/include/boost/multi_index/detail/index_base.hpp:27,
from /usr/include/boost/multi_index/detail/base_type.hpp:21,
from /usr/include/boost/multi_index_container.hpp:32,
from ./string_table.h:26,
from ../server/as_object.h:27,
from sharedlib.h:28,
from extension.cpp:43:
/usr/include/boost/multi_index/detail/index_loader.hpp:21:39: error: boost/serialization/nvp.hpp: No such file or directory
In file included from /usr/include/boost/multi_index_container.hpp:46,
from ./string_table.h:26,
from ../server/as_object.h:27,
from sharedlib.h:28,
from extension.cpp:43:
/usr/include/boost/multi_index/detail/archive_constructed.hpp:19:49: error: boost/serialization/serialization.hpp: No such file or directory
In file included from ./string_table.h:26,
from ../server/as_object.h:27,
from sharedlib.h:28,
from extension.cpp:43:
/usr/include/boost/multi_index_container.hpp:48:48: error: boost/serialization/split_member.hpp: No such file or directory
/usr/include/boost/multi_index/detail/index_node_base.hpp:72: error: 'boost::serialization' has not been declared
/usr/include/boost/multi_index/detail/index_node_base.hpp:72: error: friend declaration does not name a class or function
/usr/include/boost/multi_index/detail/index_loader.hpp: In member function 'void boost::multi_index::detail::index_loader<Node, FinalNode, Allocator>::add(Node*, Archive&, unsigned int)':
/usr/include/boost/multi_index/detail/index_loader.hpp:49: error: 'serialization' has not been declared
/usr/include/boost/multi_index/detail/index_loader.hpp: In member function 'void boost::multi_index::detail::index_loader<Node, FinalNode, Allocator>::add_track(Node*, Archive&, unsigned int)':
/usr/include/boost/multi_index/detail/index_loader.hpp:56: error: 'serialization' has not been declared
/usr/include/boost/multi_index/detail/index_loader.hpp: In member function 'FinalNode* boost::multi_index::detail::index_loader<Node, FinalNode, Allocator>::unchecked_load_node(Archive&) const':
/usr/include/boost/multi_index/detail/index_loader.hpp:104: error: 'serialization' has not been declared
/usr/include/boost/multi_index/detail/index_loader.hpp: In member function 'FinalNode* boost::multi_index::detail::index_loader<Node, FinalNode, Allocator>::load_node(Archive&) const':
/usr/include/boost/multi_index/detail/index_loader.hpp:112: error: 'serialization' has not been declared
/usr/include/boost/multi_index/detail/index_saver.hpp: In member function 'void boost::multi_index::detail::index_saver<Node, Allocator>::add(Node*, Archive&, unsigned int)':
/usr/include/boost/multi_index/detail/index_saver.hpp:46: error: 'serialization' has not been declared
/usr/include/boost/multi_index/detail/index_saver.hpp: In member function 'void boost::multi_index::detail::index_saver<Node, Allocator>::add_track(Node*, Archive&, unsigned int)':
/usr/include/boost/multi_index/detail/index_saver.hpp:53: error: 'serialization' has not been declared
/usr/include/boost/multi_index/detail/index_saver.hpp: In static member function 'static void boost::multi_index::detail::index_saver<Node, Allocator>::save_node(Node*, Archive&)':
/usr/include/boost/multi_index/detail/index_saver.hpp:123: error: 'serialization' has not been declared
/usr/include/boost/multi_index/detail/archive_constructed.hpp: In constructor 'boost::multi_index::detail::archive_constructed<T>::archive_constructed(Archive&, unsigned int)':
/usr/include/boost/multi_index/detail/archive_constructed.hpp:37: error: 'serialization' has not been declared
/usr/include/boost/multi_index/detail/archive_constructed.hpp: In constructor 'boost::multi_index::detail::archive_constructed<T>::archive_constructed(const char*, Archive&, unsigned int)':
/usr/include/boost/multi_index/detail/archive_constructed.hpp:51: error: 'serialization' has not been declared
/usr/include/boost/multi_index/detail/archive_constructed.hpp:53: error: 'serialization' has not been declared
/usr/include/boost/multi_index_container.hpp: At global scope:
/usr/include/boost/multi_index_container.hpp:564: error: 'boost::serialization' has not been declared
/usr/include/boost/multi_index_container.hpp:564: error: friend declaration does not name a class or function
/usr/include/boost/multi_index_container.hpp:568: error: expected ';' before 'typedef'
/usr/include/boost/multi_index_container.hpp: In member function 'void boost::multi_index::multi_index_container<Value, IndexSpecifierList, Allocator>::save(Archive&, unsigned int) const':
/usr/include/boost/multi_index_container.hpp:575: error: 'serialization' has not been declared
/usr/include/boost/multi_index_container.hpp:576: error: 'index_saver_type' was not declared in this scope
/usr/include/boost/multi_index_container.hpp:576: error: expected `;' before 'sm'
/usr/include/boost/multi_index_container.hpp:579: error: 'serialization' has not been declared
/usr/include/boost/multi_index_container.hpp:580: error: 'sm' was not declared in this scope
/usr/include/boost/multi_index_container.hpp:582: error: 'sm' was not declared in this scope
/usr/include/boost/multi_index_container.hpp: In member function 'void boost::multi_index::multi_index_container<Value, IndexSpecifierList, Allocator>::load(Archive&, unsigned int)':
/usr/include/boost/multi_index_container.hpp:595: error: 'serialization' has not been declared
/usr/include/boost/multi_index/detail/bucket_array.hpp: At global scope:
/usr/include/boost/multi_index/detail/bucket_array.hpp:140: error: 'boost::serialization' has not been declared
/usr/include/boost/multi_index/detail/bucket_array.hpp:140: error: friend declaration does not name a class or function
/usr/include/boost/multi_index/detail/hash_index_iterator.hpp:72: error: expected ';' before 'typedef'
/usr/include/boost/multi_index/detail/hash_index_iterator.hpp: In member function 'void boost::multi_index::detail::hashed_index_iterator<Node, BucketArray, Derived>::save(Archive&, unsigned int) const':
/usr/include/boost/multi_index/detail/hash_index_iterator.hpp:77: error: 'node_base_type' was not declared in this scope
/usr/include/boost/multi_index/detail/hash_index_iterator.hpp:77: error: 'bnode' was not declared in this scope
/usr/include/boost/multi_index/detail/hash_index_iterator.hpp:78: error: 'serialization' has not been declared
/usr/include/boost/multi_index/detail/hash_index_iterator.hpp:79: error: 'serialization' has not been declared
/usr/include/boost/multi_index/detail/hash_index_iterator.hpp: In member function 'void boost::multi_index::detail::hashed_index_iterator<Node, BucketArray, Derived>::load(Archive&, unsigned int)':
/usr/include/boost/multi_index/detail/hash_index_iterator.hpp:85: error: 'node_base_type' was not declared in this scope
/usr/include/boost/multi_index/detail/hash_index_iterator.hpp:85: error: 'bnode' was not declared in this scope
/usr/include/boost/multi_index/detail/hash_index_iterator.hpp:86: error: 'serialization' has not been declared
/usr/include/boost/multi_index/detail/hash_index_iterator.hpp:88: error: 'serialization' has not been declared
/usr/include/boost/multi_index/hashed_index.hpp: In member function 'void boost::multi_index::detail::hashed_index<KeyFromValue, Hash, Pred, SuperMeta, TagList, Category>::save_(Archive&, unsigned int, const typename SuperMeta::type::index_saver_type&) const':
/usr/include/boost/multi_index/hashed_index.hpp:816: error: 'serialization' has not been declared
/usr/include/boost/multi_index/hashed_index.hpp: In member function 'void boost::multi_index::detail::hashed_index<KeyFromValue, Hash, Pred, SuperMeta, TagList, Category>::load_(Archive&, unsigned int, const typename SuperMeta::type::index_loader_type&)':
/usr/include/boost/multi_index/hashed_index.hpp:823: error: 'serialization' has not been declared
/usr/include/boost/multi_index/detail/bidir_node_iterator.hpp: At global scope:
/usr/include/boost/multi_index/detail/bidir_node_iterator.hpp:77: error: expected ';' before 'typedef'
/usr/include/boost/multi_index/detail/bidir_node_iterator.hpp: In member function 'void boost::multi_index::detail::bidir_node_iterator<Node, Derived>::save(Archive&, unsigned int) const':
/usr/include/boost/multi_index/detail/bidir_node_iterator.hpp:82: error: 'node_base_type' was not declared in this scope
/usr/include/boost/multi_index/detail/bidir_node_iterator.hpp:82: error: 'bnode' was not declared in this scope
/usr/include/boost/multi_index/detail/bidir_node_iterator.hpp:83: error: 'serialization' has not been declared
/usr/include/boost/multi_index/detail/bidir_node_iterator.hpp: In member function 'void boost::multi_index::detail::bidir_node_iterator<Node, Derived>::load(Archive&, unsigned int)':
/usr/include/boost/multi_index/detail/bidir_node_iterator.hpp:89: error: 'node_base_type' was not declared in this scope
/usr/include/boost/multi_index/detail/bidir_node_iterator.hpp:89: error: 'bnode' was not declared in this scope
/usr/include/boost/multi_index/detail/bidir_node_iterator.hpp:90: error: 'serialization' has not been declared
extension.cpp: In member function 'bool gnash::Extension::scanDir(const char*)':
extension.cpp:209: warning: unused variable 'libsdir'
make[2]: *** [libgnashbase_la-extension.lo] Error 1
make[2]: Leaving directory `/home/bjwebb2/gnash/libbase'
make[1]: *** [all-recursive] Error 1
make[1]: Leaving directory `/home/bjwebb2/gnash'
make: *** [all] Error 2