ee
public text v1 · immutablehook.c: In function ‘eth_CG_vmMain’:
hook.c:265: error: expected ‘;’ before ‘return’
hook.c:327: error: expected ‘;’ before ‘return’
make: *** [hook.o] Error 1
hook.c: In function ‘eth_CG_vmMain’:
hook.c:265: error: expected ‘;’ before ‘return’
hook.c:327: error: expected ‘;’ before ‘return’
make: *** [hook.o] Error 1