/bin/sh ../../libtool --silent --mode=compile --tag=CXX i686-pc-linux-gnu-g++ -DHAVE_CONFIG_H -I. -I. -I../.. -I../../amarok/src/amarokcore -I../../amarok/src/amarokcore -I../../amarok/src/analyzers -I../../amarok/src/plugin -I../../amarok/src/statusbar -I../../amarok/src/mediadevice -I../../amarok/src -I/usr/kde/3.5/include/arts -I/usr/include/taglib -I../../amarok/src/sqlite -I/usr/include/mysql -march=athlon -pipe -fomit-frame-pointer -DHAVE_ERRNO_AS_DEFINE=1 -I/usr/kde/3.5/include -I/usr/qt/3/include -I. -I/usr/kde/3.5/include -DQT_THREAD_SUPPORT -D_REENTRANT -Wno-long-long -Wundef -ansi -D_XOPEN_SOURCE=500 -D_BSD_SOURCE -Wcast-align -Wconversion -Wchar-subscripts -Wall -W -Wpointer-arith -DNDEBUG -DNO_DEBUG -O2 -O2 -march=athlon -pipe -fomit-frame-pointer -fno-inline -Wformat-security -Wmissing-format-attribute -Wno-non-virtual-dtor -fno-exceptions -fno-check-new -fno-common -DQT_CLEAN_NAMESPACE -DQT_NO_ASCII_CAST -DQT_NO_STL -DQT_NO_COMPAT -DQT_NO_TRANSLATION -c -o playerwindow.lo `test -f 'playerwindow.cpp' || echo './'`playerwindow.cpp
In file included from atomicstring.h:36,
from metabundle.h:19,
from metabundle.cpp:54:
../../config.h:173:1: warning: "PACKAGE_BUGREPORT" redefined
In file included from /usr/include/mp4.h:35,
from metadata/mp4/mp4properties.h:27,
from metadata/mp4/mp4file.h:26,
from metabundle.cpp:47:
/usr/include/libmp4v2/mpeg4ip.h:47:1: warning: this is the location of the previous definition
In file included from atomicstring.h:36,
from metabundle.h:19,
from metabundle.cpp:54:
../../config.h:176:1: warning: "PACKAGE_NAME" redefined
In file included from /usr/include/mp4.h:35,
from metadata/mp4/mp4properties.h:27,
from metadata/mp4/mp4file.h:26,
from metabundle.cpp:47:
/usr/include/libmp4v2/mpeg4ip.h:48:1: warning: this is the location of the previous definition
In file included from atomicstring.h:36,
from metabundle.h:19,
from metabundle.cpp:54:
../../config.h:179:1: warning: "PACKAGE_STRING" redefined
In file included from /usr/include/mp4.h:35,
from metadata/mp4/mp4properties.h:27,
from metadata/mp4/mp4file.h:26,
from metabundle.cpp:47:
/usr/include/libmp4v2/mpeg4ip.h:49:1: warning: this is the location of the previous definition
In file included from atomicstring.h:36,
from metabundle.h:19,
from metabundle.cpp:54:
../../config.h:182:1: warning: "PACKAGE_TARNAME" redefined
In file included from /usr/include/mp4.h:35,
from metadata/mp4/mp4properties.h:27,
from metadata/mp4/mp4file.h:26,
from metabundle.cpp:47:
/usr/include/libmp4v2/mpeg4ip.h:50:1: warning: this is the location of the previous definition
In file included from atomicstring.h:36,
from metabundle.h:19,
from metabundle.cpp:54:
../../config.h:185:1: warning: "PACKAGE_VERSION" redefined
In file included from /usr/include/mp4.h:35,
from metadata/mp4/mp4properties.h:27,
from metadata/mp4/mp4file.h:26,
from metabundle.cpp:47:
/usr/include/libmp4v2/mpeg4ip.h:51:1: warning: this is the location of the previous definition
metabundle.cpp:518:15: warning: "atf" is not defined
metabundle.cpp:518:1: error: unterminated #if
metabundle.cpp: In member function 'void MetaBundle::readTags(TagLib::AudioProperties::ReadStyle, QValueList<MetaBundle::EmbeddedImage>*)':
metabundle.cpp:517: error: expected `}' at end of input
metabundle.cpp:517: error: expected `}' at end of input
/bin/sh ../../libtool --silent --mode=compile --tag=CXX i686-pc-linux-gnu-g++ -DHAVE_CONFIG_H -I. -I. -I../.. -I../../amarok/src/amarokcore -I../../amarok/src/amarokcore -I../../amarok/src/analyzers -I../../amarok/src/plugin -I../../amarok/src/statusbar -I../../amarok/src/mediadevice -I../../amarok/src -I/usr/kde/3.5/include/arts -I/usr/include/taglib -I../../amarok/src/sqlite -I/usr/include/mysql -march=athlon -pipe -fomit-frame-pointer -DHAVE_ERRNO_AS_DEFINE=1 -I/usr/kde/3.5/include -I/usr/qt/3/include -I. -I/usr/kde/3.5/include -DQT_THREAD_SUPPORT -D_REENTRANT -Wno-long-long -Wundef -ansi -D_XOPEN_SOURCE=500 -D_BSD_SOURCE -Wcast-align -Wconversion -Wchar-subscripts -Wall -W -Wpointer-arith -DNDEBUG -DNO_DEBUG -O2 -O2 -march=athlon -pipe -fomit-frame-pointer -fno-inline -Wformat-security -Wmissing-format-attribute -Wno-non-virtual-dtor -fno-exceptions -fno-check-new -fno-common -DQT_CLEAN_NAMESPACE -DQT_NO_ASCII_CAST -DQT_NO_STL -DQT_NO_COMPAT -DQT_NO_TRANSLATION -c -o playlist.lo `test -f 'playlist.cpp' || echo './'`playlist.cpp
make[4]: *** [metabundle.lo] Error 1
make[4]: *** Waiting for unfinished jobs....
make[4]: Leaving directory `/var/tmp/portage/amarok-svn-1.4-r8/work/amarok-svn-1.4/amarok/src'
make[3]: *** [all-recursive] Error 1
make[3]: Leaving directory `/var/tmp/portage/amarok-svn-1.4-r8/work/amarok-svn-1.4/amarok/src'
make[2]: *** [all-recursive] Error 1
make[2]: Leaving directory `/var/tmp/portage/amarok-svn-1.4-r8/work/amarok-svn-1.4/amarok'
make[1]: *** [all-recursive] Error 1
make[1]: Leaving directory `/var/tmp/portage/amarok-svn-1.4-r8/work/amarok-svn-1.4'
make: *** [all] Error 2