ead -L/usr/pkgsrc/databases/mysql4-server/work/.buildlink/lib
/var/tmp//cckZ4c18.o(.text+0x9d): In function `init_thr_alarm':
: undefined reference to `my_sigset'
/var/tmp//cckZ4c18.o(.text+0x80b): In function `thread_alarm':
: undefined reference to `my_sigset'
/var/tmp//cckZ4c18.o(.text+0xb3f): In function `print_signal_warning':
: undefined reference to `my_sigset'
gmake[2]: *** [test_thr_alarm] Error 1
gmake[2]: Leaving directory `/usr/pkgsrc/databases/mysql4-server/work/mysql-4.1.20/mysys'
gmake[1]: *** [all-recursive] Error 1
gmake[1]: Leaving directory `/usr/pkgsrc/databases/mysql4-server/work/mysql-4.1.20'
gmake: *** [all] Error 2
*** Error code 2
Stop.
make: stopped in /usr/pkgsrc/databases/mysql4-server
===>
===> There was an error during the ``build'' phase.
===> Please investigate the following for more information:
===> * log of the build
===> * /usr/pkgsrc/databases/mysql4-server/work/.work.log
===>
*** Error code 1