All pastes #68541 Raw Edit

Stuff

public text v1 · immutable
#68541 ·published 2006-06-21 19:33 UTC
rendered paste body
This file contains any messages produced by compilers while
running configure, to aid debugging if configure makes a mistake.

It was created by configure, which was
generated by GNU Autoconf 2.57.  Invocation command line was

  $ ./configure 

## --------- ##
## Platform. ##
## --------- ##

hostname = dhcp184-19.residence.usherbrooke.ca
uname -m = i686
uname -r = 2.6.12-22mdksmp
uname -s = Linux
uname -v = #1 SMP Tue May 23 15:13:55 MDT 2006

/usr/bin/uname -p = unknown
/bin/uname -X     = unknown

/bin/arch              = i686
/usr/bin/arch -k       = unknown
/usr/convex/getsysinfo = unknown
hostinfo               = unknown
/bin/machine           = unknown
/usr/bin/oslevel       = unknown
/bin/universe          = unknown

PATH: /usr/bin
PATH: /bin
PATH: /usr/bin
PATH: /usr/local/bin
PATH: /usr/X11R6/bin/
PATH: /usr/games
PATH: /usr/lib/jre-1.4.2_09/bin


## ----------- ##
## Core tests. ##
## ----------- ##

configure:1510: checking for a BSD-compatible install
configure:1564: result: /usr/bin/install -c
configure:1575: checking whether build environment is sane
configure:1618: result: yes
configure:1651: checking for gawk
configure:1667: found /usr/bin/gawk
configure:1677: result: gawk
configure:1687: checking whether make sets $(MAKE)
configure:1707: result: yes
configure:1877: checking build system type
configure:1895: result: i686-pc-linux-gnu
configure:1903: checking host system type
configure:1917: result: i686-pc-linux-gnu
configure:1975: checking for gcc
configure:1991: found /usr/bin/gcc
configure:2001: result: gcc
configure:2245: checking for C compiler version
configure:2248: gcc --version </dev/null >&5
gcc (GCC) 4.0.1 (4.0.1-5mdk for Mandriva Linux release 2006.0)
Copyright (C) 2005 Free Software Foundation, Inc.
This is free software; see the source for copying conditions.  There is NO
warranty; not even for MERCHANTABILITY or FITNESS FOR A PARTICULAR PURPOSE.

configure:2251: $? = 0
configure:2253: gcc -v </dev/null >&5
Using built-in specs.
Target: i586-mandriva-linux-gnu
Configured with: ../configure --prefix=/usr --libexecdir=/usr/lib --with-slibdir=/lib --mandir=/usr/share/man --infodir=/usr/share/info --enable-shared --enable-threads=posix --disable-checking --enable-languages=c,c++,ada,f95,objc,java --host=i586-mandriva-linux-gnu --with-system-zlib --enable-long-long --enable-__cxa_atexit --enable-clocale=gnu --disable-libunwind-exceptions --enable-java-awt=gtk --with-java-home=/usr/lib/jvm/java-1.4.2-gcj-1.4.2.0/jre --enable-gtk-cairo --disable-libjava-multilib
Thread model: posix
gcc version 4.0.1 (4.0.1-5mdk for Mandriva Linux release 2006.0)
configure:2256: $? = 0
configure:2258: gcc -V </dev/null >&5
gcc: '-V' option must have argument
configure:2261: $? = 1
configure:2285: checking for C compiler default output
configure:2288: gcc     conftest.c  >&5
configure:2291: $? = 0
configure:2337: result: a.out
configure:2342: checking whether the C compiler works
configure:2348: ./a.out
configure:2351: $? = 0
configure:2368: result: yes
configure:2375: checking whether we are cross compiling
configure:2377: result: no
configure:2380: checking for suffix of executables
configure:2382: gcc -o conftest     conftest.c  >&5
configure:2385: $? = 0
configure:2410: result: 
configure:2416: checking for suffix of object files
configure:2438: gcc -c    conftest.c >&5
configure:2441: $? = 0
configure:2463: result: o
configure:2467: checking whether we are using the GNU C compiler
configure:2492: gcc -c    conftest.c >&5
configure:2495: $? = 0
configure:2498: test -s conftest.o
configure:2501: $? = 0
configure:2514: result: yes
configure:2520: checking whether gcc accepts -g
configure:2542: gcc -c -g  conftest.c >&5
configure:2545: $? = 0
configure:2548: test -s conftest.o
configure:2551: $? = 0
configure:2562: result: yes
configure:2579: checking for gcc option to accept ANSI C
configure:2640: gcc  -c    conftest.c >&5
configure:2643: $? = 0
configure:2646: test -s conftest.o
configure:2649: $? = 0
configure:2667: result: none needed
configure:2685: gcc -c    conftest.c >&5
conftest.c:2: error: syntax error before 'me'
configure:2688: $? = 1
configure: failed program was:
| #ifndef __cplusplus
|   choke me
| #endif
configure:2807: checking for style of include used by make
configure:2835: result: GNU
configure:2863: checking dependency style of gcc
configure:2931: result: gcc3
configure:2960: checking how to run the C preprocessor
configure:2996: gcc -E  conftest.c
configure:3002: $? = 0
configure:3034: gcc -E  conftest.c
configure:3035:28: error: ac_nonexistent.h: No such file or directory
configure:3040: $? = 1
configure: failed program was:
| #line 3025 "configure"
| /* confdefs.h.  */
| 
| #define PACKAGE_NAME ""
| #define PACKAGE_TARNAME ""
| #define PACKAGE_VERSION ""
| #define PACKAGE_STRING ""
| #define PACKAGE_BUGREPORT ""
| #define PACKAGE "OpenCAS"
| #define VERSION "5.0DVP1"
| /* end confdefs.h.  */
| #include <ac_nonexistent.h>
configure:3078: result: gcc -E
configure:3103: gcc -E  conftest.c
configure:3109: $? = 0
configure:3141: gcc -E  conftest.c
configure:3142:28: error: ac_nonexistent.h: No such file or directory
configure:3147: $? = 1
configure: failed program was:
| #line 3132 "configure"
| /* confdefs.h.  */
| 
| #define PACKAGE_NAME ""
| #define PACKAGE_TARNAME ""
| #define PACKAGE_VERSION ""
| #define PACKAGE_STRING ""
| #define PACKAGE_BUGREPORT ""
| #define PACKAGE "OpenCAS"
| #define VERSION "5.0DVP1"
| /* end confdefs.h.  */
| #include <ac_nonexistent.h>
configure:3190: checking for egrep
configure:3200: result: grep -E
configure:3206: checking for AIX
configure:3229: result: no
configure:3235: checking for library containing strerror
configure:3266: gcc -o conftest     conftest.c  >&5
configure:3269: $? = 0
configure:3272: test -s conftest
configure:3275: $? = 0
configure:3334: result: none required
configure:3341: checking whether byte ordering is bigendian
configure:3369: gcc -c    conftest.c >&5
configure:3372: $? = 0
configure:3375: test -s conftest.o
configure:3378: $? = 0
configure:3403: gcc -c    conftest.c >&5
configure: In function 'main':
configure:3398: error: 'not' undeclared (first use in this function)
configure:3398: error: (Each undeclared identifier is reported only once
configure:3398: error: for each function it appears in.)
configure:3398: error: syntax error before 'big'
configure:3406: $? = 1
configure: failed program was:
| #line 3381 "configure"
| /* confdefs.h.  */
| 
| #define PACKAGE_NAME ""
| #define PACKAGE_TARNAME ""
| #define PACKAGE_VERSION ""
| #define PACKAGE_STRING ""
| #define PACKAGE_BUGREPORT ""
| #define PACKAGE "OpenCAS"
| #define VERSION "5.0DVP1"
| /* end confdefs.h.  */
| #include <sys/types.h>
| #include <sys/param.h>
| 
| int
| main ()
| {
| #if BYTE_ORDER != BIG_ENDIAN
|  not big endian
| #endif
| 
|   ;
|   return 0;
| }
configure:3526: result: no
configure:3635: checking for ld used by GCC
configure:3698: result: /usr/bin/ld
configure:3707: checking if the linker (/usr/bin/ld) is GNU ld
GNU ld version 2.16.91.0.2 20050720
configure:3719: result: yes
configure:3724: checking for /usr/bin/ld option to reload object files
configure:3731: result: -r
configure:3736: checking for BSD-compatible nm
configure:3772: result: /usr/bin/nm -B
configure:3775: checking for a sed that does not truncate output
configure:3857: result: /bin/sed
configure:3860: checking whether ln -s works
configure:3864: result: yes
configure:3871: checking how to recognise dependent libraries
configure:4052: result: pass_all
configure:4064: checking command to parse /usr/bin/nm -B output
configure:4148: gcc -c    conftest.c >&5
configure:4151: $? = 0
configure:4155: /usr/bin/nm -B conftest.o \| sed -n -e 's/^.*[ 	]\([ABCDGISTW][ABCDGISTW]*\)[ 	][ 	]*\(\)\([_A-Za-z][_A-Za-z0-9]*\)$/\1 \2\3 \3/p' \> conftest.nm
configure:4158: $? = 0
configure:4210: gcc -o conftest     conftest.c conftstm.o >&5
configure:4213: $? = 0
configure:4257: result: ok
configure:4261: checking for ANSI C header files
configure:4287: gcc -c    conftest.c >&5
configure:4290: $? = 0
configure:4293: test -s conftest.o
configure:4296: $? = 0
configure:4388: gcc -o conftest     conftest.c  >&5
configure: In function 'main':
configure:4383: warning: incompatible implicit declaration of built-in function 'exit'
configure:4391: $? = 0
configure:4393: ./conftest
configure:4396: $? = 0
configure:4411: result: yes
configure:4435: checking for sys/types.h
configure:4452: gcc -c    conftest.c >&5
configure:4455: $? = 0
configure:4458: test -s conftest.o
configure:4461: $? = 0
configure:4472: result: yes
configure:4435: checking for sys/stat.h
configure:4452: gcc -c    conftest.c >&5
configure:4455: $? = 0
configure:4458: test -s conftest.o
configure:4461: $? = 0
configure:4472: result: yes
configure:4435: checking for stdlib.h
configure:4452: gcc -c    conftest.c >&5
configure:4455: $? = 0
configure:4458: test -s conftest.o
configure:4461: $? = 0
configure:4472: result: yes
configure:4435: checking for string.h
configure:4452: gcc -c    conftest.c >&5
configure:4455: $? = 0
configure:4458: test -s conftest.o
configure:4461: $? = 0
configure:4472: result: yes
configure:4435: checking for memory.h
configure:4452: gcc -c    conftest.c >&5
configure:4455: $? = 0
configure:4458: test -s conftest.o
configure:4461: $? = 0
configure:4472: result: yes
configure:4435: checking for strings.h
configure:4452: gcc -c    conftest.c >&5
configure:4455: $? = 0
configure:4458: test -s conftest.o
configure:4461: $? = 0
configure:4472: result: yes
configure:4435: checking for inttypes.h
configure:4452: gcc -c    conftest.c >&5
configure:4455: $? = 0
configure:4458: test -s conftest.o
configure:4461: $? = 0
configure:4472: result: yes
configure:4435: checking for stdint.h
configure:4452: gcc -c    conftest.c >&5
configure:4455: $? = 0
configure:4458: test -s conftest.o
configure:4461: $? = 0
configure:4472: result: yes
configure:4435: checking for unistd.h
configure:4452: gcc -c    conftest.c >&5
configure:4455: $? = 0
configure:4458: test -s conftest.o
configure:4461: $? = 0
configure:4472: result: yes
configure:4498: checking dlfcn.h usability
configure:4511: gcc -c    conftest.c >&5
configure:4514: $? = 0
configure:4517: test -s conftest.o
configure:4520: $? = 0
configure:4530: result: yes
configure:4534: checking dlfcn.h presence
configure:4545: gcc -E  conftest.c
configure:4551: $? = 0
configure:4570: result: yes
configure:4606: checking for dlfcn.h
configure:4613: result: yes
configure:4811: checking for ranlib
configure:4827: found /usr/bin/ranlib
configure:4838: result: ranlib
configure:4891: checking for strip
configure:4907: found /usr/bin/strip
configure:4918: result: strip
configure:5128: checking for objdir
configure:5139: result: .libs
configure:5156: checking for gcc option to produce PIC
configure:5302: result: -fPIC
configure:5306: checking if gcc PIC flag -fPIC works
configure:5330: gcc -c   -fPIC -DPIC  conftest.c >&5
configure:5333: $? = 0
configure:5336: test -s conftest.o
configure:5339: $? = 0
configure:5377: result: yes
configure:5393: checking if gcc static flag -static works
configure:5418: gcc -o conftest     -static conftest.c  >&5
/usr/bin/ld: cannot find -lc
collect2: ld returned 1 exit status
configure:5421: $? = 1
configure: failed program was:
| #line 5401 "configure"
| /* confdefs.h.  */
| 
| #define PACKAGE_NAME ""
| #define PACKAGE_TARNAME ""
| #define PACKAGE_VERSION ""
| #define PACKAGE_STRING ""
| #define PACKAGE_BUGREPORT ""
| #define PACKAGE "OpenCAS"
| #define VERSION "5.0DVP1"
| #define STDC_HEADERS 1
| #define HAVE_SYS_TYPES_H 1
| #define HAVE_SYS_STAT_H 1
| #define HAVE_STDLIB_H 1
| #define HAVE_STRING_H 1
| #define HAVE_MEMORY_H 1
| #define HAVE_STRINGS_H 1
| #define HAVE_INTTYPES_H 1
| #define HAVE_STDINT_H 1
| #define HAVE_UNISTD_H 1
| #define HAVE_DLFCN_H 1
| /* end confdefs.h.  */
| 
| int
| main ()
| {
| 
|   ;
|   return 0;
| }
configure:5443: result: no
configure:5455: checking if gcc supports -c -o file.o
configure:5475: gcc -c   -o out/conftest2.o  conftest.c >&5
configure:5499: result: yes
configure:5504: checking if gcc supports -c -o file.lo
configure:5532: gcc -c   -c -o conftest.lo  conftest.c >&5
configure:5535: $? = 0
configure:5538: test -s conftest.lo
configure:5541: $? = 0
configure:5563: result: yes
configure:5594: checking if gcc supports -fno-rtti -fno-exceptions
configure:5617: gcc -c   -fno-rtti -fno-exceptions -c conftest.c  conftest.c >&5
cc1: warning: command line option "-fno-rtti" is valid for C++/ObjC++ but not for C
cc1: warning: command line option "-fno-rtti" is valid for C++/ObjC++ but not for C
configure:5620: $? = 0
configure:5623: test -s conftest.o
configure:5626: $? = 0
configure:5643: result: yes
configure:5654: checking whether the linker (/usr/bin/ld) supports shared libraries
configure:6349: result: yes
configure:6354: checking how to hardcode library paths into programs
configure:6378: result: immediate
configure:6383: checking whether stripping libraries is possible
configure:6388: result: yes
configure:6399: checking dynamic linker characteristics
configure:6806: result: GNU/Linux ld.so
configure:6811: checking if libtool supports shared libraries
configure:6813: result: yes
configure:6816: checking whether to build shared libraries
configure:6837: result: yes
configure:6840: checking whether to build static libraries
configure:6844: result: no
configure:7518: checking whether -lc should be explicitly linked in
configure:7526: gcc -c    conftest.c >&5
configure:7529: $? = 0
configure:7543: gcc -shared conftest.o  -v -Wl,-soname -Wl,conftest -o conftest 2\>\&1 \| grep  -lc  \>/dev/null 2\>\&1
configure:7546: $? = 0
configure:7559: result: no
configure:8184: checking for g++
configure:8213: result: no
configure:8184: checking for c++
configure:8213: result: no
configure:8184: checking for gpp
configure:8213: result: no
configure:8184: checking for aCC
configure:8213: result: no
configure:8184: checking for CC
configure:8213: result: no
configure:8184: checking for cxx
configure:8213: result: no
configure:8184: checking for cc++
configure:8213: result: no
configure:8184: checking for cl
configure:8213: result: no
configure:8184: checking for FCC
configure:8213: result: no
configure:8184: checking for KCC
configure:8213: result: no
configure:8184: checking for RCC
configure:8213: result: no
configure:8184: checking for xlC_r
configure:8213: result: no
configure:8184: checking for xlC
configure:8213: result: no
configure:8226: checking for C++ compiler version
configure:8229: g++ --version </dev/null >&5
./configure: line 8230: g++: command not found
configure:8232: $? = 127
configure:8234: g++ -v </dev/null >&5
./configure: line 8235: g++: command not found
configure:8237: $? = 127
configure:8239: g++ -V </dev/null >&5
./configure: line 8240: g++: command not found
configure:8242: $? = 127
configure:8245: checking whether we are using the GNU C++ compiler
configure:8270: g++ -c    conftest.cc >&5
./configure: line 8271: g++: command not found
configure:8273: $? = 127
configure: failed program was:
| #line 8250 "configure"
| /* confdefs.h.  */
| 
| #define PACKAGE_NAME ""
| #define PACKAGE_TARNAME ""
| #define PACKAGE_VERSION ""
| #define PACKAGE_STRING ""
| #define PACKAGE_BUGREPORT ""
| #define PACKAGE "OpenCAS"
| #define VERSION "5.0DVP1"
| #define STDC_HEADERS 1
| #define HAVE_SYS_TYPES_H 1
| #define HAVE_SYS_STAT_H 1
| #define HAVE_STDLIB_H 1
| #define HAVE_STRING_H 1
| #define HAVE_MEMORY_H 1
| #define HAVE_STRINGS_H 1
| #define HAVE_INTTYPES_H 1
| #define HAVE_STDINT_H 1
| #define HAVE_UNISTD_H 1
| #define HAVE_DLFCN_H 1
| /* end confdefs.h.  */
| 
| int
| main ()
| {
| #ifndef __GNUC__
|        choke me
| #endif
| 
|   ;
|   return 0;
| }
configure:8292: result: no
configure:8298: checking whether g++ accepts -g
configure:8320: g++ -c -g  conftest.cc >&5
./configure: line 8321: g++: command not found
configure:8323: $? = 127
configure: failed program was:
| #line 8303 "configure"
| /* confdefs.h.  */
| 
| #define PACKAGE_NAME ""
| #define PACKAGE_TARNAME ""
| #define PACKAGE_VERSION ""
| #define PACKAGE_STRING ""
| #define PACKAGE_BUGREPORT ""
| #define PACKAGE "OpenCAS"
| #define VERSION "5.0DVP1"
| #define STDC_HEADERS 1
| #define HAVE_SYS_TYPES_H 1
| #define HAVE_SYS_STAT_H 1
| #define HAVE_STDLIB_H 1
| #define HAVE_STRING_H 1
| #define HAVE_MEMORY_H 1
| #define HAVE_STRINGS_H 1
| #define HAVE_INTTYPES_H 1
| #define HAVE_STDINT_H 1
| #define HAVE_UNISTD_H 1
| #define HAVE_DLFCN_H 1
| /* end confdefs.h.  */
| 
| int
| main ()
| {
| 
|   ;
|   return 0;
| }
configure:8340: result: no
configure:8384: g++ -c    conftest.cc >&5
./configure: line 8385: g++: command not found
configure:8387: $? = 127
configure: failed program was:
| #line 8366 "configure"
| /* confdefs.h.  */
| 
| #define PACKAGE_NAME ""
| #define PACKAGE_TARNAME ""
| #define PACKAGE_VERSION ""
| #define PACKAGE_STRING ""
| #define PACKAGE_BUGREPORT ""
| #define PACKAGE "OpenCAS"
| #define VERSION "5.0DVP1"
| #define STDC_HEADERS 1
| #define HAVE_SYS_TYPES_H 1
| #define HAVE_SYS_STAT_H 1
| #define HAVE_STDLIB_H 1
| #define HAVE_STRING_H 1
| #define HAVE_MEMORY_H 1
| #define HAVE_STRINGS_H 1
| #define HAVE_INTTYPES_H 1
| #define HAVE_STDINT_H 1
| #define HAVE_UNISTD_H 1
| #define HAVE_DLFCN_H 1
| /* end confdefs.h.  */
| #include <stdlib.h>
| 
| int
| main ()
| {
| exit (42);
|   ;
|   return 0;
| }
configure:8384: g++ -c    conftest.cc >&5
./configure: line 8385: g++: command not found
configure:8387: $? = 127
configure: failed program was:
| #line 8366 "configure"
| /* confdefs.h.  */
| 
| #define PACKAGE_NAME ""
| #define PACKAGE_TARNAME ""
| #define PACKAGE_VERSION ""
| #define PACKAGE_STRING ""
| #define PACKAGE_BUGREPORT ""
| #define PACKAGE "OpenCAS"
| #define VERSION "5.0DVP1"
| #define STDC_HEADERS 1
| #define HAVE_SYS_TYPES_H 1
| #define HAVE_SYS_STAT_H 1
| #define HAVE_STDLIB_H 1
| #define HAVE_STRING_H 1
| #define HAVE_MEMORY_H 1
| #define HAVE_STRINGS_H 1
| #define HAVE_INTTYPES_H 1
| #define HAVE_STDINT_H 1
| #define HAVE_UNISTD_H 1
| #define HAVE_DLFCN_H 1
| /* end confdefs.h.  */
| #include <stdlib.h>
| #include <stdlib.h>
| int
| main ()
| {
| exit (42);
|   ;
|   return 0;
| }
configure:8384: g++ -c    conftest.cc >&5
./configure: line 8385: g++: command not found
configure:8387: $? = 127
configure: failed program was:
| #line 8366 "configure"
| /* confdefs.h.  */
| 
| #define PACKAGE_NAME ""
| #define PACKAGE_TARNAME ""
| #define PACKAGE_VERSION ""
| #define PACKAGE_STRING ""
| #define PACKAGE_BUGREPORT ""
| #define PACKAGE "OpenCAS"
| #define VERSION "5.0DVP1"
| #define STDC_HEADERS 1
| #define HAVE_SYS_TYPES_H 1
| #define HAVE_SYS_STAT_H 1
| #define HAVE_STDLIB_H 1
| #define HAVE_STRING_H 1
| #define HAVE_MEMORY_H 1
| #define HAVE_STRINGS_H 1
| #define HAVE_INTTYPES_H 1
| #define HAVE_STDINT_H 1
| #define HAVE_UNISTD_H 1
| #define HAVE_DLFCN_H 1
| /* end confdefs.h.  */
| #include <stdlib.h>
| extern "C" void std::exit (int) throw (); using std::exit;
| int
| main ()
| {
| exit (42);
|   ;
|   return 0;
| }
configure:8384: g++ -c    conftest.cc >&5
./configure: line 8385: g++: command not found
configure:8387: $? = 127
configure: failed program was:
| #line 8366 "configure"
| /* confdefs.h.  */
| 
| #define PACKAGE_NAME ""
| #define PACKAGE_TARNAME ""
| #define PACKAGE_VERSION ""
| #define PACKAGE_STRING ""
| #define PACKAGE_BUGREPORT ""
| #define PACKAGE "OpenCAS"
| #define VERSION "5.0DVP1"
| #define STDC_HEADERS 1
| #define HAVE_SYS_TYPES_H 1
| #define HAVE_SYS_STAT_H 1
| #define HAVE_STDLIB_H 1
| #define HAVE_STRING_H 1
| #define HAVE_MEMORY_H 1
| #define HAVE_STRINGS_H 1
| #define HAVE_INTTYPES_H 1
| #define HAVE_STDINT_H 1
| #define HAVE_UNISTD_H 1
| #define HAVE_DLFCN_H 1
| /* end confdefs.h.  */
| #include <stdlib.h>
| extern "C" void std::exit (int); using std::exit;
| int
| main ()
| {
| exit (42);
|   ;
|   return 0;
| }
configure:8384: g++ -c    conftest.cc >&5
./configure: line 8385: g++: command not found
configure:8387: $? = 127
configure: failed program was:
| #line 8366 "configure"
| /* confdefs.h.  */
| 
| #define PACKAGE_NAME ""
| #define PACKAGE_TARNAME ""
| #define PACKAGE_VERSION ""
| #define PACKAGE_STRING ""
| #define PACKAGE_BUGREPORT ""
| #define PACKAGE "OpenCAS"
| #define VERSION "5.0DVP1"
| #define STDC_HEADERS 1
| #define HAVE_SYS_TYPES_H 1
| #define HAVE_SYS_STAT_H 1
| #define HAVE_STDLIB_H 1
| #define HAVE_STRING_H 1
| #define HAVE_MEMORY_H 1
| #define HAVE_STRINGS_H 1
| #define HAVE_INTTYPES_H 1
| #define HAVE_STDINT_H 1
| #define HAVE_UNISTD_H 1
| #define HAVE_DLFCN_H 1
| /* end confdefs.h.  */
| #include <stdlib.h>
| extern "C" void exit (int) throw ();
| int
| main ()
| {
| exit (42);
|   ;
|   return 0;
| }
configure:8384: g++ -c    conftest.cc >&5
./configure: line 8385: g++: command not found
configure:8387: $? = 127
configure: failed program was:
| #line 8366 "configure"
| /* confdefs.h.  */
| 
| #define PACKAGE_NAME ""
| #define PACKAGE_TARNAME ""
| #define PACKAGE_VERSION ""
| #define PACKAGE_STRING ""
| #define PACKAGE_BUGREPORT ""
| #define PACKAGE "OpenCAS"
| #define VERSION "5.0DVP1"
| #define STDC_HEADERS 1
| #define HAVE_SYS_TYPES_H 1
| #define HAVE_SYS_STAT_H 1
| #define HAVE_STDLIB_H 1
| #define HAVE_STRING_H 1
| #define HAVE_MEMORY_H 1
| #define HAVE_STRINGS_H 1
| #define HAVE_INTTYPES_H 1
| #define HAVE_STDINT_H 1
| #define HAVE_UNISTD_H 1
| #define HAVE_DLFCN_H 1
| /* end confdefs.h.  */
| #include <stdlib.h>
| extern "C" void exit (int);
| int
| main ()
| {
| exit (42);
|   ;
|   return 0;
| }
configure:8384: g++ -c    conftest.cc >&5
./configure: line 8385: g++: command not found
configure:8387: $? = 127
configure: failed program was:
| #line 8366 "configure"
| /* confdefs.h.  */
| 
| #define PACKAGE_NAME ""
| #define PACKAGE_TARNAME ""
| #define PACKAGE_VERSION ""
| #define PACKAGE_STRING ""
| #define PACKAGE_BUGREPORT ""
| #define PACKAGE "OpenCAS"
| #define VERSION "5.0DVP1"
| #define STDC_HEADERS 1
| #define HAVE_SYS_TYPES_H 1
| #define HAVE_SYS_STAT_H 1
| #define HAVE_STDLIB_H 1
| #define HAVE_STRING_H 1
| #define HAVE_MEMORY_H 1
| #define HAVE_STRINGS_H 1
| #define HAVE_INTTYPES_H 1
| #define HAVE_STDINT_H 1
| #define HAVE_UNISTD_H 1
| #define HAVE_DLFCN_H 1
| /* end confdefs.h.  */
| #include <stdlib.h>
| void exit (int);
| int
| main ()
| {
| exit (42);
|   ;
|   return 0;
| }
configure:8454: checking dependency style of g++
configure:8522: result: none
configure:8540: checking whether gcc and cc understand -c and -o together
configure:8571: gcc -c conftest.c -o conftest.o >&5
configure:8574: $? = 0
configure:8576: gcc -c conftest.c -o conftest.o >&5
configure:8579: $? = 0
configure:8586: cc -c conftest.c >&5
configure:8589: $? = 0
configure:8592: cc -c conftest.c -o conftest.o >&5
configure:8595: $? = 0
configure:8597: cc -c conftest.c -o conftest.o >&5
configure:8600: $? = 0
configure:8618: result: yes
configure:8633: checking for gcc option to accept ANSI C
configure:8697: gcc  -c    conftest.c >&5
configure:8700: $? = 0
configure:8703: test -s conftest.o
configure:8706: $? = 0
configure:8721: result: none needed
configure:8734: checking for function prototypes
configure:8737: result: yes
configure:8751: checking for ANSI C header files
configure:8901: result: yes
configure:8916: checking for string.h
configure:8921: result: yes
configure:9059: checking for gawk
configure:9085: result: gawk
configure:9107: checking for a BSD-compatible install
configure:9161: result: /usr/bin/install -c
configure:9172: checking whether ln -s works
configure:9176: result: yes
configure:9187: checking for bison
configure:9216: result: no
configure:9187: checking for byacc
configure:9216: result: no
configure:9224: checking whether make sets $(MAKE)
configure:9244: result: yes
configure:9267: checking for main in -le
configure:9292: gcc -o conftest     conftest.c -le   >&5
/usr/bin/ld: cannot find -le
collect2: ld returned 1 exit status
configure:9295: $? = 1
configure: failed program was:
| #line 9274 "configure"
| /* confdefs.h.  */
| 
| #define PACKAGE_NAME ""
| #define PACKAGE_TARNAME ""
| #define PACKAGE_VERSION ""
| #define PACKAGE_STRING ""
| #define PACKAGE_BUGREPORT ""
| #define PACKAGE "OpenCAS"
| #define VERSION "5.0DVP1"
| #define STDC_HEADERS 1
| #define HAVE_SYS_TYPES_H 1
| #define HAVE_SYS_STAT_H 1
| #define HAVE_STDLIB_H 1
| #define HAVE_STRING_H 1
| #define HAVE_MEMORY_H 1
| #define HAVE_STRINGS_H 1
| #define HAVE_INTTYPES_H 1
| #define HAVE_STDINT_H 1
| #define HAVE_UNISTD_H 1
| #define HAVE_DLFCN_H 1
| #ifdef __cplusplus
| void exit (int);
| #endif
| #define PROTOTYPES 1
| #define STDC_HEADERS 1
| #define HAVE_STRING_H 1
| /* end confdefs.h.  */
| 
| 
| int
| main ()
| {
| main ();
|   ;
|   return 0;
| }
configure:9313: result: no
configure:9326: checking for main in -links
configure:9351: gcc -o conftest     conftest.c -links   >&5
/usr/bin/ld: cannot find -links
collect2: ld returned 1 exit status
configure:9354: $? = 1
configure: failed program was:
| #line 9333 "configure"
| /* confdefs.h.  */
| 
| #define PACKAGE_NAME ""
| #define PACKAGE_TARNAME ""
| #define PACKAGE_VERSION ""
| #define PACKAGE_STRING ""
| #define PACKAGE_BUGREPORT ""
| #define PACKAGE "OpenCAS"
| #define VERSION "5.0DVP1"
| #define STDC_HEADERS 1
| #define HAVE_SYS_TYPES_H 1
| #define HAVE_SYS_STAT_H 1
| #define HAVE_STDLIB_H 1
| #define HAVE_STRING_H 1
| #define HAVE_MEMORY_H 1
| #define HAVE_STRINGS_H 1
| #define HAVE_INTTYPES_H 1
| #define HAVE_STDINT_H 1
| #define HAVE_UNISTD_H 1
| #define HAVE_DLFCN_H 1
| #ifdef __cplusplus
| void exit (int);
| #endif
| #define PROTOTYPES 1
| #define STDC_HEADERS 1
| #define HAVE_STRING_H 1
| /* end confdefs.h.  */
| 
| 
| int
| main ()
| {
| main ();
|   ;
|   return 0;
| }
configure:9372: result: no
configure:9384: checking for X
configure:9604: result: libraries /usr/X11R6/lib, headers /usr/X11R6/include
configure:9620: checking for ANSI C header files
configure:9770: result: yes
configure:9786: checking  for C header files 
configure:9798: checking for dlfcn.h
configure:9803: result: yes
configure:9807: checking dl.h usability
configure:9820: gcc -c    conftest.c >&5
configure:9872:16: error: dl.h: No such file or directory
configure:9823: $? = 1
configure: failed program was:
| #line 9809 "configure"
| /* confdefs.h.  */
| 
| #define PACKAGE_NAME ""
| #define PACKAGE_TARNAME ""
| #define PACKAGE_VERSION ""
| #define PACKAGE_STRING ""
| #define PACKAGE_BUGREPORT ""
| #define PACKAGE "OpenCAS"
| #define VERSION "5.0DVP1"
| #define STDC_HEADERS 1
| #define HAVE_SYS_TYPES_H 1
| #define HAVE_SYS_STAT_H 1
| #define HAVE_STDLIB_H 1
| #define HAVE_STRING_H 1
| #define HAVE_MEMORY_H 1
| #define HAVE_STRINGS_H 1
| #define HAVE_INTTYPES_H 1
| #define HAVE_STDINT_H 1
| #define HAVE_UNISTD_H 1
| #define HAVE_DLFCN_H 1
| #ifdef __cplusplus
| void exit (int);
| #endif
| #define PROTOTYPES 1
| #define STDC_HEADERS 1
| #define HAVE_STRING_H 1
| #define STDC_HEADERS 1
| #define HAVE_DLFCN_H 1
| /* end confdefs.h.  */
| #include <stdio.h>
| #if HAVE_SYS_TYPES_H
| # include <sys/types.h>
| #endif
| #if HAVE_SYS_STAT_H
| # include <sys/stat.h>
| #endif
| #if STDC_HEADERS
| # include <stdlib.h>
| # include <stddef.h>
| #else
| # if HAVE_STDLIB_H
| #  include <stdlib.h>
| # endif
| #endif
| #if HAVE_STRING_H
| # if !STDC_HEADERS && HAVE_MEMORY_H
| #  include <memory.h>
| # endif
| # include <string.h>
| #endif
| #if HAVE_STRINGS_H
| # include <strings.h>
| #endif
| #if HAVE_INTTYPES_H
| # include <inttypes.h>
| #else
| # if HAVE_STDINT_H
| #  include <stdint.h>
| # endif
| #endif
| #if HAVE_UNISTD_H
| # include <unistd.h>
| #endif
| #include <dl.h>
configure:9839: result: no
configure:9843: checking dl.h presence
configure:9854: gcc -E  conftest.c
configure:9874:16: error: dl.h: No such file or directory
configure:9860: $? = 1
configure: failed program was:
| #line 9845 "configure"
| /* confdefs.h.  */
| 
| #define PACKAGE_NAME ""
| #define PACKAGE_TARNAME ""
| #define PACKAGE_VERSION ""
| #define PACKAGE_STRING ""
| #define PACKAGE_BUGREPORT ""
| #define PACKAGE "OpenCAS"
| #define VERSION "5.0DVP1"
| #define STDC_HEADERS 1
| #define HAVE_SYS_TYPES_H 1
| #define HAVE_SYS_STAT_H 1
| #define HAVE_STDLIB_H 1
| #define HAVE_STRING_H 1
| #define HAVE_MEMORY_H 1
| #define HAVE_STRINGS_H 1
| #define HAVE_INTTYPES_H 1
| #define HAVE_STDINT_H 1
| #define HAVE_UNISTD_H 1
| #define HAVE_DLFCN_H 1
| #ifdef __cplusplus
| void exit (int);
| #endif
| #define PROTOTYPES 1
| #define STDC_HEADERS 1
| #define HAVE_STRING_H 1
| #define STDC_HEADERS 1
| #define HAVE_DLFCN_H 1
| /* end confdefs.h.  */
| #include <dl.h>
configure:9879: result: no
configure:9915: checking for dl.h
configure:9922: result: no
configure:9807: checking ieeefp.h usability
configure:9820: gcc -c    conftest.c >&5
configure:9872:20: error: ieeefp.h: No such file or directory
configure:9823: $? = 1
configure: failed program was:
| #line 9809 "configure"
| /* confdefs.h.  */
| 
| #define PACKAGE_NAME ""
| #define PACKAGE_TARNAME ""
| #define PACKAGE_VERSION ""
| #define PACKAGE_STRING ""
| #define PACKAGE_BUGREPORT ""
| #define PACKAGE "OpenCAS"
| #define VERSION "5.0DVP1"
| #define STDC_HEADERS 1
| #define HAVE_SYS_TYPES_H 1
| #define HAVE_SYS_STAT_H 1
| #define HAVE_STDLIB_H 1
| #define HAVE_STRING_H 1
| #define HAVE_MEMORY_H 1
| #define HAVE_STRINGS_H 1
| #define HAVE_INTTYPES_H 1
| #define HAVE_STDINT_H 1
| #define HAVE_UNISTD_H 1
| #define HAVE_DLFCN_H 1
| #ifdef __cplusplus
| void exit (int);
| #endif
| #define PROTOTYPES 1
| #define STDC_HEADERS 1
| #define HAVE_STRING_H 1
| #define STDC_HEADERS 1
| #define HAVE_DLFCN_H 1
| /* end confdefs.h.  */
| #include <stdio.h>
| #if HAVE_SYS_TYPES_H
| # include <sys/types.h>
| #endif
| #if HAVE_SYS_STAT_H
| # include <sys/stat.h>
| #endif
| #if STDC_HEADERS
| # include <stdlib.h>
| # include <stddef.h>
| #else
| # if HAVE_STDLIB_H
| #  include <stdlib.h>
| # endif
| #endif
| #if HAVE_STRING_H
| # if !STDC_HEADERS && HAVE_MEMORY_H
| #  include <memory.h>
| # endif
| # include <string.h>
| #endif
| #if HAVE_STRINGS_H
| # include <strings.h>
| #endif
| #if HAVE_INTTYPES_H
| # include <inttypes.h>
| #else
| # if HAVE_STDINT_H
| #  include <stdint.h>
| # endif
| #endif
| #if HAVE_UNISTD_H
| # include <unistd.h>
| #endif
| #include <ieeefp.h>
configure:9839: result: no
configure:9843: checking ieeefp.h presence
configure:9854: gcc -E  conftest.c
configure:9874:20: error: ieeefp.h: No such file or directory
configure:9860: $? = 1
configure: failed program was:
| #line 9845 "configure"
| /* confdefs.h.  */
| 
| #define PACKAGE_NAME ""
| #define PACKAGE_TARNAME ""
| #define PACKAGE_VERSION ""
| #define PACKAGE_STRING ""
| #define PACKAGE_BUGREPORT ""
| #define PACKAGE "OpenCAS"
| #define VERSION "5.0DVP1"
| #define STDC_HEADERS 1
| #define HAVE_SYS_TYPES_H 1
| #define HAVE_SYS_STAT_H 1
| #define HAVE_STDLIB_H 1
| #define HAVE_STRING_H 1
| #define HAVE_MEMORY_H 1
| #define HAVE_STRINGS_H 1
| #define HAVE_INTTYPES_H 1
| #define HAVE_STDINT_H 1
| #define HAVE_UNISTD_H 1
| #define HAVE_DLFCN_H 1
| #ifdef __cplusplus
| void exit (int);
| #endif
| #define PROTOTYPES 1
| #define STDC_HEADERS 1
| #define HAVE_STRING_H 1
| #define STDC_HEADERS 1
| #define HAVE_DLFCN_H 1
| /* end confdefs.h.  */
| #include <ieeefp.h>
configure:9879: result: no
configure:9915: checking for ieeefp.h
configure:9922: result: no
configure:9807: checking time.h usability
configure:9820: gcc -c    conftest.c >&5
configure:9823: $? = 0
configure:9826: test -s conftest.o
configure:9829: $? = 0
configure:9839: result: yes
configure:9843: checking time.h presence
configure:9854: gcc -E  conftest.c
configure:9860: $? = 0
configure:9879: result: yes
configure:9915: checking for time.h
configure:9922: result: yes
configure:9807: checking sys/time.h usability
configure:9820: gcc -c    conftest.c >&5
configure:9823: $? = 0
configure:9826: test -s conftest.o
configure:9829: $? = 0
configure:9839: result: yes
configure:9843: checking sys/time.h presence
configure:9854: gcc -E  conftest.c
configure:9860: $? = 0
configure:9879: result: yes
configure:9915: checking for sys/time.h
configure:9922: result: yes
configure:9807: checking pwd.h usability
configure:9820: gcc -c    conftest.c >&5
configure:9823: $? = 0
configure:9826: test -s conftest.o
configure:9829: $? = 0
configure:9839: result: yes
configure:9843: checking pwd.h presence
configure:9854: gcc -E  conftest.c
configure:9860: $? = 0
configure:9879: result: yes
configure:9915: checking for pwd.h
configure:9922: result: yes
configure:9953: checking sys/statvfs.h usability
configure:9966: gcc -c    conftest.c >&5
configure:9969: $? = 0
configure:9972: test -s conftest.o
configure:9975: $? = 0
configure:9985: result: yes
configure:9989: checking sys/statvfs.h presence
configure:10000: gcc -E  conftest.c
configure:10006: $? = 0
configure:10025: result: yes
configure:10061: checking for sys/statvfs.h
configure:10068: result: yes
configure:9953: checking sys/vfs.h usability
configure:9966: gcc -c    conftest.c >&5
configure:9969: $? = 0
configure:9972: test -s conftest.o
configure:9975: $? = 0
configure:9985: result: yes
configure:9989: checking sys/vfs.h presence
configure:10000: gcc -E  conftest.c
configure:10006: $? = 0
configure:10025: result: yes
configure:10061: checking for sys/vfs.h
configure:10068: result: yes
configure:9953: checking sys/param.h usability
configure:9966: gcc -c    conftest.c >&5
configure:9969: $? = 0
configure:9972: test -s conftest.o
configure:9975: $? = 0
configure:9985: result: yes
configure:9989: checking sys/param.h presence
configure:10000: gcc -E  conftest.c
configure:10006: $? = 0
configure:10025: result: yes
configure:10061: checking for sys/param.h
configure:10068: result: yes
configure:9953: checking osfcn.h usability
configure:9966: gcc -c    conftest.c >&5
configure:10024:19: error: osfcn.h: No such file or directory
configure:9969: $? = 1
configure: failed program was:
| #line 9955 "configure"
| /* confdefs.h.  */
| 
| #define PACKAGE_NAME ""
| #define PACKAGE_TARNAME ""
| #define PACKAGE_VERSION ""
| #define PACKAGE_STRING ""
| #define PACKAGE_BUGREPORT ""
| #define PACKAGE "OpenCAS"
| #define VERSION "5.0DVP1"
| #define STDC_HEADERS 1
| #define HAVE_SYS_TYPES_H 1
| #define HAVE_SYS_STAT_H 1
| #define HAVE_STDLIB_H 1
| #define HAVE_STRING_H 1
| #define HAVE_MEMORY_H 1
| #define HAVE_STRINGS_H 1
| #define HAVE_INTTYPES_H 1
| #define HAVE_STDINT_H 1
| #define HAVE_UNISTD_H 1
| #define HAVE_DLFCN_H 1
| #ifdef __cplusplus
| void exit (int);
| #endif
| #define PROTOTYPES 1
| #define STDC_HEADERS 1
| #define HAVE_STRING_H 1
| #define STDC_HEADERS 1
| #define HAVE_DLFCN_H 1
| #define HAVE_TIME_H 1
| #define HAVE_SYS_TIME_H 1
| #define HAVE_PWD_H 1
| #define HAVE_SYS_STATVFS_H 1
| #define HAVE_SYS_VFS_H 1
| #define HAVE_SYS_PARAM_H 1
| /* end confdefs.h.  */
| #include <stdio.h>
| #if HAVE_SYS_TYPES_H
| # include <sys/types.h>
| #endif
| #if HAVE_SYS_STAT_H
| # include <sys/stat.h>
| #endif
| #if STDC_HEADERS
| # include <stdlib.h>
| # include <stddef.h>
| #else
| # if HAVE_STDLIB_H
| #  include <stdlib.h>
| # endif
| #endif
| #if HAVE_STRING_H
| # if !STDC_HEADERS && HAVE_MEMORY_H
| #  include <memory.h>
| # endif
| # include <string.h>
| #endif
| #if HAVE_STRINGS_H
| # include <strings.h>
| #endif
| #if HAVE_INTTYPES_H
| # include <inttypes.h>
| #else
| # if HAVE_STDINT_H
| #  include <stdint.h>
| # endif
| #endif
| #if HAVE_UNISTD_H
| # include <unistd.h>
| #endif
| #include <osfcn.h>
configure:9985: result: no
configure:9989: checking osfcn.h presence
configure:10000: gcc -E  conftest.c
configure:10026:19: error: osfcn.h: No such file or directory
configure:10006: $? = 1
configure: failed program was:
| #line 9991 "configure"
| /* confdefs.h.  */
| 
| #define PACKAGE_NAME ""
| #define PACKAGE_TARNAME ""
| #define PACKAGE_VERSION ""
| #define PACKAGE_STRING ""
| #define PACKAGE_BUGREPORT ""
| #define PACKAGE "OpenCAS"
| #define VERSION "5.0DVP1"
| #define STDC_HEADERS 1
| #define HAVE_SYS_TYPES_H 1
| #define HAVE_SYS_STAT_H 1
| #define HAVE_STDLIB_H 1
| #define HAVE_STRING_H 1
| #define HAVE_MEMORY_H 1
| #define HAVE_STRINGS_H 1
| #define HAVE_INTTYPES_H 1
| #define HAVE_STDINT_H 1
| #define HAVE_UNISTD_H 1
| #define HAVE_DLFCN_H 1
| #ifdef __cplusplus
| void exit (int);
| #endif
| #define PROTOTYPES 1
| #define STDC_HEADERS 1
| #define HAVE_STRING_H 1
| #define STDC_HEADERS 1
| #define HAVE_DLFCN_H 1
| #define HAVE_TIME_H 1
| #define HAVE_SYS_TIME_H 1
| #define HAVE_PWD_H 1
| #define HAVE_SYS_STATVFS_H 1
| #define HAVE_SYS_VFS_H 1
| #define HAVE_SYS_PARAM_H 1
| /* end confdefs.h.  */
| #include <osfcn.h>
configure:10025: result: no
configure:10061: checking for osfcn.h
configure:10068: result: no
configure:9953: checking netdb.h usability
configure:9966: gcc -c    conftest.c >&5
configure:9969: $? = 0
configure:9972: test -s conftest.o
configure:9975: $? = 0
configure:9985: result: yes
configure:9989: checking netdb.h presence
configure:10000: gcc -E  conftest.c
configure:10006: $? = 0
configure:10025: result: yes
configure:10061: checking for netdb.h
configure:10068: result: yes
configure:10098: checking sys/ioctl.h usability
configure:10111: gcc -c    conftest.c >&5
configure:10114: $? = 0
configure:10117: test -s conftest.o
configure:10120: $? = 0
configure:10130: result: yes
configure:10134: checking sys/ioctl.h presence
configure:10145: gcc -E  conftest.c
configure:10151: $? = 0
configure:10170: result: yes
configure:10206: checking for sys/ioctl.h
configure:10213: result: yes
configure:10098: checking net/if.h usability
configure:10111: gcc -c    conftest.c >&5
configure:10114: $? = 0
configure:10117: test -s conftest.o
configure:10120: $? = 0
configure:10130: result: yes
configure:10134: checking net/if.h presence
configure:10145: gcc -E  conftest.c
configure:10151: $? = 0
configure:10170: result: yes
configure:10206: checking for net/if.h
configure:10213: result: yes
configure:10098: checking sys/systeminfo.h usability
configure:10111: gcc -c    conftest.c >&5
configure:10172:28: error: sys/systeminfo.h: No such file or directory
configure:10114: $? = 1
configure: failed program was:
| #line 10100 "configure"
| /* confdefs.h.  */
| 
| #define PACKAGE_NAME ""
| #define PACKAGE_TARNAME ""
| #define PACKAGE_VERSION ""
| #define PACKAGE_STRING ""
| #define PACKAGE_BUGREPORT ""
| #define PACKAGE "OpenCAS"
| #define VERSION "5.0DVP1"
| #define STDC_HEADERS 1
| #define HAVE_SYS_TYPES_H 1
| #define HAVE_SYS_STAT_H 1
| #define HAVE_STDLIB_H 1
| #define HAVE_STRING_H 1
| #define HAVE_MEMORY_H 1
| #define HAVE_STRINGS_H 1
| #define HAVE_INTTYPES_H 1
| #define HAVE_STDINT_H 1
| #define HAVE_UNISTD_H 1
| #define HAVE_DLFCN_H 1
| #ifdef __cplusplus
| void exit (int);
| #endif
| #define PROTOTYPES 1
| #define STDC_HEADERS 1
| #define HAVE_STRING_H 1
| #define STDC_HEADERS 1
| #define HAVE_DLFCN_H 1
| #define HAVE_TIME_H 1
| #define HAVE_SYS_TIME_H 1
| #define HAVE_PWD_H 1
| #define HAVE_SYS_STATVFS_H 1
| #define HAVE_SYS_VFS_H 1
| #define HAVE_SYS_PARAM_H 1
| #define HAVE_NETDB_H 1
| #define HAVE_SYS_IOCTL_H 1
| #define HAVE_NET_IF_H 1
| /* end confdefs.h.  */
| #include <stdio.h>
| #if HAVE_SYS_TYPES_H
| # include <sys/types.h>
| #endif
| #if HAVE_SYS_STAT_H
| # include <sys/stat.h>
| #endif
| #if STDC_HEADERS
| # include <stdlib.h>
| # include <stddef.h>
| #else
| # if HAVE_STDLIB_H
| #  include <stdlib.h>
| # endif
| #endif
| #if HAVE_STRING_H
| # if !STDC_HEADERS && HAVE_MEMORY_H
| #  include <memory.h>
| # endif
| # include <string.h>
| #endif
| #if HAVE_STRINGS_H
| # include <strings.h>
| #endif
| #if HAVE_INTTYPES_H
| # include <inttypes.h>
| #else
| # if HAVE_STDINT_H
| #  include <stdint.h>
| # endif
| #endif
| #if HAVE_UNISTD_H
| # include <unistd.h>
| #endif
| #include <sys/systeminfo.h>
configure:10130: result: no
configure:10134: checking sys/systeminfo.h presence
configure:10145: gcc -E  conftest.c
configure:10174:28: error: sys/systeminfo.h: No such file or directory
configure:10151: $? = 1
configure: failed program was:
| #line 10136 "configure"
| /* confdefs.h.  */
| 
| #define PACKAGE_NAME ""
| #define PACKAGE_TARNAME ""
| #define PACKAGE_VERSION ""
| #define PACKAGE_STRING ""
| #define PACKAGE_BUGREPORT ""
| #define PACKAGE "OpenCAS"
| #define VERSION "5.0DVP1"
| #define STDC_HEADERS 1
| #define HAVE_SYS_TYPES_H 1
| #define HAVE_SYS_STAT_H 1
| #define HAVE_STDLIB_H 1
| #define HAVE_STRING_H 1
| #define HAVE_MEMORY_H 1
| #define HAVE_STRINGS_H 1
| #define HAVE_INTTYPES_H 1
| #define HAVE_STDINT_H 1
| #define HAVE_UNISTD_H 1
| #define HAVE_DLFCN_H 1
| #ifdef __cplusplus
| void exit (int);
| #endif
| #define PROTOTYPES 1
| #define STDC_HEADERS 1
| #define HAVE_STRING_H 1
| #define STDC_HEADERS 1
| #define HAVE_DLFCN_H 1
| #define HAVE_TIME_H 1
| #define HAVE_SYS_TIME_H 1
| #define HAVE_PWD_H 1
| #define HAVE_SYS_STATVFS_H 1
| #define HAVE_SYS_VFS_H 1
| #define HAVE_SYS_PARAM_H 1
| #define HAVE_NETDB_H 1
| #define HAVE_SYS_IOCTL_H 1
| #define HAVE_NET_IF_H 1
| /* end confdefs.h.  */
| #include <sys/systeminfo.h>
configure:10170: result: no
configure:10206: checking for sys/systeminfo.h
configure:10213: result: no
configure:10098: checking sys/utsname.h usability
configure:10111: gcc -c    conftest.c >&5
configure:10114: $? = 0
configure:10117: test -s conftest.o
configure:10120: $? = 0
configure:10130: result: yes
configure:10134: checking sys/utsname.h presence
configure:10145: gcc -E  conftest.c
configure:10151: $? = 0
configure:10170: result: yes
configure:10206: checking for sys/utsname.h
configure:10213: result: yes
configure:10243: checking sysent.h usability
configure:10256: gcc -c    conftest.c >&5
configure:10318:20: error: sysent.h: No such file or directory
configure:10259: $? = 1
configure: failed program was:
| #line 10245 "configure"
| /* confdefs.h.  */
| 
| #define PACKAGE_NAME ""
| #define PACKAGE_TARNAME ""
| #define PACKAGE_VERSION ""
| #define PACKAGE_STRING ""
| #define PACKAGE_BUGREPORT ""
| #define PACKAGE "OpenCAS"
| #define VERSION "5.0DVP1"
| #define STDC_HEADERS 1
| #define HAVE_SYS_TYPES_H 1
| #define HAVE_SYS_STAT_H 1
| #define HAVE_STDLIB_H 1
| #define HAVE_STRING_H 1
| #define HAVE_MEMORY_H 1
| #define HAVE_STRINGS_H 1
| #define HAVE_INTTYPES_H 1
| #define HAVE_STDINT_H 1
| #define HAVE_UNISTD_H 1
| #define HAVE_DLFCN_H 1
| #ifdef __cplusplus
| void exit (int);
| #endif
| #define PROTOTYPES 1
| #define STDC_HEADERS 1
| #define HAVE_STRING_H 1
| #define STDC_HEADERS 1
| #define HAVE_DLFCN_H 1
| #define HAVE_TIME_H 1
| #define HAVE_SYS_TIME_H 1
| #define HAVE_PWD_H 1
| #define HAVE_SYS_STATVFS_H 1
| #define HAVE_SYS_VFS_H 1
| #define HAVE_SYS_PARAM_H 1
| #define HAVE_NETDB_H 1
| #define HAVE_SYS_IOCTL_H 1
| #define HAVE_NET_IF_H 1
| #define HAVE_SYS_UTSNAME_H 1
| /* end confdefs.h.  */
| #include <stdio.h>
| #if HAVE_SYS_TYPES_H
| # include <sys/types.h>
| #endif
| #if HAVE_SYS_STAT_H
| # include <sys/stat.h>
| #endif
| #if STDC_HEADERS
| # include <stdlib.h>
| # include <stddef.h>
| #else
| # if HAVE_STDLIB_H
| #  include <stdlib.h>
| # endif
| #endif
| #if HAVE_STRING_H
| # if !STDC_HEADERS && HAVE_MEMORY_H
| #  include <memory.h>
| # endif
| # include <string.h>
| #endif
| #if HAVE_STRINGS_H
| # include <strings.h>
| #endif
| #if HAVE_INTTYPES_H
| # include <inttypes.h>
| #else
| # if HAVE_STDINT_H
| #  include <stdint.h>
| # endif
| #endif
| #if HAVE_UNISTD_H
| # include <unistd.h>
| #endif
| #include <sysent.h>
configure:10275: result: no
configure:10279: checking sysent.h presence
configure:10290: gcc -E  conftest.c
configure:10320:20: error: sysent.h: No such file or directory
configure:10296: $? = 1
configure: failed program was:
| #line 10281 "configure"
| /* confdefs.h.  */
| 
| #define PACKAGE_NAME ""
| #define PACKAGE_TARNAME ""
| #define PACKAGE_VERSION ""
| #define PACKAGE_STRING ""
| #define PACKAGE_BUGREPORT ""
| #define PACKAGE "OpenCAS"
| #define VERSION "5.0DVP1"
| #define STDC_HEADERS 1
| #define HAVE_SYS_TYPES_H 1
| #define HAVE_SYS_STAT_H 1
| #define HAVE_STDLIB_H 1
| #define HAVE_STRING_H 1
| #define HAVE_MEMORY_H 1
| #define HAVE_STRINGS_H 1
| #define HAVE_INTTYPES_H 1
| #define HAVE_STDINT_H 1
| #define HAVE_UNISTD_H 1
| #define HAVE_DLFCN_H 1
| #ifdef __cplusplus
| void exit (int);
| #endif
| #define PROTOTYPES 1
| #define STDC_HEADERS 1
| #define HAVE_STRING_H 1
| #define STDC_HEADERS 1
| #define HAVE_DLFCN_H 1
| #define HAVE_TIME_H 1
| #define HAVE_SYS_TIME_H 1
| #define HAVE_PWD_H 1
| #define HAVE_SYS_STATVFS_H 1
| #define HAVE_SYS_VFS_H 1
| #define HAVE_SYS_PARAM_H 1
| #define HAVE_NETDB_H 1
| #define HAVE_SYS_IOCTL_H 1
| #define HAVE_NET_IF_H 1
| #define HAVE_SYS_UTSNAME_H 1
| /* end confdefs.h.  */
| #include <sysent.h>
configure:10315: result: no
configure:10351: checking for sysent.h
configure:10358: result: no
configure:10234: checking for unistd.h
configure:10239: result: yes
configure:10243: checking sys/unistd.h usability
configure:10256: gcc -c    conftest.c >&5
configure:10259: $? = 0
configure:10262: test -s conftest.o
configure:10265: $? = 0
configure:10275: result: yes
configure:10279: checking sys/unistd.h presence
configure:10290: gcc -E  conftest.c
configure:10296: $? = 0
configure:10315: result: yes
configure:10351: checking for sys/unistd.h
configure:10358: result: yes
configure:10243: checking sys/socket.h usability
configure:10256: gcc -c    conftest.c >&5
configure:10259: $? = 0
configure:10262: test -s conftest.o
configure:10265: $? = 0
configure:10275: result: yes
configure:10279: checking sys/socket.h presence
configure:10290: gcc -E  conftest.c
configure:10296: $? = 0
configure:10315: result: yes
configure:10351: checking for sys/socket.h
configure:10358: result: yes
configure:10389: checking ndir.h usability
configure:10402: gcc -c    conftest.c >&5
configure:10467:18: error: ndir.h: No such file or directory
configure:10405: $? = 1
configure: failed program was:
| #line 10391 "configure"
| /* confdefs.h.  */
| 
| #define PACKAGE_NAME ""
| #define PACKAGE_TARNAME ""
| #define PACKAGE_VERSION ""
| #define PACKAGE_STRING ""
| #define PACKAGE_BUGREPORT ""
| #define PACKAGE "OpenCAS"
| #define VERSION "5.0DVP1"
| #define STDC_HEADERS 1
| #define HAVE_SYS_TYPES_H 1
| #define HAVE_SYS_STAT_H 1
| #define HAVE_STDLIB_H 1
| #define HAVE_STRING_H 1
| #define HAVE_MEMORY_H 1
| #define HAVE_STRINGS_H 1
| #define HAVE_INTTYPES_H 1
| #define HAVE_STDINT_H 1
| #define HAVE_UNISTD_H 1
| #define HAVE_DLFCN_H 1
| #ifdef __cplusplus
| void exit (int);
| #endif
| #define PROTOTYPES 1
| #define STDC_HEADERS 1
| #define HAVE_STRING_H 1
| #define STDC_HEADERS 1
| #define HAVE_DLFCN_H 1
| #define HAVE_TIME_H 1
| #define HAVE_SYS_TIME_H 1
| #define HAVE_PWD_H 1
| #define HAVE_SYS_STATVFS_H 1
| #define HAVE_SYS_VFS_H 1
| #define HAVE_SYS_PARAM_H 1
| #define HAVE_NETDB_H 1
| #define HAVE_SYS_IOCTL_H 1
| #define HAVE_NET_IF_H 1
| #define HAVE_SYS_UTSNAME_H 1
| #define HAVE_UNISTD_H 1
| #define HAVE_SYS_UNISTD_H 1
| #define HAVE_SYS_SOCKET_H 1
| /* end confdefs.h.  */
| #include <stdio.h>
| #if HAVE_SYS_TYPES_H
| # include <sys/types.h>
| #endif
| #if HAVE_SYS_STAT_H
| # include <sys/stat.h>
| #endif
| #if STDC_HEADERS
| # include <stdlib.h>
| # include <stddef.h>
| #else
| # if HAVE_STDLIB_H
| #  include <stdlib.h>
| # endif
| #endif
| #if HAVE_STRING_H
| # if !STDC_HEADERS && HAVE_MEMORY_H
| #  include <memory.h>
| # endif
| # include <string.h>
| #endif
| #if HAVE_STRINGS_H
| # include <strings.h>
| #endif
| #if HAVE_INTTYPES_H
| # include <inttypes.h>
| #else
| # if HAVE_STDINT_H
| #  include <stdint.h>
| # endif
| #endif
| #if HAVE_UNISTD_H
| # include <unistd.h>
| #endif
| #include <ndir.h>
configure:10421: result: no
configure:10425: checking ndir.h presence
configure:10436: gcc -E  conftest.c
configure:10469:18: error: ndir.h: No such file or directory
configure:10442: $? = 1
configure: failed program was:
| #line 10427 "configure"
| /* confdefs.h.  */
| 
| #define PACKAGE_NAME ""
| #define PACKAGE_TARNAME ""
| #define PACKAGE_VERSION ""
| #define PACKAGE_STRING ""
| #define PACKAGE_BUGREPORT ""
| #define PACKAGE "OpenCAS"
| #define VERSION "5.0DVP1"
| #define STDC_HEADERS 1
| #define HAVE_SYS_TYPES_H 1
| #define HAVE_SYS_STAT_H 1
| #define HAVE_STDLIB_H 1
| #define HAVE_STRING_H 1
| #define HAVE_MEMORY_H 1
| #define HAVE_STRINGS_H 1
| #define HAVE_INTTYPES_H 1
| #define HAVE_STDINT_H 1
| #define HAVE_UNISTD_H 1
| #define HAVE_DLFCN_H 1
| #ifdef __cplusplus
| void exit (int);
| #endif
| #define PROTOTYPES 1
| #define STDC_HEADERS 1
| #define HAVE_STRING_H 1
| #define STDC_HEADERS 1
| #define HAVE_DLFCN_H 1
| #define HAVE_TIME_H 1
| #define HAVE_SYS_TIME_H 1
| #define HAVE_PWD_H 1
| #define HAVE_SYS_STATVFS_H 1
| #define HAVE_SYS_VFS_H 1
| #define HAVE_SYS_PARAM_H 1
| #define HAVE_NETDB_H 1
| #define HAVE_SYS_IOCTL_H 1
| #define HAVE_NET_IF_H 1
| #define HAVE_SYS_UTSNAME_H 1
| #define HAVE_UNISTD_H 1
| #define HAVE_SYS_UNISTD_H 1
| #define HAVE_SYS_SOCKET_H 1
| /* end confdefs.h.  */
| #include <ndir.h>
configure:10461: result: no
configure:10497: checking for ndir.h
configure:10504: result: no
configure:10389: checking sys/ndir.h usability
configure:10402: gcc -c    conftest.c >&5
configure:10467:22: error: sys/ndir.h: No such file or directory
configure:10405: $? = 1
configure: failed program was:
| #line 10391 "configure"
| /* confdefs.h.  */
| 
| #define PACKAGE_NAME ""
| #define PACKAGE_TARNAME ""
| #define PACKAGE_VERSION ""
| #define PACKAGE_STRING ""
| #define PACKAGE_BUGREPORT ""
| #define PACKAGE "OpenCAS"
| #define VERSION "5.0DVP1"
| #define STDC_HEADERS 1
| #define HAVE_SYS_TYPES_H 1
| #define HAVE_SYS_STAT_H 1
| #define HAVE_STDLIB_H 1
| #define HAVE_STRING_H 1
| #define HAVE_MEMORY_H 1
| #define HAVE_STRINGS_H 1
| #define HAVE_INTTYPES_H 1
| #define HAVE_STDINT_H 1
| #define HAVE_UNISTD_H 1
| #define HAVE_DLFCN_H 1
| #ifdef __cplusplus
| void exit (int);
| #endif
| #define PROTOTYPES 1
| #define STDC_HEADERS 1
| #define HAVE_STRING_H 1
| #define STDC_HEADERS 1
| #define HAVE_DLFCN_H 1
| #define HAVE_TIME_H 1
| #define HAVE_SYS_TIME_H 1
| #define HAVE_PWD_H 1
| #define HAVE_SYS_STATVFS_H 1
| #define HAVE_SYS_VFS_H 1
| #define HAVE_SYS_PARAM_H 1
| #define HAVE_NETDB_H 1
| #define HAVE_SYS_IOCTL_H 1
| #define HAVE_NET_IF_H 1
| #define HAVE_SYS_UTSNAME_H 1
| #define HAVE_UNISTD_H 1
| #define HAVE_SYS_UNISTD_H 1
| #define HAVE_SYS_SOCKET_H 1
| /* end confdefs.h.  */
| #include <stdio.h>
| #if HAVE_SYS_TYPES_H
| # include <sys/types.h>
| #endif
| #if HAVE_SYS_STAT_H
| # include <sys/stat.h>
| #endif
| #if STDC_HEADERS
| # include <stdlib.h>
| # include <stddef.h>
| #else
| # if HAVE_STDLIB_H
| #  include <stdlib.h>
| # endif
| #endif
| #if HAVE_STRING_H
| # if !STDC_HEADERS && HAVE_MEMORY_H
| #  include <memory.h>
| # endif
| # include <string.h>
| #endif
| #if HAVE_STRINGS_H
| # include <strings.h>
| #endif
| #if HAVE_INTTYPES_H
| # include <inttypes.h>
| #else
| # if HAVE_STDINT_H
| #  include <stdint.h>
| # endif
| #endif
| #if HAVE_UNISTD_H
| # include <unistd.h>
| #endif
| #include <sys/ndir.h>
configure:10421: result: no
configure:10425: checking sys/ndir.h presence
configure:10436: gcc -E  conftest.c
configure:10469:22: error: sys/ndir.h: No such file or directory
configure:10442: $? = 1
configure: failed program was:
| #line 10427 "configure"
| /* confdefs.h.  */
| 
| #define PACKAGE_NAME ""
| #define PACKAGE_TARNAME ""
| #define PACKAGE_VERSION ""
| #define PACKAGE_STRING ""
| #define PACKAGE_BUGREPORT ""
| #define PACKAGE "OpenCAS"
| #define VERSION "5.0DVP1"
| #define STDC_HEADERS 1
| #define HAVE_SYS_TYPES_H 1
| #define HAVE_SYS_STAT_H 1
| #define HAVE_STDLIB_H 1
| #define HAVE_STRING_H 1
| #define HAVE_MEMORY_H 1
| #define HAVE_STRINGS_H 1
| #define HAVE_INTTYPES_H 1
| #define HAVE_STDINT_H 1
| #define HAVE_UNISTD_H 1
| #define HAVE_DLFCN_H 1
| #ifdef __cplusplus
| void exit (int);
| #endif
| #define PROTOTYPES 1
| #define STDC_HEADERS 1
| #define HAVE_STRING_H 1
| #define STDC_HEADERS 1
| #define HAVE_DLFCN_H 1
| #define HAVE_TIME_H 1
| #define HAVE_SYS_TIME_H 1
| #define HAVE_PWD_H 1
| #define HAVE_SYS_STATVFS_H 1
| #define HAVE_SYS_VFS_H 1
| #define HAVE_SYS_PARAM_H 1
| #define HAVE_NETDB_H 1
| #define HAVE_SYS_IOCTL_H 1
| #define HAVE_NET_IF_H 1
| #define HAVE_SYS_UTSNAME_H 1
| #define HAVE_UNISTD_H 1
| #define HAVE_SYS_UNISTD_H 1
| #define HAVE_SYS_SOCKET_H 1
| /* end confdefs.h.  */
| #include <sys/ndir.h>
configure:10461: result: no
configure:10497: checking for sys/ndir.h
configure:10504: result: no
configure:10389: checking sys/dir.h usability
configure:10402: gcc -c    conftest.c >&5
configure:10405: $? = 0
configure:10408: test -s conftest.o
configure:10411: $? = 0
configure:10421: result: yes
configure:10425: checking sys/dir.h presence
configure:10436: gcc -E  conftest.c
configure:10442: $? = 0
configure:10461: result: yes
configure:10497: checking for sys/dir.h
configure:10504: result: yes
configure:10389: checking signal.h usability
configure:10402: gcc -c    conftest.c >&5
configure:10405: $? = 0
configure:10408: test -s conftest.o
configure:10411: $? = 0
configure:10421: result: yes
configure:10425: checking signal.h presence
configure:10436: gcc -E  conftest.c
configure:10442: $? = 0
configure:10461: result: yes
configure:10497: checking for signal.h
configure:10504: result: yes
configure:10389: checking sys/signal.h usability
configure:10402: gcc -c    conftest.c >&5
configure:10405: $? = 0
configure:10408: test -s conftest.o
configure:10411: $? = 0
configure:10421: result: yes
configure:10425: checking sys/signal.h presence
configure:10436: gcc -E  conftest.c
configure:10442: $? = 0
configure:10461: result: yes
configure:10497: checking for sys/signal.h
configure:10504: result: yes
configure:10534: checking sigfpe.h usability
configure:10547: gcc -c    conftest.c >&5
configure:10615:20: error: sigfpe.h: No such file or directory
configure:10550: $? = 1
configure: failed program was:
| #line 10536 "configure"
| /* confdefs.h.  */
| 
| #define PACKAGE_NAME ""
| #define PACKAGE_TARNAME ""
| #define PACKAGE_VERSION ""
| #define PACKAGE_STRING ""
| #define PACKAGE_BUGREPORT ""
| #define PACKAGE "OpenCAS"
| #define VERSION "5.0DVP1"
| #define STDC_HEADERS 1
| #define HAVE_SYS_TYPES_H 1
| #define HAVE_SYS_STAT_H 1
| #define HAVE_STDLIB_H 1
| #define HAVE_STRING_H 1
| #define HAVE_MEMORY_H 1
| #define HAVE_STRINGS_H 1
| #define HAVE_INTTYPES_H 1
| #define HAVE_STDINT_H 1
| #define HAVE_UNISTD_H 1
| #define HAVE_DLFCN_H 1
| #ifdef __cplusplus
| void exit (int);
| #endif
| #define PROTOTYPES 1
| #define STDC_HEADERS 1
| #define HAVE_STRING_H 1
| #define STDC_HEADERS 1
| #define HAVE_DLFCN_H 1
| #define HAVE_TIME_H 1
| #define HAVE_SYS_TIME_H 1
| #define HAVE_PWD_H 1
| #define HAVE_SYS_STATVFS_H 1
| #define HAVE_SYS_VFS_H 1
| #define HAVE_SYS_PARAM_H 1
| #define HAVE_NETDB_H 1
| #define HAVE_SYS_IOCTL_H 1
| #define HAVE_NET_IF_H 1
| #define HAVE_SYS_UTSNAME_H 1
| #define HAVE_UNISTD_H 1
| #define HAVE_SYS_UNISTD_H 1
| #define HAVE_SYS_SOCKET_H 1
| #define HAVE_SYS_DIR_H 1
| #define HAVE_SIGNAL_H 1
| #define HAVE_SYS_SIGNAL_H 1
| /* end confdefs.h.  */
| #include <stdio.h>
| #if HAVE_SYS_TYPES_H
| # include <sys/types.h>
| #endif
| #if HAVE_SYS_STAT_H
| # include <sys/stat.h>
| #endif
| #if STDC_HEADERS
| # include <stdlib.h>
| # include <stddef.h>
| #else
| # if HAVE_STDLIB_H
| #  include <stdlib.h>
| # endif
| #endif
| #if HAVE_STRING_H
| # if !STDC_HEADERS && HAVE_MEMORY_H
| #  include <memory.h>
| # endif
| # include <string.h>
| #endif
| #if HAVE_STRINGS_H
| # include <strings.h>
| #endif
| #if HAVE_INTTYPES_H
| # include <inttypes.h>
| #else
| # if HAVE_STDINT_H
| #  include <stdint.h>
| # endif
| #endif
| #if HAVE_UNISTD_H
| # include <unistd.h>
| #endif
| #include <sigfpe.h>
configure:10566: result: no
configure:10570: checking sigfpe.h presence
configure:10581: gcc -E  conftest.c
configure:10617:20: error: sigfpe.h: No such file or directory
configure:10587: $? = 1
configure: failed program was:
| #line 10572 "configure"
| /* confdefs.h.  */
| 
| #define PACKAGE_NAME ""
| #define PACKAGE_TARNAME ""
| #define PACKAGE_VERSION ""
| #define PACKAGE_STRING ""
| #define PACKAGE_BUGREPORT ""
| #define PACKAGE "OpenCAS"
| #define VERSION "5.0DVP1"
| #define STDC_HEADERS 1
| #define HAVE_SYS_TYPES_H 1
| #define HAVE_SYS_STAT_H 1
| #define HAVE_STDLIB_H 1
| #define HAVE_STRING_H 1
| #define HAVE_MEMORY_H 1
| #define HAVE_STRINGS_H 1
| #define HAVE_INTTYPES_H 1
| #define HAVE_STDINT_H 1
| #define HAVE_UNISTD_H 1
| #define HAVE_DLFCN_H 1
| #ifdef __cplusplus
| void exit (int);
| #endif
| #define PROTOTYPES 1
| #define STDC_HEADERS 1
| #define HAVE_STRING_H 1
| #define STDC_HEADERS 1
| #define HAVE_DLFCN_H 1
| #define HAVE_TIME_H 1
| #define HAVE_SYS_TIME_H 1
| #define HAVE_PWD_H 1
| #define HAVE_SYS_STATVFS_H 1
| #define HAVE_SYS_VFS_H 1
| #define HAVE_SYS_PARAM_H 1
| #define HAVE_NETDB_H 1
| #define HAVE_SYS_IOCTL_H 1
| #define HAVE_NET_IF_H 1
| #define HAVE_SYS_UTSNAME_H 1
| #define HAVE_UNISTD_H 1
| #define HAVE_SYS_UNISTD_H 1
| #define HAVE_SYS_SOCKET_H 1
| #define HAVE_SYS_DIR_H 1
| #define HAVE_SIGNAL_H 1
| #define HAVE_SYS_SIGNAL_H 1
| /* end confdefs.h.  */
| #include <sigfpe.h>
configure:10606: result: no
configure:10642: checking for sigfpe.h
configure:10649: result: no
configure:10534: checking floatingpoint.h usability
configure:10547: gcc -c    conftest.c >&5
configure:10615:27: error: floatingpoint.h: No such file or directory
configure:10550: $? = 1
configure: failed program was:
| #line 10536 "configure"
| /* confdefs.h.  */
| 
| #define PACKAGE_NAME ""
| #define PACKAGE_TARNAME ""
| #define PACKAGE_VERSION ""
| #define PACKAGE_STRING ""
| #define PACKAGE_BUGREPORT ""
| #define PACKAGE "OpenCAS"
| #define VERSION "5.0DVP1"
| #define STDC_HEADERS 1
| #define HAVE_SYS_TYPES_H 1
| #define HAVE_SYS_STAT_H 1
| #define HAVE_STDLIB_H 1
| #define HAVE_STRING_H 1
| #define HAVE_MEMORY_H 1
| #define HAVE_STRINGS_H 1
| #define HAVE_INTTYPES_H 1
| #define HAVE_STDINT_H 1
| #define HAVE_UNISTD_H 1
| #define HAVE_DLFCN_H 1
| #ifdef __cplusplus
| void exit (int);
| #endif
| #define PROTOTYPES 1
| #define STDC_HEADERS 1
| #define HAVE_STRING_H 1
| #define STDC_HEADERS 1
| #define HAVE_DLFCN_H 1
| #define HAVE_TIME_H 1
| #define HAVE_SYS_TIME_H 1
| #define HAVE_PWD_H 1
| #define HAVE_SYS_STATVFS_H 1
| #define HAVE_SYS_VFS_H 1
| #define HAVE_SYS_PARAM_H 1
| #define HAVE_NETDB_H 1
| #define HAVE_SYS_IOCTL_H 1
| #define HAVE_NET_IF_H 1
| #define HAVE_SYS_UTSNAME_H 1
| #define HAVE_UNISTD_H 1
| #define HAVE_SYS_UNISTD_H 1
| #define HAVE_SYS_SOCKET_H 1
| #define HAVE_SYS_DIR_H 1
| #define HAVE_SIGNAL_H 1
| #define HAVE_SYS_SIGNAL_H 1
| /* end confdefs.h.  */
| #include <stdio.h>
| #if HAVE_SYS_TYPES_H
| # include <sys/types.h>
| #endif
| #if HAVE_SYS_STAT_H
| # include <sys/stat.h>
| #endif
| #if STDC_HEADERS
| # include <stdlib.h>
| # include <stddef.h>
| #else
| # if HAVE_STDLIB_H
| #  include <stdlib.h>
| # endif
| #endif
| #if HAVE_STRING_H
| # if !STDC_HEADERS && HAVE_MEMORY_H
| #  include <memory.h>
| # endif
| # include <string.h>
| #endif
| #if HAVE_STRINGS_H
| # include <strings.h>
| #endif
| #if HAVE_INTTYPES_H
| # include <inttypes.h>
| #else
| # if HAVE_STDINT_H
| #  include <stdint.h>
| # endif
| #endif
| #if HAVE_UNISTD_H
| # include <unistd.h>
| #endif
| #include <floatingpoint.h>
configure:10566: result: no
configure:10570: checking floatingpoint.h presence
configure:10581: gcc -E  conftest.c
configure:10617:27: error: floatingpoint.h: No such file or directory
configure:10587: $? = 1
configure: failed program was:
| #line 10572 "configure"
| /* confdefs.h.  */
| 
| #define PACKAGE_NAME ""
| #define PACKAGE_TARNAME ""
| #define PACKAGE_VERSION ""
| #define PACKAGE_STRING ""
| #define PACKAGE_BUGREPORT ""
| #define PACKAGE "OpenCAS"
| #define VERSION "5.0DVP1"
| #define STDC_HEADERS 1
| #define HAVE_SYS_TYPES_H 1
| #define HAVE_SYS_STAT_H 1
| #define HAVE_STDLIB_H 1
| #define HAVE_STRING_H 1
| #define HAVE_MEMORY_H 1
| #define HAVE_STRINGS_H 1
| #define HAVE_INTTYPES_H 1
| #define HAVE_STDINT_H 1
| #define HAVE_UNISTD_H 1
| #define HAVE_DLFCN_H 1
| #ifdef __cplusplus
| void exit (int);
| #endif
| #define PROTOTYPES 1
| #define STDC_HEADERS 1
| #define HAVE_STRING_H 1
| #define STDC_HEADERS 1
| #define HAVE_DLFCN_H 1
| #define HAVE_TIME_H 1
| #define HAVE_SYS_TIME_H 1
| #define HAVE_PWD_H 1
| #define HAVE_SYS_STATVFS_H 1
| #define HAVE_SYS_VFS_H 1
| #define HAVE_SYS_PARAM_H 1
| #define HAVE_NETDB_H 1
| #define HAVE_SYS_IOCTL_H 1
| #define HAVE_NET_IF_H 1
| #define HAVE_SYS_UTSNAME_H 1
| #define HAVE_UNISTD_H 1
| #define HAVE_SYS_UNISTD_H 1
| #define HAVE_SYS_SOCKET_H 1
| #define HAVE_SYS_DIR_H 1
| #define HAVE_SIGNAL_H 1
| #define HAVE_SYS_SIGNAL_H 1
| /* end confdefs.h.  */
| #include <floatingpoint.h>
configure:10606: result: no
configure:10642: checking for floatingpoint.h
configure:10649: result: no
configure:10534: checking sys/machsig.h usability
configure:10547: gcc -c    conftest.c >&5
configure:10615:25: error: sys/machsig.h: No such file or directory
configure:10550: $? = 1
configure: failed program was:
| #line 10536 "configure"
| /* confdefs.h.  */
| 
| #define PACKAGE_NAME ""
| #define PACKAGE_TARNAME ""
| #define PACKAGE_VERSION ""
| #define PACKAGE_STRING ""
| #define PACKAGE_BUGREPORT ""
| #define PACKAGE "OpenCAS"
| #define VERSION "5.0DVP1"
| #define STDC_HEADERS 1
| #define HAVE_SYS_TYPES_H 1
| #define HAVE_SYS_STAT_H 1
| #define HAVE_STDLIB_H 1
| #define HAVE_STRING_H 1
| #define HAVE_MEMORY_H 1
| #define HAVE_STRINGS_H 1
| #define HAVE_INTTYPES_H 1
| #define HAVE_STDINT_H 1
| #define HAVE_UNISTD_H 1
| #define HAVE_DLFCN_H 1
| #ifdef __cplusplus
| void exit (int);
| #endif
| #define PROTOTYPES 1
| #define STDC_HEADERS 1
| #define HAVE_STRING_H 1
| #define STDC_HEADERS 1
| #define HAVE_DLFCN_H 1
| #define HAVE_TIME_H 1
| #define HAVE_SYS_TIME_H 1
| #define HAVE_PWD_H 1
| #define HAVE_SYS_STATVFS_H 1
| #define HAVE_SYS_VFS_H 1
| #define HAVE_SYS_PARAM_H 1
| #define HAVE_NETDB_H 1
| #define HAVE_SYS_IOCTL_H 1
| #define HAVE_NET_IF_H 1
| #define HAVE_SYS_UTSNAME_H 1
| #define HAVE_UNISTD_H 1
| #define HAVE_SYS_UNISTD_H 1
| #define HAVE_SYS_SOCKET_H 1
| #define HAVE_SYS_DIR_H 1
| #define HAVE_SIGNAL_H 1
| #define HAVE_SYS_SIGNAL_H 1
| /* end confdefs.h.  */
| #include <stdio.h>
| #if HAVE_SYS_TYPES_H
| # include <sys/types.h>
| #endif
| #if HAVE_SYS_STAT_H
| # include <sys/stat.h>
| #endif
| #if STDC_HEADERS
| # include <stdlib.h>
| # include <stddef.h>
| #else
| # if HAVE_STDLIB_H
| #  include <stdlib.h>
| # endif
| #endif
| #if HAVE_STRING_H
| # if !STDC_HEADERS && HAVE_MEMORY_H
| #  include <memory.h>
| # endif
| # include <string.h>
| #endif
| #if HAVE_STRINGS_H
| # include <strings.h>
| #endif
| #if HAVE_INTTYPES_H
| # include <inttypes.h>
| #else
| # if HAVE_STDINT_H
| #  include <stdint.h>
| # endif
| #endif
| #if HAVE_UNISTD_H
| # include <unistd.h>
| #endif
| #include <sys/machsig.h>
configure:10566: result: no
configure:10570: checking sys/machsig.h presence
configure:10581: gcc -E  conftest.c
configure:10617:25: error: sys/machsig.h: No such file or directory
configure:10587: $? = 1
configure: failed program was:
| #line 10572 "configure"
| /* confdefs.h.  */
| 
| #define PACKAGE_NAME ""
| #define PACKAGE_TARNAME ""
| #define PACKAGE_VERSION ""
| #define PACKAGE_STRING ""
| #define PACKAGE_BUGREPORT ""
| #define PACKAGE "OpenCAS"
| #define VERSION "5.0DVP1"
| #define STDC_HEADERS 1
| #define HAVE_SYS_TYPES_H 1
| #define HAVE_SYS_STAT_H 1
| #define HAVE_STDLIB_H 1
| #define HAVE_STRING_H 1
| #define HAVE_MEMORY_H 1
| #define HAVE_STRINGS_H 1
| #define HAVE_INTTYPES_H 1
| #define HAVE_STDINT_H 1
| #define HAVE_UNISTD_H 1
| #define HAVE_DLFCN_H 1
| #ifdef __cplusplus
| void exit (int);
| #endif
| #define PROTOTYPES 1
| #define STDC_HEADERS 1
| #define HAVE_STRING_H 1
| #define STDC_HEADERS 1
| #define HAVE_DLFCN_H 1
| #define HAVE_TIME_H 1
| #define HAVE_SYS_TIME_H 1
| #define HAVE_PWD_H 1
| #define HAVE_SYS_STATVFS_H 1
| #define HAVE_SYS_VFS_H 1
| #define HAVE_SYS_PARAM_H 1
| #define HAVE_NETDB_H 1
| #define HAVE_SYS_IOCTL_H 1
| #define HAVE_NET_IF_H 1
| #define HAVE_SYS_UTSNAME_H 1
| #define HAVE_UNISTD_H 1
| #define HAVE_SYS_UNISTD_H 1
| #define HAVE_SYS_SOCKET_H 1
| #define HAVE_SYS_DIR_H 1
| #define HAVE_SIGNAL_H 1
| #define HAVE_SYS_SIGNAL_H 1
| /* end confdefs.h.  */
| #include <sys/machsig.h>
configure:10606: result: no
configure:10642: checking for sys/machsig.h
configure:10649: result: no
configure:10534: checking sys/siginfo.h usability
configure:10547: gcc -c    conftest.c >&5
configure:10615:25: error: sys/siginfo.h: No such file or directory
configure:10550: $? = 1
configure: failed program was:
| #line 10536 "configure"
| /* confdefs.h.  */
| 
| #define PACKAGE_NAME ""
| #define PACKAGE_TARNAME ""
| #define PACKAGE_VERSION ""
| #define PACKAGE_STRING ""
| #define PACKAGE_BUGREPORT ""
| #define PACKAGE "OpenCAS"
| #define VERSION "5.0DVP1"
| #define STDC_HEADERS 1
| #define HAVE_SYS_TYPES_H 1
| #define HAVE_SYS_STAT_H 1
| #define HAVE_STDLIB_H 1
| #define HAVE_STRING_H 1
| #define HAVE_MEMORY_H 1
| #define HAVE_STRINGS_H 1
| #define HAVE_INTTYPES_H 1
| #define HAVE_STDINT_H 1
| #define HAVE_UNISTD_H 1
| #define HAVE_DLFCN_H 1
| #ifdef __cplusplus
| void exit (int);
| #endif
| #define PROTOTYPES 1
| #define STDC_HEADERS 1
| #define HAVE_STRING_H 1
| #define STDC_HEADERS 1
| #define HAVE_DLFCN_H 1
| #define HAVE_TIME_H 1
| #define HAVE_SYS_TIME_H 1
| #define HAVE_PWD_H 1
| #define HAVE_SYS_STATVFS_H 1
| #define HAVE_SYS_VFS_H 1
| #define HAVE_SYS_PARAM_H 1
| #define HAVE_NETDB_H 1
| #define HAVE_SYS_IOCTL_H 1
| #define HAVE_NET_IF_H 1
| #define HAVE_SYS_UTSNAME_H 1
| #define HAVE_UNISTD_H 1
| #define HAVE_SYS_UNISTD_H 1
| #define HAVE_SYS_SOCKET_H 1
| #define HAVE_SYS_DIR_H 1
| #define HAVE_SIGNAL_H 1
| #define HAVE_SYS_SIGNAL_H 1
| /* end confdefs.h.  */
| #include <stdio.h>
| #if HAVE_SYS_TYPES_H
| # include <sys/types.h>
| #endif
| #if HAVE_SYS_STAT_H
| # include <sys/stat.h>
| #endif
| #if STDC_HEADERS
| # include <stdlib.h>
| # include <stddef.h>
| #else
| # if HAVE_STDLIB_H
| #  include <stdlib.h>
| # endif
| #endif
| #if HAVE_STRING_H
| # if !STDC_HEADERS && HAVE_MEMORY_H
| #  include <memory.h>
| # endif
| # include <string.h>
| #endif
| #if HAVE_STRINGS_H
| # include <strings.h>
| #endif
| #if HAVE_INTTYPES_H
| # include <inttypes.h>
| #else
| # if HAVE_STDINT_H
| #  include <stdint.h>
| # endif
| #endif
| #if HAVE_UNISTD_H
| # include <unistd.h>
| #endif
| #include <sys/siginfo.h>
configure:10566: result: no
configure:10570: checking sys/siginfo.h presence
configure:10581: gcc -E  conftest.c
configure:10617:25: error: sys/siginfo.h: No such file or directory
configure:10587: $? = 1
configure: failed program was:
| #line 10572 "configure"
| /* confdefs.h.  */
| 
| #define PACKAGE_NAME ""
| #define PACKAGE_TARNAME ""
| #define PACKAGE_VERSION ""
| #define PACKAGE_STRING ""
| #define PACKAGE_BUGREPORT ""
| #define PACKAGE "OpenCAS"
| #define VERSION "5.0DVP1"
| #define STDC_HEADERS 1
| #define HAVE_SYS_TYPES_H 1
| #define HAVE_SYS_STAT_H 1
| #define HAVE_STDLIB_H 1
| #define HAVE_STRING_H 1
| #define HAVE_MEMORY_H 1
| #define HAVE_STRINGS_H 1
| #define HAVE_INTTYPES_H 1
| #define HAVE_STDINT_H 1
| #define HAVE_UNISTD_H 1
| #define HAVE_DLFCN_H 1
| #ifdef __cplusplus
| void exit (int);
| #endif
| #define PROTOTYPES 1
| #define STDC_HEADERS 1
| #define HAVE_STRING_H 1
| #define STDC_HEADERS 1
| #define HAVE_DLFCN_H 1
| #define HAVE_TIME_H 1
| #define HAVE_SYS_TIME_H 1
| #define HAVE_PWD_H 1
| #define HAVE_SYS_STATVFS_H 1
| #define HAVE_SYS_VFS_H 1
| #define HAVE_SYS_PARAM_H 1
| #define HAVE_NETDB_H 1
| #define HAVE_SYS_IOCTL_H 1
| #define HAVE_NET_IF_H 1
| #define HAVE_SYS_UTSNAME_H 1
| #define HAVE_UNISTD_H 1
| #define HAVE_SYS_UNISTD_H 1
| #define HAVE_SYS_SOCKET_H 1
| #define HAVE_SYS_DIR_H 1
| #define HAVE_SIGNAL_H 1
| #define HAVE_SYS_SIGNAL_H 1
| /* end confdefs.h.  */
| #include <sys/siginfo.h>
configure:10606: result: no
configure:10642: checking for sys/siginfo.h
configure:10649: result: no
configure:10680: checking malloc.h usability
configure:10693: gcc -c    conftest.c >&5
configure:10696: $? = 0
configure:10699: test -s conftest.o
configure:10702: $? = 0
configure:10712: result: yes
configure:10716: checking malloc.h presence
configure:10727: gcc -E  conftest.c
configure:10733: $? = 0
configure:10752: result: yes
configure:10788: checking for malloc.h
configure:10795: result: yes
configure:10671: checking for strings.h
configure:10676: result: yes
configure:10671: checking for sys/stat.h
configure:10676: result: yes
configure:10680: checking sys/sem.h usability
configure:10693: gcc -c    conftest.c >&5
configure:10696: $? = 0
configure:10699: test -s conftest.o
configure:10702: $? = 0
configure:10712: result: yes
configure:10716: checking sys/sem.h presence
configure:10727: gcc -E  conftest.c
configure:10733: $? = 0
configure:10752: result: yes
configure:10788: checking for sys/sem.h
configure:10795: result: yes
configure:10680: checking sys/ipc.h usability
configure:10693: gcc -c    conftest.c >&5
configure:10696: $? = 0
configure:10699: test -s conftest.o
configure:10702: $? = 0
configure:10712: result: yes
configure:10716: checking sys/ipc.h presence
configure:10727: gcc -E  conftest.c
configure:10733: $? = 0
configure:10752: result: yes
configure:10788: checking for sys/ipc.h
configure:10795: result: yes
configure:10825: checking sys/times.h usability
configure:10838: gcc -c    conftest.c >&5
configure:10841: $? = 0
configure:10844: test -s conftest.o
configure:10847: $? = 0
configure:10857: result: yes
configure:10861: checking sys/times.h presence
configure:10872: gcc -E  conftest.c
configure:10878: $? = 0
configure:10897: result: yes
configure:10933: checking for sys/times.h
configure:10940: result: yes
configure:10825: checking dirent.h usability
configure:10838: gcc -c    conftest.c >&5
configure:10841: $? = 0
configure:10844: test -s conftest.o
configure:10847: $? = 0
configure:10857: result: yes
configure:10861: checking dirent.h presence
configure:10872: gcc -E  conftest.c
configure:10878: $? = 0
configure:10897: result: yes
configure:10933: checking for dirent.h
configure:10940: result: yes
configure:10825: checking getopt.h usability
configure:10838: gcc -c    conftest.c >&5
configure:10841: $? = 0
configure:10844: test -s conftest.o
configure:10847: $? = 0
configure:10857: result: yes
configure:10861: checking getopt.h presence
configure:10872: gcc -E  conftest.c
configure:10878: $? = 0
configure:10897: result: yes
configure:10933: checking for getopt.h
configure:10940: result: yes
configure:10825: checking sys/vnode.h usability
configure:10838: gcc -c    conftest.c >&5
configure:10914:23: error: sys/vnode.h: No such file or directory
configure:10841: $? = 1
configure: failed program was:
| #line 10827 "configure"
| /* confdefs.h.  */
| 
| #define PACKAGE_NAME ""
| #define PACKAGE_TARNAME ""
| #define PACKAGE_VERSION ""
| #define PACKAGE_STRING ""
| #define PACKAGE_BUGREPORT ""
| #define PACKAGE "OpenCAS"
| #define VERSION "5.0DVP1"
| #define STDC_HEADERS 1
| #define HAVE_SYS_TYPES_H 1
| #define HAVE_SYS_STAT_H 1
| #define HAVE_STDLIB_H 1
| #define HAVE_STRING_H 1
| #define HAVE_MEMORY_H 1
| #define HAVE_STRINGS_H 1
| #define HAVE_INTTYPES_H 1
| #define HAVE_STDINT_H 1
| #define HAVE_UNISTD_H 1
| #define HAVE_DLFCN_H 1
| #ifdef __cplusplus
| void exit (int);
| #endif
| #define PROTOTYPES 1
| #define STDC_HEADERS 1
| #define HAVE_STRING_H 1
| #define STDC_HEADERS 1
| #define HAVE_DLFCN_H 1
| #define HAVE_TIME_H 1
| #define HAVE_SYS_TIME_H 1
| #define HAVE_PWD_H 1
| #define HAVE_SYS_STATVFS_H 1
| #define HAVE_SYS_VFS_H 1
| #define HAVE_SYS_PARAM_H 1
| #define HAVE_NETDB_H 1
| #define HAVE_SYS_IOCTL_H 1
| #define HAVE_NET_IF_H 1
| #define HAVE_SYS_UTSNAME_H 1
| #define HAVE_UNISTD_H 1
| #define HAVE_SYS_UNISTD_H 1
| #define HAVE_SYS_SOCKET_H 1
| #define HAVE_SYS_DIR_H 1
| #define HAVE_SIGNAL_H 1
| #define HAVE_SYS_SIGNAL_H 1
| #define HAVE_MALLOC_H 1
| #define HAVE_STRINGS_H 1
| #define HAVE_SYS_STAT_H 1
| #define HAVE_SYS_SEM_H 1
| #define HAVE_SYS_IPC_H 1
| #define HAVE_SYS_TIMES_H 1
| #define HAVE_DIRENT_H 1
| #define HAVE_GETOPT_H 1
| /* end confdefs.h.  */
| #include <stdio.h>
| #if HAVE_SYS_TYPES_H
| # include <sys/types.h>
| #endif
| #if HAVE_SYS_STAT_H
| # include <sys/stat.h>
| #endif
| #if STDC_HEADERS
| # include <stdlib.h>
| # include <stddef.h>
| #else
| # if HAVE_STDLIB_H
| #  include <stdlib.h>
| # endif
| #endif
| #if HAVE_STRING_H
| # if !STDC_HEADERS && HAVE_MEMORY_H
| #  include <memory.h>
| # endif
| # include <string.h>
| #endif
| #if HAVE_STRINGS_H
| # include <strings.h>
| #endif
| #if HAVE_INTTYPES_H
| # include <inttypes.h>
| #else
| # if HAVE_STDINT_H
| #  include <stdint.h>
| # endif
| #endif
| #if HAVE_UNISTD_H
| # include <unistd.h>
| #endif
| #include <sys/vnode.h>
configure:10857: result: no
configure:10861: checking sys/vnode.h presence
configure:10872: gcc -E  conftest.c
configure:10916:23: error: sys/vnode.h: No such file or directory
configure:10878: $? = 1
configure: failed program was:
| #line 10863 "configure"
| /* confdefs.h.  */
| 
| #define PACKAGE_NAME ""
| #define PACKAGE_TARNAME ""
| #define PACKAGE_VERSION ""
| #define PACKAGE_STRING ""
| #define PACKAGE_BUGREPORT ""
| #define PACKAGE "OpenCAS"
| #define VERSION "5.0DVP1"
| #define STDC_HEADERS 1
| #define HAVE_SYS_TYPES_H 1
| #define HAVE_SYS_STAT_H 1
| #define HAVE_STDLIB_H 1
| #define HAVE_STRING_H 1
| #define HAVE_MEMORY_H 1
| #define HAVE_STRINGS_H 1
| #define HAVE_INTTYPES_H 1
| #define HAVE_STDINT_H 1
| #define HAVE_UNISTD_H 1
| #define HAVE_DLFCN_H 1
| #ifdef __cplusplus
| void exit (int);
| #endif
| #define PROTOTYPES 1
| #define STDC_HEADERS 1
| #define HAVE_STRING_H 1
| #define STDC_HEADERS 1
| #define HAVE_DLFCN_H 1
| #define HAVE_TIME_H 1
| #define HAVE_SYS_TIME_H 1
| #define HAVE_PWD_H 1
| #define HAVE_SYS_STATVFS_H 1
| #define HAVE_SYS_VFS_H 1
| #define HAVE_SYS_PARAM_H 1
| #define HAVE_NETDB_H 1
| #define HAVE_SYS_IOCTL_H 1
| #define HAVE_NET_IF_H 1
| #define HAVE_SYS_UTSNAME_H 1
| #define HAVE_UNISTD_H 1
| #define HAVE_SYS_UNISTD_H 1
| #define HAVE_SYS_SOCKET_H 1
| #define HAVE_SYS_DIR_H 1
| #define HAVE_SIGNAL_H 1
| #define HAVE_SYS_SIGNAL_H 1
| #define HAVE_MALLOC_H 1
| #define HAVE_STRINGS_H 1
| #define HAVE_SYS_STAT_H 1
| #define HAVE_SYS_SEM_H 1
| #define HAVE_SYS_IPC_H 1
| #define HAVE_SYS_TIMES_H 1
| #define HAVE_DIRENT_H 1
| #define HAVE_GETOPT_H 1
| /* end confdefs.h.  */
| #include <sys/vnode.h>
configure:10897: result: no
configure:10933: checking for sys/vnode.h
configure:10940: result: no
configure:10961: checking  for C++ header files 
configure:10969: checking how to run the C++ preprocessor
configure:11001: g++ -E  conftest.cc
./configure: line 11002: g++: command not found
configure:11007: $? = 127
configure: failed program was:
| #line 10987 "configure"
| /* confdefs.h.  */
| 
| #define PACKAGE_NAME ""
| #define PACKAGE_TARNAME ""
| #define PACKAGE_VERSION ""
| #define PACKAGE_STRING ""
| #define PACKAGE_BUGREPORT ""
| #define PACKAGE "OpenCAS"
| #define VERSION "5.0DVP1"
| #define STDC_HEADERS 1
| #define HAVE_SYS_TYPES_H 1
| #define HAVE_SYS_STAT_H 1
| #define HAVE_STDLIB_H 1
| #define HAVE_STRING_H 1
| #define HAVE_MEMORY_H 1
| #define HAVE_STRINGS_H 1
| #define HAVE_INTTYPES_H 1
| #define HAVE_STDINT_H 1
| #define HAVE_UNISTD_H 1
| #define HAVE_DLFCN_H 1
| #ifdef __cplusplus
| void exit (int);
| #endif
| #define PROTOTYPES 1
| #define STDC_HEADERS 1
| #define HAVE_STRING_H 1
| #define STDC_HEADERS 1
| #define HAVE_DLFCN_H 1
| #define HAVE_TIME_H 1
| #define HAVE_SYS_TIME_H 1
| #define HAVE_PWD_H 1
| #define HAVE_SYS_STATVFS_H 1
| #define HAVE_SYS_VFS_H 1
| #define HAVE_SYS_PARAM_H 1
| #define HAVE_NETDB_H 1
| #define HAVE_SYS_IOCTL_H 1
| #define HAVE_NET_IF_H 1
| #define HAVE_SYS_UTSNAME_H 1
| #define HAVE_UNISTD_H 1
| #define HAVE_SYS_UNISTD_H 1
| #define HAVE_SYS_SOCKET_H 1
| #define HAVE_SYS_DIR_H 1
| #define HAVE_SIGNAL_H 1
| #define HAVE_SYS_SIGNAL_H 1
| #define HAVE_MALLOC_H 1
| #define HAVE_STRINGS_H 1
| #define HAVE_SYS_STAT_H 1
| #define HAVE_SYS_SEM_H 1
| #define HAVE_SYS_IPC_H 1
| #define HAVE_SYS_TIMES_H 1
| #define HAVE_DIRENT_H 1
| #define HAVE_GETOPT_H 1
| /* end confdefs.h.  */
| #ifdef __STDC__
| # include <limits.h>
| #else
| # include <assert.h>
| #endif
|                      Syntax error
configure:11001: g++ -E  conftest.cc
./configure: line 11002: g++: command not found
configure:11007: $? = 127
configure: failed program was:
| #line 10987 "configure"
| /* confdefs.h.  */
| 
| #define PACKAGE_NAME ""
| #define PACKAGE_TARNAME ""
| #define PACKAGE_VERSION ""
| #define PACKAGE_STRING ""
| #define PACKAGE_BUGREPORT ""
| #define PACKAGE "OpenCAS"
| #define VERSION "5.0DVP1"
| #define STDC_HEADERS 1
| #define HAVE_SYS_TYPES_H 1
| #define HAVE_SYS_STAT_H 1
| #define HAVE_STDLIB_H 1
| #define HAVE_STRING_H 1
| #define HAVE_MEMORY_H 1
| #define HAVE_STRINGS_H 1
| #define HAVE_INTTYPES_H 1
| #define HAVE_STDINT_H 1
| #define HAVE_UNISTD_H 1
| #define HAVE_DLFCN_H 1
| #ifdef __cplusplus
| void exit (int);
| #endif
| #define PROTOTYPES 1
| #define STDC_HEADERS 1
| #define HAVE_STRING_H 1
| #define STDC_HEADERS 1
| #define HAVE_DLFCN_H 1
| #define HAVE_TIME_H 1
| #define HAVE_SYS_TIME_H 1
| #define HAVE_PWD_H 1
| #define HAVE_SYS_STATVFS_H 1
| #define HAVE_SYS_VFS_H 1
| #define HAVE_SYS_PARAM_H 1
| #define HAVE_NETDB_H 1
| #define HAVE_SYS_IOCTL_H 1
| #define HAVE_NET_IF_H 1
| #define HAVE_SYS_UTSNAME_H 1
| #define HAVE_UNISTD_H 1
| #define HAVE_SYS_UNISTD_H 1
| #define HAVE_SYS_SOCKET_H 1
| #define HAVE_SYS_DIR_H 1
| #define HAVE_SIGNAL_H 1
| #define HAVE_SYS_SIGNAL_H 1
| #define HAVE_MALLOC_H 1
| #define HAVE_STRINGS_H 1
| #define HAVE_SYS_STAT_H 1
| #define HAVE_SYS_SEM_H 1
| #define HAVE_SYS_IPC_H 1
| #define HAVE_SYS_TIMES_H 1
| #define HAVE_DIRENT_H 1
| #define HAVE_GETOPT_H 1
| /* end confdefs.h.  */
| #ifdef __STDC__
| # include <limits.h>
| #else
| # include <assert.h>
| #endif
|                      Syntax error
configure:11001: /lib/cpp  conftest.cc
cpp: installation problem, cannot exec 'cc1plus': No such file or directory
configure:11007: $? = 1
configure: failed program was:
| #line 10987 "configure"
| /* confdefs.h.  */
| 
| #define PACKAGE_NAME ""
| #define PACKAGE_TARNAME ""
| #define PACKAGE_VERSION ""
| #define PACKAGE_STRING ""
| #define PACKAGE_BUGREPORT ""
| #define PACKAGE "OpenCAS"
| #define VERSION "5.0DVP1"
| #define STDC_HEADERS 1
| #define HAVE_SYS_TYPES_H 1
| #define HAVE_SYS_STAT_H 1
| #define HAVE_STDLIB_H 1
| #define HAVE_STRING_H 1
| #define HAVE_MEMORY_H 1
| #define HAVE_STRINGS_H 1
| #define HAVE_INTTYPES_H 1
| #define HAVE_STDINT_H 1
| #define HAVE_UNISTD_H 1
| #define HAVE_DLFCN_H 1
| #ifdef __cplusplus
| void exit (int);
| #endif
| #define PROTOTYPES 1
| #define STDC_HEADERS 1
| #define HAVE_STRING_H 1
| #define STDC_HEADERS 1
| #define HAVE_DLFCN_H 1
| #define HAVE_TIME_H 1
| #define HAVE_SYS_TIME_H 1
| #define HAVE_PWD_H 1
| #define HAVE_SYS_STATVFS_H 1
| #define HAVE_SYS_VFS_H 1
| #define HAVE_SYS_PARAM_H 1
| #define HAVE_NETDB_H 1
| #define HAVE_SYS_IOCTL_H 1
| #define HAVE_NET_IF_H 1
| #define HAVE_SYS_UTSNAME_H 1
| #define HAVE_UNISTD_H 1
| #define HAVE_SYS_UNISTD_H 1
| #define HAVE_SYS_SOCKET_H 1
| #define HAVE_SYS_DIR_H 1
| #define HAVE_SIGNAL_H 1
| #define HAVE_SYS_SIGNAL_H 1
| #define HAVE_MALLOC_H 1
| #define HAVE_STRINGS_H 1
| #define HAVE_SYS_STAT_H 1
| #define HAVE_SYS_SEM_H 1
| #define HAVE_SYS_IPC_H 1
| #define HAVE_SYS_TIMES_H 1
| #define HAVE_DIRENT_H 1
| #define HAVE_GETOPT_H 1
| /* end confdefs.h.  */
| #ifdef __STDC__
| # include <limits.h>
| #else
| # include <assert.h>
| #endif
|                      Syntax error
configure:11001: /lib/cpp  conftest.cc
cpp: installation problem, cannot exec 'cc1plus': No such file or directory
configure:11007: $? = 1
configure: failed program was:
| #line 10987 "configure"
| /* confdefs.h.  */
| 
| #define PACKAGE_NAME ""
| #define PACKAGE_TARNAME ""
| #define PACKAGE_VERSION ""
| #define PACKAGE_STRING ""
| #define PACKAGE_BUGREPORT ""
| #define PACKAGE "OpenCAS"
| #define VERSION "5.0DVP1"
| #define STDC_HEADERS 1
| #define HAVE_SYS_TYPES_H 1
| #define HAVE_SYS_STAT_H 1
| #define HAVE_STDLIB_H 1
| #define HAVE_STRING_H 1
| #define HAVE_MEMORY_H 1
| #define HAVE_STRINGS_H 1
| #define HAVE_INTTYPES_H 1
| #define HAVE_STDINT_H 1
| #define HAVE_UNISTD_H 1
| #define HAVE_DLFCN_H 1
| #ifdef __cplusplus
| void exit (int);
| #endif
| #define PROTOTYPES 1
| #define STDC_HEADERS 1
| #define HAVE_STRING_H 1
| #define STDC_HEADERS 1
| #define HAVE_DLFCN_H 1
| #define HAVE_TIME_H 1
| #define HAVE_SYS_TIME_H 1
| #define HAVE_PWD_H 1
| #define HAVE_SYS_STATVFS_H 1
| #define HAVE_SYS_VFS_H 1
| #define HAVE_SYS_PARAM_H 1
| #define HAVE_NETDB_H 1
| #define HAVE_SYS_IOCTL_H 1
| #define HAVE_NET_IF_H 1
| #define HAVE_SYS_UTSNAME_H 1
| #define HAVE_UNISTD_H 1
| #define HAVE_SYS_UNISTD_H 1
| #define HAVE_SYS_SOCKET_H 1
| #define HAVE_SYS_DIR_H 1
| #define HAVE_SIGNAL_H 1
| #define HAVE_SYS_SIGNAL_H 1
| #define HAVE_MALLOC_H 1
| #define HAVE_STRINGS_H 1
| #define HAVE_SYS_STAT_H 1
| #define HAVE_SYS_SEM_H 1
| #define HAVE_SYS_IPC_H 1
| #define HAVE_SYS_TIMES_H 1
| #define HAVE_DIRENT_H 1
| #define HAVE_GETOPT_H 1
| /* end confdefs.h.  */
| #ifdef __STDC__
| # include <limits.h>
| #else
| # include <assert.h>
| #endif
|                      Syntax error
configure:11083: result: /lib/cpp
configure:11108: /lib/cpp  conftest.cc
cpp: installation problem, cannot exec 'cc1plus': No such file or directory
configure:11114: $? = 1
configure: failed program was:
| #line 11094 "configure"
| /* confdefs.h.  */
| 
| #define PACKAGE_NAME ""
| #define PACKAGE_TARNAME ""
| #define PACKAGE_VERSION ""
| #define PACKAGE_STRING ""
| #define PACKAGE_BUGREPORT ""
| #define PACKAGE "OpenCAS"
| #define VERSION "5.0DVP1"
| #define STDC_HEADERS 1
| #define HAVE_SYS_TYPES_H 1
| #define HAVE_SYS_STAT_H 1
| #define HAVE_STDLIB_H 1
| #define HAVE_STRING_H 1
| #define HAVE_MEMORY_H 1
| #define HAVE_STRINGS_H 1
| #define HAVE_INTTYPES_H 1
| #define HAVE_STDINT_H 1
| #define HAVE_UNISTD_H 1
| #define HAVE_DLFCN_H 1
| #ifdef __cplusplus
| void exit (int);
| #endif
| #define PROTOTYPES 1
| #define STDC_HEADERS 1
| #define HAVE_STRING_H 1
| #define STDC_HEADERS 1
| #define HAVE_DLFCN_H 1
| #define HAVE_TIME_H 1
| #define HAVE_SYS_TIME_H 1
| #define HAVE_PWD_H 1
| #define HAVE_SYS_STATVFS_H 1
| #define HAVE_SYS_VFS_H 1
| #define HAVE_SYS_PARAM_H 1
| #define HAVE_NETDB_H 1
| #define HAVE_SYS_IOCTL_H 1
| #define HAVE_NET_IF_H 1
| #define HAVE_SYS_UTSNAME_H 1
| #define HAVE_UNISTD_H 1
| #define HAVE_SYS_UNISTD_H 1
| #define HAVE_SYS_SOCKET_H 1
| #define HAVE_SYS_DIR_H 1
| #define HAVE_SIGNAL_H 1
| #define HAVE_SYS_SIGNAL_H 1
| #define HAVE_MALLOC_H 1
| #define HAVE_STRINGS_H 1
| #define HAVE_SYS_STAT_H 1
| #define HAVE_SYS_SEM_H 1
| #define HAVE_SYS_IPC_H 1
| #define HAVE_SYS_TIMES_H 1
| #define HAVE_DIRENT_H 1
| #define HAVE_GETOPT_H 1
| /* end confdefs.h.  */
| #ifdef __STDC__
| # include <limits.h>
| #else
| # include <assert.h>
| #endif
|                      Syntax error
configure:11108: /lib/cpp  conftest.cc
cpp: installation problem, cannot exec 'cc1plus': No such file or directory
configure:11114: $? = 1
configure: failed program was:
| #line 11094 "configure"
| /* confdefs.h.  */
| 
| #define PACKAGE_NAME ""
| #define PACKAGE_TARNAME ""
| #define PACKAGE_VERSION ""
| #define PACKAGE_STRING ""
| #define PACKAGE_BUGREPORT ""
| #define PACKAGE "OpenCAS"
| #define VERSION "5.0DVP1"
| #define STDC_HEADERS 1
| #define HAVE_SYS_TYPES_H 1
| #define HAVE_SYS_STAT_H 1
| #define HAVE_STDLIB_H 1
| #define HAVE_STRING_H 1
| #define HAVE_MEMORY_H 1
| #define HAVE_STRINGS_H 1
| #define HAVE_INTTYPES_H 1
| #define HAVE_STDINT_H 1
| #define HAVE_UNISTD_H 1
| #define HAVE_DLFCN_H 1
| #ifdef __cplusplus
| void exit (int);
| #endif
| #define PROTOTYPES 1
| #define STDC_HEADERS 1
| #define HAVE_STRING_H 1
| #define STDC_HEADERS 1
| #define HAVE_DLFCN_H 1
| #define HAVE_TIME_H 1
| #define HAVE_SYS_TIME_H 1
| #define HAVE_PWD_H 1
| #define HAVE_SYS_STATVFS_H 1
| #define HAVE_SYS_VFS_H 1
| #define HAVE_SYS_PARAM_H 1
| #define HAVE_NETDB_H 1
| #define HAVE_SYS_IOCTL_H 1
| #define HAVE_NET_IF_H 1
| #define HAVE_SYS_UTSNAME_H 1
| #define HAVE_UNISTD_H 1
| #define HAVE_SYS_UNISTD_H 1
| #define HAVE_SYS_SOCKET_H 1
| #define HAVE_SYS_DIR_H 1
| #define HAVE_SIGNAL_H 1
| #define HAVE_SYS_SIGNAL_H 1
| #define HAVE_MALLOC_H 1
| #define HAVE_STRINGS_H 1
| #define HAVE_SYS_STAT_H 1
| #define HAVE_SYS_SEM_H 1
| #define HAVE_SYS_IPC_H 1
| #define HAVE_SYS_TIMES_H 1
| #define HAVE_DIRENT_H 1
| #define HAVE_GETOPT_H 1
| /* end confdefs.h.  */
| #ifdef __STDC__
| # include <limits.h>
| #else
| # include <assert.h>
| #endif
|                      Syntax error
configure:11182: error: C++ preprocessor "/lib/cpp" fails sanity check
See `config.log' for more details.

## ---------------- ##
## Cache variables. ##
## ---------------- ##

ac_cv_build=i686-pc-linux-gnu
ac_cv_build_alias=i686-pc-linux-gnu
ac_cv_c_bigendian=no
ac_cv_c_compiler_gnu=yes
ac_cv_cxx_compiler_gnu=no
ac_cv_env_CC_set=
ac_cv_env_CC_value=
ac_cv_env_CFLAGS_set=
ac_cv_env_CFLAGS_value=
ac_cv_env_CPPFLAGS_set=
ac_cv_env_CPPFLAGS_value=
ac_cv_env_CPP_set=
ac_cv_env_CPP_value=
ac_cv_env_CXXCPP_set=
ac_cv_env_CXXCPP_value=
ac_cv_env_CXXFLAGS_set=
ac_cv_env_CXXFLAGS_value=
ac_cv_env_CXX_set=
ac_cv_env_CXX_value=
ac_cv_env_LDFLAGS_set=
ac_cv_env_LDFLAGS_value=
ac_cv_env_build_alias_set=
ac_cv_env_build_alias_value=
ac_cv_env_host_alias_set=
ac_cv_env_host_alias_value=
ac_cv_env_target_alias_set=
ac_cv_env_target_alias_value=
ac_cv_exeext=
ac_cv_have_x='have_x=yes 		ac_x_includes=/usr/X11R6/include ac_x_libraries=/usr/X11R6/lib'
ac_cv_header_dirent_h=yes
ac_cv_header_dl_h=no
ac_cv_header_dlfcn_h=yes
ac_cv_header_floatingpoint_h=no
ac_cv_header_getopt_h=yes
ac_cv_header_ieeefp_h=no
ac_cv_header_inttypes_h=yes
ac_cv_header_malloc_h=yes
ac_cv_header_memory_h=yes
ac_cv_header_ndir_h=no
ac_cv_header_net_if_h=yes
ac_cv_header_netdb_h=yes
ac_cv_header_osfcn_h=no
ac_cv_header_pwd_h=yes
ac_cv_header_sigfpe_h=no
ac_cv_header_signal_h=yes
ac_cv_header_stdc=yes
ac_cv_header_stdint_h=yes
ac_cv_header_stdlib_h=yes
ac_cv_header_string_h=yes
ac_cv_header_strings_h=yes
ac_cv_header_sys_dir_h=yes
ac_cv_header_sys_ioctl_h=yes
ac_cv_header_sys_ipc_h=yes
ac_cv_header_sys_machsig_h=no
ac_cv_header_sys_ndir_h=no
ac_cv_header_sys_param_h=yes
ac_cv_header_sys_sem_h=yes
ac_cv_header_sys_siginfo_h=no
ac_cv_header_sys_signal_h=yes
ac_cv_header_sys_socket_h=yes
ac_cv_header_sys_stat_h=yes
ac_cv_header_sys_statvfs_h=yes
ac_cv_header_sys_systeminfo_h=no
ac_cv_header_sys_time_h=yes
ac_cv_header_sys_times_h=yes
ac_cv_header_sys_types_h=yes
ac_cv_header_sys_unistd_h=yes
ac_cv_header_sys_utsname_h=yes
ac_cv_header_sys_vfs_h=yes
ac_cv_header_sys_vnode_h=no
ac_cv_header_sysent_h=no
ac_cv_header_time_h=yes
ac_cv_header_unistd_h=yes
ac_cv_host=i686-pc-linux-gnu
ac_cv_host_alias=i686-pc-linux-gnu
ac_cv_lib_e_main=no
ac_cv_lib_inks_main=no
ac_cv_objext=o
ac_cv_path_install='/usr/bin/install -c'
ac_cv_prog_AWK=gawk
ac_cv_prog_CPP='gcc -E'
ac_cv_prog_CXXCPP=/lib/cpp
ac_cv_prog_ac_ct_CC=gcc
ac_cv_prog_ac_ct_RANLIB=ranlib
ac_cv_prog_ac_ct_STRIP=strip
ac_cv_prog_cc_g=yes
ac_cv_prog_cc_gcc_c_o=yes
ac_cv_prog_cc_stdc=
ac_cv_prog_cxx_g=no
ac_cv_prog_egrep='grep -E'
ac_cv_prog_make_make_set=yes
ac_cv_search_strerror='none required'
am_cv_CC_dependencies_compiler_type=gcc3
am_cv_CXX_dependencies_compiler_type=none
am_cv_prog_cc_stdc=
lt_cv_archive_cmds_need_lc=no
lt_cv_compiler_c_o=yes
lt_cv_compiler_o_lo=yes
lt_cv_deplibs_check_method=pass_all
lt_cv_file_magic_cmd='$MAGIC_CMD'
lt_cv_file_magic_test_file='/lib/libc.so.6 /lib/libc-2.3.6.so'
lt_cv_global_symbol_to_c_name_address='sed -n -e '\''s/^: \([^ ]*\) $/  {\"\1\", (lt_ptr) 0},/p'\'' -e '\''s/^[BCDEGRST] \([^ ]*\) \([^ ]*\)$/  {"\2", (lt_ptr) \&\2},/p'\'''
lt_cv_global_symbol_to_cdecl='sed -n -e '\''s/^. .* \(.*\)$/extern char \1;/p'\'''
lt_cv_ld_reload_flag=-r
lt_cv_path_LD=/usr/bin/ld
lt_cv_path_NM='/usr/bin/nm -B'
lt_cv_path_SED=/bin/sed
lt_cv_prog_cc_can_build_shared=yes
lt_cv_prog_cc_no_builtin=
lt_cv_prog_cc_pic=' -fPIC'
lt_cv_prog_cc_pic_works=yes
lt_cv_prog_cc_shlib=
lt_cv_prog_cc_static=
lt_cv_prog_cc_static_works=no
lt_cv_prog_cc_wl=-Wl,
lt_cv_prog_gnu_ld=yes
lt_cv_sys_global_symbol_pipe='sed -n -e '\''s/^.*[ 	]\([ABCDGISTW][ABCDGISTW]*\)[ 	][ 	]*\(\)\([_A-Za-z][_A-Za-z0-9]*\)$/\1 \2\3 \3/p'\'''

## ----------------- ##
## Output variables. ##
## ----------------- ##

ACLOCAL='${SHELL} /home/jmd/Téléchargement/opencascade/installation/ros/make/missing --run aclocal-1.7'
ALLOCA=''
AMDEPBACKSLASH='\'
AMDEP_FALSE='#'
AMDEP_TRUE=''
AMTAR='${SHELL} /home/jmd/Téléchargement/opencascade/installation/ros/make/missing --run tar'
ANSI2KNR=''
AUTOCONF='${SHELL} /home/jmd/Téléchargement/opencascade/installation/ros/make/missing --run autoconf'
AUTOHEADER='${SHELL} /home/jmd/Téléchargement/opencascade/installation/ros/make/missing --run autoheader'
AUTOMAKE='${SHELL} /home/jmd/Téléchargement/opencascade/installation/ros/make/missing --run automake-1.7'
AWK='gawk'
CC='gcc'
CCDEPMODE='depmode=gcc3'
CFLAGS=' '
CPP='gcc -E'
CPPFLAGS=''
CSF_FPELibs_LIB=''
CSF_OpenGlLibs_INCLUDES=''
CSF_OpenGlLibs_LIB=''
CSF_SOCKETLibs_LIB=''
CSF_TclLibs_INCLUDES=''
CSF_TclLibs_LIB=''
CSF_TclTkLibs_INCLUDES=''
CSF_TclTkLibs_LIB=''
CSF_XmuLibs_INCLUDES=''
CSF_XmuLibs_LIB=''
CSF_XwLibs_LIB=''
CSF_advapi32_LIB=''
CSF_dpsLibs_INCLUDES=''
CSF_dpsLibs_LIB=''
CSF_gdi32_LIB=''
CSF_user32_LIB=''
CSF_wsock32_LIB=''
CXX='g++'
CXXCPP='/lib/cpp'
CXXDEPMODE='depmode=none'
CXXFLAGS=' '
CYGPATH_W='echo'
DEFS=''
DEPDIR='.deps'
ECHO='echo'
ECHO_C=''
ECHO_N='-n'
ECHO_T=''
EGREP='grep -E'
EXEEXT=''
INSTALL_DATA='${INSTALL} -m 644'
INSTALL_PROGRAM='${INSTALL}'
INSTALL_SCRIPT='${INSTALL}'
INSTALL_STRIP_PROGRAM='${SHELL} $(install_sh) -c -s'
LDFLAGS=''
LIBOBJS=''
LIBS=''
LIBTOOL='$(SHELL) $(top_builddir)/libtool'
LN_S='ln -s'
LTLIBOBJS=''
MAKEINFO='${SHELL} /home/jmd/Téléchargement/opencascade/installation/ros/make/missing --run makeinfo'
OBJEXT='o'
PACKAGE='OpenCAS'
PACKAGE_BUGREPORT=''
PACKAGE_NAME=''
PACKAGE_STRING=''
PACKAGE_TARNAME=''
PACKAGE_VERSION=''
PATH_SEPARATOR=':'
RANLIB='ranlib'
SET_MAKE=''
SHELL='/bin/sh'
STLPort_INCLUDES=''
STLPort_LIB=''
STRIP='strip'
TCL_BIN_DIR=''
TCL_LIB_FILE=''
TCL_SRC_DIR=''
TCL_VERSION=''
TK_BIN_DIR=''
TK_LIB_FILE=''
TK_SRC_DIR=''
TK_VERSION=''
U=''
VERSION='5.0DVP1'
YACC='yacc'
ac_ct_CC='gcc'
ac_ct_CXX='g++'
ac_ct_RANLIB='ranlib'
ac_ct_STRIP='strip'
am__fastdepCC_FALSE='#'
am__fastdepCC_TRUE=''
am__fastdepCXX_FALSE=''
am__fastdepCXX_TRUE='#'
am__include='include'
am__leading_dot='.'
am__quote=''
bindir='${exec_prefix}/bin'
build='i686-pc-linux-gnu'
build_TKjcas=''
build_alias=''
build_cpu='i686'
build_os='linux-gnu'
build_vendor='pc'
datadir='${prefix}/share'
exec_prefix='NONE'
host='i686-pc-linux-gnu'
host_alias=''
host_cpu='i686'
host_os='linux-gnu'
host_vendor='pc'
includedir='${prefix}/include'
infodir='${prefix}/info'
install_sh='/home/jmd/Téléchargement/opencascade/installation/ros/make/install-sh'
libdir='${exec_prefix}/lib'
libexecdir='${exec_prefix}/libexec'
localstatedir='${prefix}/var'
mandir='${prefix}/man'
oldincludedir='/usr/include'
platform=''
prefix='NONE'
program_transform_name='s,x,x,'
sbindir='${exec_prefix}/sbin'
sharedstatedir='${prefix}/com'
sysconfdir='${prefix}/etc'
target_alias=''

## ----------- ##
## confdefs.h. ##
## ----------- ##

#define HAVE_DIRENT_H 1
#define HAVE_DLFCN_H 1
#define HAVE_DLFCN_H 1
#define HAVE_GETOPT_H 1
#define HAVE_INTTYPES_H 1
#define HAVE_MALLOC_H 1
#define HAVE_MEMORY_H 1
#define HAVE_NETDB_H 1
#define HAVE_NET_IF_H 1
#define HAVE_PWD_H 1
#define HAVE_SIGNAL_H 1
#define HAVE_STDINT_H 1
#define HAVE_STDLIB_H 1
#define HAVE_STRINGS_H 1
#define HAVE_STRINGS_H 1
#define HAVE_STRING_H 1
#define HAVE_STRING_H 1
#define HAVE_SYS_DIR_H 1
#define HAVE_SYS_IOCTL_H 1
#define HAVE_SYS_IPC_H 1
#define HAVE_SYS_PARAM_H 1
#define HAVE_SYS_SEM_H 1
#define HAVE_SYS_SIGNAL_H 1
#define HAVE_SYS_SOCKET_H 1
#define HAVE_SYS_STATVFS_H 1
#define HAVE_SYS_STAT_H 1
#define HAVE_SYS_STAT_H 1
#define HAVE_SYS_TIMES_H 1
#define HAVE_SYS_TIME_H 1
#define HAVE_SYS_TYPES_H 1
#define HAVE_SYS_UNISTD_H 1
#define HAVE_SYS_UTSNAME_H 1
#define HAVE_SYS_VFS_H 1
#define HAVE_TIME_H 1
#define HAVE_UNISTD_H 1
#define HAVE_UNISTD_H 1
#define PACKAGE "OpenCAS"
#define PACKAGE_BUGREPORT ""
#define PACKAGE_NAME ""
#define PACKAGE_STRING ""
#define PACKAGE_TARNAME ""
#define PACKAGE_VERSION ""
#define PROTOTYPES 1
#define STDC_HEADERS 1
#define STDC_HEADERS 1
#define STDC_HEADERS 1
#define VERSION "5.0DVP1"
#endif
#ifdef __cplusplus
void exit (int);

configure: exit 1