All pastes #677331 Raw Edit

Something

public text v1 · immutable
#677331 ·published 2007-08-31 22:30 UTC
rendered paste body
    in testVerifyThatAllFunctionsGetTested
        in AllFunctionsMustHaveAtLeastOneTestTester
        in ./coverage_tests/audit_all_functions_get_tested_at_least_once.phpt
567) Do not see any tests for function/method testFailToSetIllegalOptionsInMultiple from file ../lib/simpletest/test/tag_test.php -- ALL functions must have a corresponding test. at [/svn/goodstorm/www/t/coverage_tests/audit_all_functions_get_tested_at_least_once.phpt line 132]
        in testVerifyThatAllFunctionsGetTested
        in AllFunctionsMustHaveAtLeastOneTestTester
        in ./coverage_tests/audit_all_functions_get_tested_at_least_once.phpt
568) Do not see any tests for function/method testEmptyGroup from file ../lib/simpletest/test/tag_test.php -- ALL functions must have a corresponding test. at [/svn/goodstorm/www/t/coverage_tests/audit_all_functions_get_tested_at_least_once.phpt line 132]
        in testVerifyThatAllFunctionsGetTested
        in AllFunctionsMustHaveAtLeastOneTestTester
        in ./coverage_tests/audit_all_functions_get_tested_at_least_once.phpt
569) Do not see any tests for function/method testReadingSingleButtonGroup from file ../lib/simpletest/test/tag_test.php -- ALL functions must have a corresponding test. at [/svn/goodstorm/www/t/coverage_tests/audit_all_functions_get_tested_at_least_once.phpt line 132]
        in testVerifyThatAllFunctionsGetTested
        in AllFunctionsMustHaveAtLeastOneTestTester
        in ./coverage_tests/audit_all_functions_get_tested_at_least_once.phpt
570) Do not see any tests for function/method testReadingMultipleButtonGroup from file ../lib/simpletest/test/tag_test.php -- ALL functions must have a corresponding test. at [/svn/goodstorm/www/t/coverage_tests/audit_all_functions_get_tested_at_least_once.phpt line 132]
        in testVerifyThatAllFunctionsGetTested
        in AllFunctionsMustHaveAtLeastOneTestTester
        in ./coverage_tests/audit_all_functions_get_tested_at_least_once.phpt
571) Do not see any tests for function/method testFailToSetUnlistedValue from file ../lib/simpletest/test/tag_test.php -- ALL functions must have a corresponding test. at [/svn/goodstorm/www/t/coverage_tests/audit_all_functions_get_tested_at_least_once.phpt line 132]
        in testVerifyThatAllFunctionsGetTested
        in AllFunctionsMustHaveAtLeastOneTestTester
        in ./coverage_tests/audit_all_functions_get_tested_at_least_once.phpt
572) Do not see any tests for function/method testSettingNewValueClearsTheOldOne from file ../lib/simpletest/test/tag_test.php -- ALL functions must have a corresponding test. at [/svn/goodstorm/www/t/coverage_tests/audit_all_functions_get_tested_at_least_once.phpt line 132]
        in testVerifyThatAllFunctionsGetTested
        in AllFunctionsMustHaveAtLeastOneTestTester
        in ./coverage_tests/audit_all_functions_get_tested_at_least_once.phpt
573) Do not see any tests for function/method testIsIdMatchesAnyWidgetInSet from file ../lib/simpletest/test/tag_test.php -- ALL functions must have a corresponding test. at [/svn/goodstorm/www/t/coverage_tests/audit_all_functions_get_tested_at_least_once.phpt line 132]
        in testVerifyThatAllFunctionsGetTested
        in AllFunctionsMustHaveAtLeastOneTestTester
        in ./coverage_tests/audit_all_functions_get_tested_at_least_once.phpt
574) Do not see any tests for function/method testIsLabelMatchesAnyWidgetInSet from file ../lib/simpletest/test/tag_test.php -- ALL functions must have a corresponding test. at [/svn/goodstorm/www/t/coverage_tests/audit_all_functions_get_tested_at_least_once.phpt line 132]
        in testVerifyThatAllFunctionsGetTested
        in AllFunctionsMustHaveAtLeastOneTestTester
        in ./coverage_tests/audit_all_functions_get_tested_at_least_once.phpt
575) Do not see any tests for function/method testReadingMultipleCheckboxGroup from file ../lib/simpletest/test/tag_test.php -- ALL functions must have a corresponding test. at [/svn/goodstorm/www/t/coverage_tests/audit_all_functions_get_tested_at_least_once.phpt line 132]
        in testVerifyThatAllFunctionsGetTested
        in AllFunctionsMustHaveAtLeastOneTestTester
        in ./coverage_tests/audit_all_functions_get_tested_at_least_once.phpt
576) Do not see any tests for function/method testReadingMultipleUncheckedItems from file ../lib/simpletest/test/tag_test.php -- ALL functions must have a corresponding test. at [/svn/goodstorm/www/t/coverage_tests/audit_all_functions_get_tested_at_least_once.phpt line 132]
        in testVerifyThatAllFunctionsGetTested
        in AllFunctionsMustHaveAtLeastOneTestTester
        in ./coverage_tests/audit_all_functions_get_tested_at_least_once.phpt
577) Do not see any tests for function/method testReadingMultipleCheckedItems from file ../lib/simpletest/test/tag_test.php -- ALL functions must have a corresponding test. at [/svn/goodstorm/www/t/coverage_tests/audit_all_functions_get_tested_at_least_once.phpt line 132]
        in testVerifyThatAllFunctionsGetTested
        in AllFunctionsMustHaveAtLeastOneTestTester
        in ./coverage_tests/audit_all_functions_get_tested_at_least_once.phpt
578) Do not see any tests for function/method testSettingSingleValue from file ../lib/simpletest/test/tag_test.php -- ALL functions must have a corresponding test. at [/svn/goodstorm/www/t/coverage_tests/audit_all_functions_get_tested_at_least_once.phpt line 132]
        in testVerifyThatAllFunctionsGetTested
        in AllFunctionsMustHaveAtLeastOneTestTester
        in ./coverage_tests/audit_all_functions_get_tested_at_least_once.phpt
579) Do not see any tests for function/method testSettingMultipleValues from file ../lib/simpletest/test/tag_test.php -- ALL functions must have a corresponding test. at [/svn/goodstorm/www/t/coverage_tests/audit_all_functions_get_tested_at_least_once.phpt line 132]
        in testVerifyThatAllFunctionsGetTested
        in AllFunctionsMustHaveAtLeastOneTestTester
        in ./coverage_tests/audit_all_functions_get_tested_at_least_once.phpt
580) Do not see any tests for function/method testSettingNoValue from file ../lib/simpletest/test/tag_test.php -- ALL functions must have a corresponding test. at [/svn/goodstorm/www/t/coverage_tests/audit_all_functions_get_tested_at_least_once.phpt line 132]
        in testVerifyThatAllFunctionsGetTested
        in AllFunctionsMustHaveAtLeastOneTestTester
        in ./coverage_tests/audit_all_functions_get_tested_at_least_once.phpt
581) Do not see any tests for function/method testIsIdMatchesAnyIdInSet from file ../lib/simpletest/test/tag_test.php -- ALL functions must have a corresponding test. at [/svn/goodstorm/www/t/coverage_tests/audit_all_functions_get_tested_at_least_once.phpt line 132]
        in testVerifyThatAllFunctionsGetTested
        in AllFunctionsMustHaveAtLeastOneTestTester
        in ./coverage_tests/audit_all_functions_get_tested_at_least_once.phpt
582) Do not see any tests for function/method testValueIsFilePath from file ../lib/simpletest/test/tag_test.php -- ALL functions must have a corresponding test. at [/svn/goodstorm/www/t/coverage_tests/audit_all_functions_get_tested_at_least_once.phpt line 132]
        in testVerifyThatAllFunctionsGetTested
        in AllFunctionsMustHaveAtLeastOneTestTester
        in ./coverage_tests/audit_all_functions_get_tested_at_least_once.phpt
583) Do not see any tests for function/method testSubmitsFileContents from file ../lib/simpletest/test/tag_test.php -- ALL functions must have a corresponding test. at [/svn/goodstorm/www/t/coverage_tests/audit_all_functions_get_tested_at_least_once.phpt line 132]
        in testVerifyThatAllFunctionsGetTested
        in AllFunctionsMustHaveAtLeastOneTestTester
        in ./coverage_tests/audit_all_functions_get_tested_at_least_once.phpt
584) Do not see any tests for function/method testLabelShouldHaveAnEndTag from file ../lib/simpletest/test/tag_test.php -- ALL functions must have a corresponding test. at [/svn/goodstorm/www/t/coverage_tests/audit_all_functions_get_tested_at_least_once.phpt line 132]
        in testVerifyThatAllFunctionsGetTested
        in AllFunctionsMustHaveAtLeastOneTestTester
        in ./coverage_tests/audit_all_functions_get_tested_at_least_once.phpt
585) Do not see any tests for function/method testContentIsTextOnly from file ../lib/simpletest/test/tag_test.php -- ALL functions must have a corresponding test. at [/svn/goodstorm/www/t/coverage_tests/audit_all_functions_get_tested_at_least_once.phpt line 132]
        in testVerifyThatAllFunctionsGetTested
        in AllFunctionsMustHaveAtLeastOneTestTester
        in ./coverage_tests/audit_all_functions_get_tested_at_least_once.phpt
586) Do not see any tests for function/method testAssertTrueReturnsAssertionAsBoolean from file ../lib/simpletest/test/unit_tester_test.php -- ALL functions must have a corresponding test. at [/svn/goodstorm/www/t/coverage_tests/audit_all_functions_get_tested_at_least_once.phpt line 132]
        in testVerifyThatAllFunctionsGetTested
        in AllFunctionsMustHaveAtLeastOneTestTester
        in ./coverage_tests/audit_all_functions_get_tested_at_least_once.phpt
587) Do not see any tests for function/method testAssertFalseReturnsAssertionAsBoolean from file ../lib/simpletest/test/unit_tester_test.php -- ALL functions must have a corresponding test. at [/svn/goodstorm/www/t/coverage_tests/audit_all_functions_get_tested_at_least_once.phpt line 132]
        in testVerifyThatAllFunctionsGetTested
        in AllFunctionsMustHaveAtLeastOneTestTester
        in ./coverage_tests/audit_all_functions_get_tested_at_least_once.phpt
588) Do not see any tests for function/method testAssertEqualReturnsAssertionAsBoolean from file ../lib/simpletest/test/unit_tester_test.php -- ALL functions must have a corresponding test. at [/svn/goodstorm/www/t/coverage_tests/audit_all_functions_get_tested_at_least_once.phpt line 132]
        in testVerifyThatAllFunctionsGetTested
        in AllFunctionsMustHaveAtLeastOneTestTester
        in ./coverage_tests/audit_all_functions_get_tested_at_least_once.phpt
589) Do not see any tests for function/method testAssertIdenticalReturnsAssertionAsBoolean from file ../lib/simpletest/test/unit_tester_test.php -- ALL functions must have a corresponding test. at [/svn/goodstorm/www/t/coverage_tests/audit_all_functions_get_tested_at_least_once.phpt line 132]
        in testVerifyThatAllFunctionsGetTested
        in AllFunctionsMustHaveAtLeastOneTestTester
        in ./coverage_tests/audit_all_functions_get_tested_at_least_once.phpt
590) Do not see any tests for function/method testCoreAssertionsDoNotThrowErrors from file ../lib/simpletest/test/unit_tester_test.php -- ALL functions must have a corresponding test. at [/svn/goodstorm/www/t/coverage_tests/audit_all_functions_get_tested_at_least_once.phpt line 132]
        in testVerifyThatAllFunctionsGetTested
        in AllFunctionsMustHaveAtLeastOneTestTester
        in ./coverage_tests/audit_all_functions_get_tested_at_least_once.phpt
591) Do not see any tests for function/method testReferenceAssertionOnObjects from file ../lib/simpletest/test/unit_tester_test.php -- ALL functions must have a corresponding test. at [/svn/goodstorm/www/t/coverage_tests/audit_all_functions_get_tested_at_least_once.phpt line 132]
        in testVerifyThatAllFunctionsGetTested
        in AllFunctionsMustHaveAtLeastOneTestTester
        in ./coverage_tests/audit_all_functions_get_tested_at_least_once.phpt
592) Do not see any tests for function/method testReferenceAssertionOnScalars from file ../lib/simpletest/test/unit_tester_test.php -- ALL functions must have a corresponding test. at [/svn/goodstorm/www/t/coverage_tests/audit_all_functions_get_tested_at_least_once.phpt line 132]
        in testVerifyThatAllFunctionsGetTested
        in AllFunctionsMustHaveAtLeastOneTestTester
        in ./coverage_tests/audit_all_functions_get_tested_at_least_once.phpt
593) Do not see any tests for function/method testCloneOnObjects from file ../lib/simpletest/test/unit_tester_test.php -- ALL functions must have a corresponding test. at [/svn/goodstorm/www/t/coverage_tests/audit_all_functions_get_tested_at_least_once.phpt line 132]
        in testVerifyThatAllFunctionsGetTested
        in AllFunctionsMustHaveAtLeastOneTestTester
        in ./coverage_tests/audit_all_functions_get_tested_at_least_once.phpt
594) Do not see any tests for function/method testCloneOnScalars from file ../lib/simpletest/test/unit_tester_test.php -- ALL functions must have a corresponding test. at [/svn/goodstorm/www/t/coverage_tests/audit_all_functions_get_tested_at_least_once.phpt line 132]
        in testVerifyThatAllFunctionsGetTested
        in AllFunctionsMustHaveAtLeastOneTestTester
        in ./coverage_tests/audit_all_functions_get_tested_at_least_once.phpt
595) Do not see any tests for function/method testDefaultUrl from file ../lib/simpletest/test/url_test.php -- ALL functions must have a corresponding test. at [/svn/goodstorm/www/t/coverage_tests/audit_all_functions_get_tested_at_least_once.phpt line 132]
        in testVerifyThatAllFunctionsGetTested
        in AllFunctionsMustHaveAtLeastOneTestTester
        in ./coverage_tests/audit_all_functions_get_tested_at_least_once.phpt
596) Do not see any tests for function/method testBasicParsing from file ../lib/simpletest/test/url_test.php -- ALL functions must have a corresponding test. at [/svn/goodstorm/www/t/coverage_tests/audit_all_functions_get_tested_at_least_once.phpt line 132]
        in testVerifyThatAllFunctionsGetTested
        in AllFunctionsMustHaveAtLeastOneTestTester
        in ./coverage_tests/audit_all_functions_get_tested_at_least_once.phpt
597) Do not see any tests for function/method testRelativeUrls from file ../lib/simpletest/test/url_test.php -- ALL functions must have a corresponding test. at [/svn/goodstorm/www/t/coverage_tests/audit_all_functions_get_tested_at_least_once.phpt line 132]
        in testVerifyThatAllFunctionsGetTested
        in AllFunctionsMustHaveAtLeastOneTestTester
        in ./coverage_tests/audit_all_functions_get_tested_at_least_once.phpt
598) Do not see any tests for function/method testParseBareParameter from file ../lib/simpletest/test/url_test.php -- ALL functions must have a corresponding test. at [/svn/goodstorm/www/t/coverage_tests/audit_all_functions_get_tested_at_least_once.phpt line 132]
        in testVerifyThatAllFunctionsGetTested
        in AllFunctionsMustHaveAtLeastOneTestTester
        in ./coverage_tests/audit_all_functions_get_tested_at_least_once.phpt
599) Do not see any tests for function/method testParseEmptyParameter from file ../lib/simpletest/test/url_test.php -- ALL functions must have a corresponding test. at [/svn/goodstorm/www/t/coverage_tests/audit_all_functions_get_tested_at_least_once.phpt line 132]
        in testVerifyThatAllFunctionsGetTested
        in AllFunctionsMustHaveAtLeastOneTestTester
        in ./coverage_tests/audit_all_functions_get_tested_at_least_once.phpt
600) Do not see any tests for function/method testParseParameterPair from file ../lib/simpletest/test/url_test.php -- ALL functions must have a corresponding test. at [/svn/goodstorm/www/t/coverage_tests/audit_all_functions_get_tested_at_least_once.phpt line 132]
        in testVerifyThatAllFunctionsGetTested
        in AllFunctionsMustHaveAtLeastOneTestTester
        in ./coverage_tests/audit_all_functions_get_tested_at_least_once.phpt
601) Do not see any tests for function/method testParseMultipleParameters from file ../lib/simpletest/test/url_test.php -- ALL functions must have a corresponding test. at [/svn/goodstorm/www/t/coverage_tests/audit_all_functions_get_tested_at_least_once.phpt line 132]
        in testVerifyThatAllFunctionsGetTested
        in AllFunctionsMustHaveAtLeastOneTestTester
        in ./coverage_tests/audit_all_functions_get_tested_at_least_once.phpt
602) Do not see any tests for function/method testParsingParameterMixture from file ../lib/simpletest/test/url_test.php -- ALL functions must have a corresponding test. at [/svn/goodstorm/www/t/coverage_tests/audit_all_functions_get_tested_at_least_once.phpt line 132]
        in testVerifyThatAllFunctionsGetTested
        in AllFunctionsMustHaveAtLeastOneTestTester
        in ./coverage_tests/audit_all_functions_get_tested_at_least_once.phpt
603) Do not see any tests for function/method testAddParametersFromScratch from file ../lib/simpletest/test/url_test.php -- ALL functions must have a corresponding test. at [/svn/goodstorm/www/t/coverage_tests/audit_all_functions_get_tested_at_least_once.phpt line 132]
        in testVerifyThatAllFunctionsGetTested
        in AllFunctionsMustHaveAtLeastOneTestTester
        in ./coverage_tests/audit_all_functions_get_tested_at_least_once.phpt
604) Do not see any tests for function/method testClearingParameters from file ../lib/simpletest/test/url_test.php -- ALL functions must have a corresponding test. at [/svn/goodstorm/www/t/coverage_tests/audit_all_functions_get_tested_at_least_once.phpt line 132]
        in testVerifyThatAllFunctionsGetTested
        in AllFunctionsMustHaveAtLeastOneTestTester
        in ./coverage_tests/audit_all_functions_get_tested_at_least_once.phpt
605) Do not see any tests for function/method testEncodingParameters from file ../lib/simpletest/test/url_test.php -- ALL functions must have a corresponding test. at [/svn/goodstorm/www/t/coverage_tests/audit_all_functions_get_tested_at_least_once.phpt line 132]
        in testVerifyThatAllFunctionsGetTested
        in AllFunctionsMustHaveAtLeastOneTestTester
        in ./coverage_tests/audit_all_functions_get_tested_at_least_once.phpt
606) Do not see any tests for function/method testDecodingParameters from file ../lib/simpletest/test/url_test.php -- ALL functions must have a corresponding test. at [/svn/goodstorm/www/t/coverage_tests/audit_all_functions_get_tested_at_least_once.phpt line 132]
        in testVerifyThatAllFunctionsGetTested
        in AllFunctionsMustHaveAtLeastOneTestTester
        in ./coverage_tests/audit_all_functions_get_tested_at_least_once.phpt
607) Do not see any tests for function/method testUrlInQueryDoesNotConfuseParsing from file ../lib/simpletest/test/url_test.php -- ALL functions must have a corresponding test. at [/svn/goodstorm/www/t/coverage_tests/audit_all_functions_get_tested_at_least_once.phpt line 132]
        in testVerifyThatAllFunctionsGetTested
        in AllFunctionsMustHaveAtLeastOneTestTester
        in ./coverage_tests/audit_all_functions_get_tested_at_least_once.phpt
608) Do not see any tests for function/method testSettingCordinates from file ../lib/simpletest/test/url_test.php -- ALL functions must have a corresponding test. at [/svn/goodstorm/www/t/coverage_tests/audit_all_functions_get_tested_at_least_once.phpt line 132]
        in testVerifyThatAllFunctionsGetTested
        in AllFunctionsMustHaveAtLeastOneTestTester
        in ./coverage_tests/audit_all_functions_get_tested_at_least_once.phpt
609) Do not see any tests for function/method testParseCordinates from file ../lib/simpletest/test/url_test.php -- ALL functions must have a corresponding test. at [/svn/goodstorm/www/t/coverage_tests/audit_all_functions_get_tested_at_least_once.phpt line 132]
        in testVerifyThatAllFunctionsGetTested
        in AllFunctionsMustHaveAtLeastOneTestTester
        in ./coverage_tests/audit_all_functions_get_tested_at_least_once.phpt
610) Do not see any tests for function/method testClearingCordinates from file ../lib/simpletest/test/url_test.php -- ALL functions must have a corresponding test. at [/svn/goodstorm/www/t/coverage_tests/audit_all_functions_get_tested_at_least_once.phpt line 132]
        in testVerifyThatAllFunctionsGetTested
        in AllFunctionsMustHaveAtLeastOneTestTester
        in ./coverage_tests/audit_all_functions_get_tested_at_least_once.phpt
611) Do not see any tests for function/method testParsingParameterCordinateMixture from file ../lib/simpletest/test/url_test.php -- ALL functions must have a corresponding test. at [/svn/goodstorm/www/t/coverage_tests/audit_all_functions_get_tested_at_least_once.phpt line 132]
        in testVerifyThatAllFunctionsGetTested
        in AllFunctionsMustHaveAtLeastOneTestTester
        in ./coverage_tests/audit_all_functions_get_tested_at_least_once.phpt
612) Do not see any tests for function/method testParsingParameterWithBadCordinates from file ../lib/simpletest/test/url_test.php -- ALL functions must have a corresponding test. at [/svn/goodstorm/www/t/coverage_tests/audit_all_functions_get_tested_at_least_once.phpt line 132]
        in testVerifyThatAllFunctionsGetTested
        in AllFunctionsMustHaveAtLeastOneTestTester
        in ./coverage_tests/audit_all_functions_get_tested_at_least_once.phpt
613) Do not see any tests for function/method testPageSplitting from file ../lib/simpletest/test/url_test.php -- ALL functions must have a corresponding test. at [/svn/goodstorm/www/t/coverage_tests/audit_all_functions_get_tested_at_least_once.phpt line 132]
        in testVerifyThatAllFunctionsGetTested
        in AllFunctionsMustHaveAtLeastOneTestTester
        in ./coverage_tests/audit_all_functions_get_tested_at_least_once.phpt
614) Do not see any tests for function/method testAbsolutePathPageSplitting from file ../lib/simpletest/test/url_test.php -- ALL functions must have a corresponding test. at [/svn/goodstorm/www/t/coverage_tests/audit_all_functions_get_tested_at_least_once.phpt line 132]
        in testVerifyThatAllFunctionsGetTested
        in AllFunctionsMustHaveAtLeastOneTestTester
        in ./coverage_tests/audit_all_functions_get_tested_at_least_once.phpt
615) Do not see any tests for function/method testSplittingUrlWithNoPageGivesEmptyPage from file ../lib/simpletest/test/url_test.php -- ALL functions must have a corresponding test. at [/svn/goodstorm/www/t/coverage_tests/audit_all_functions_get_tested_at_least_once.phpt line 132]
        in testVerifyThatAllFunctionsGetTested
        in AllFunctionsMustHaveAtLeastOneTestTester
        in ./coverage_tests/audit_all_functions_get_tested_at_least_once.phpt
616) Do not see any tests for function/method testPathNormalisation from file ../lib/simpletest/test/url_test.php -- ALL functions must have a corresponding test. at [/svn/goodstorm/www/t/coverage_tests/audit_all_functions_get_tested_at_least_once.phpt line 132]
        in testVerifyThatAllFunctionsGetTested
        in AllFunctionsMustHaveAtLeastOneTestTester
        in ./coverage_tests/audit_all_functions_get_tested_at_least_once.phpt
617) Do not see any tests for function/method testPathNormalisationWithSinglePeriod from file ../lib/simpletest/test/url_test.php -- ALL functions must have a corresponding test. at [/svn/goodstorm/www/t/coverage_tests/audit_all_functions_get_tested_at_least_once.phpt line 132]
        in testVerifyThatAllFunctionsGetTested
        in AllFunctionsMustHaveAtLeastOneTestTester
        in ./coverage_tests/audit_all_functions_get_tested_at_least_once.phpt
618) Do not see any tests for function/method testUsernameAndPasswordAreUrlDecoded from file ../lib/simpletest/test/url_test.php -- ALL functions must have a corresponding test. at [/svn/goodstorm/www/t/coverage_tests/audit_all_functions_get_tested_at_least_once.phpt line 132]
        in testVerifyThatAllFunctionsGetTested
        in AllFunctionsMustHaveAtLeastOneTestTester
        in ./coverage_tests/audit_all_functions_get_tested_at_least_once.phpt
619) Do not see any tests for function/method testBlitz from file ../lib/simpletest/test/url_test.php -- ALL functions must have a corresponding test. at [/svn/goodstorm/www/t/coverage_tests/audit_all_functions_get_tested_at_least_once.phpt line 132]
        in testVerifyThatAllFunctionsGetTested
        in AllFunctionsMustHaveAtLeastOneTestTester
        in ./coverage_tests/audit_all_functions_get_tested_at_least_once.phpt
620) Do not see any tests for function/method testAmbiguousHosts from file ../lib/simpletest/test/url_test.php -- ALL functions must have a corresponding test. at [/svn/goodstorm/www/t/coverage_tests/audit_all_functions_get_tested_at_least_once.phpt line 132]
        in testVerifyThatAllFunctionsGetTested
        in AllFunctionsMustHaveAtLeastOneTestTester
        in ./coverage_tests/audit_all_functions_get_tested_at_least_once.phpt
621) Do not see any tests for function/method testAsString from file ../lib/simpletest/test/url_test.php -- ALL functions must have a corresponding test. at [/svn/goodstorm/www/t/coverage_tests/audit_all_functions_get_tested_at_least_once.phpt line 132]
        in testVerifyThatAllFunctionsGetTested
        in AllFunctionsMustHaveAtLeastOneTestTester
        in ./coverage_tests/audit_all_functions_get_tested_at_least_once.phpt
622) Do not see any tests for function/method assertUrl from file ../lib/simpletest/test/url_test.php -- ALL functions must have a corresponding test. at [/svn/goodstorm/www/t/coverage_tests/audit_all_functions_get_tested_at_least_once.phpt line 132]
        in testVerifyThatAllFunctionsGetTested
        in AllFunctionsMustHaveAtLeastOneTestTester
        in ./coverage_tests/audit_all_functions_get_tested_at_least_once.phpt
623) Do not see any tests for function/method testUrlWithTwoSlashesInPath from file ../lib/simpletest/test/url_test.php -- ALL functions must have a corresponding test. at [/svn/goodstorm/www/t/coverage_tests/audit_all_functions_get_tested_at_least_once.phpt line 132]
        in testVerifyThatAllFunctionsGetTested
        in AllFunctionsMustHaveAtLeastOneTestTester
        in ./coverage_tests/audit_all_functions_get_tested_at_least_once.phpt
624) Do not see any tests for function/method assertPreserved from file ../lib/simpletest/test/url_test.php -- ALL functions must have a corresponding test. at [/svn/goodstorm/www/t/coverage_tests/audit_all_functions_get_tested_at_least_once.phpt line 132]
        in testVerifyThatAllFunctionsGetTested
        in AllFunctionsMustHaveAtLeastOneTestTester
        in ./coverage_tests/audit_all_functions_get_tested_at_least_once.phpt
625) Do not see any tests for function/method testMakingAbsolute from file ../lib/simpletest/test/url_test.php -- ALL functions must have a corresponding test. at [/svn/goodstorm/www/t/coverage_tests/audit_all_functions_get_tested_at_least_once.phpt line 132]
        in testVerifyThatAllFunctionsGetTested
        in AllFunctionsMustHaveAtLeastOneTestTester
        in ./coverage_tests/audit_all_functions_get_tested_at_least_once.phpt
626) Do not see any tests for function/method testMakingAnEmptyUrlAbsolute from file ../lib/simpletest/test/url_test.php -- ALL functions must have a corresponding test. at [/svn/goodstorm/www/t/coverage_tests/audit_all_functions_get_tested_at_least_once.phpt line 132]
        in testVerifyThatAllFunctionsGetTested
        in AllFunctionsMustHaveAtLeastOneTestTester
        in ./coverage_tests/audit_all_functions_get_tested_at_least_once.phpt
627) Do not see any tests for function/method testMakingAnEmptyUrlAbsoluteWithMissingPageName from file ../lib/simpletest/test/url_test.php -- ALL functions must have a corresponding test. at [/svn/goodstorm/www/t/coverage_tests/audit_all_functions_get_tested_at_least_once.phpt line 132]
        in testVerifyThatAllFunctionsGetTested
        in AllFunctionsMustHaveAtLeastOneTestTester
        in ./coverage_tests/audit_all_functions_get_tested_at_least_once.phpt
628) Do not see any tests for function/method testMakingAShortQueryUrlAbsolute from file ../lib/simpletest/test/url_test.php -- ALL functions must have a corresponding test. at [/svn/goodstorm/www/t/coverage_tests/audit_all_functions_get_tested_at_least_once.phpt line 132]
        in testVerifyThatAllFunctionsGetTested
        in AllFunctionsMustHaveAtLeastOneTestTester
        in ./coverage_tests/audit_all_functions_get_tested_at_least_once.phpt
629) Do not see any tests for function/method testMakingADirectoryUrlAbsolute from file ../lib/simpletest/test/url_test.php -- ALL functions must have a corresponding test. at [/svn/goodstorm/www/t/coverage_tests/audit_all_functions_get_tested_at_least_once.phpt line 132]
        in testVerifyThatAllFunctionsGetTested
        in AllFunctionsMustHaveAtLeastOneTestTester
        in ./coverage_tests/audit_all_functions_get_tested_at_least_once.phpt
630) Do not see any tests for function/method testMakingARootUrlAbsolute from file ../lib/simpletest/test/url_test.php -- ALL functions must have a corresponding test. at [/svn/goodstorm/www/t/coverage_tests/audit_all_functions_get_tested_at_least_once.phpt line 132]
        in testVerifyThatAllFunctionsGetTested
        in AllFunctionsMustHaveAtLeastOneTestTester
        in ./coverage_tests/audit_all_functions_get_tested_at_least_once.phpt
631) Do not see any tests for function/method testMakingARootPageUrlAbsolute from file ../lib/simpletest/test/url_test.php -- ALL functions must have a corresponding test. at [/svn/goodstorm/www/t/coverage_tests/audit_all_functions_get_tested_at_least_once.phpt line 132]
        in testVerifyThatAllFunctionsGetTested
        in AllFunctionsMustHaveAtLeastOneTestTester
        in ./coverage_tests/audit_all_functions_get_tested_at_least_once.phpt
632) Do not see any tests for function/method testCarryAuthenticationFromRootPage from file ../lib/simpletest/test/url_test.php -- ALL functions must have a corresponding test. at [/svn/goodstorm/www/t/coverage_tests/audit_all_functions_get_tested_at_least_once.phpt line 132]
        in testVerifyThatAllFunctionsGetTested
        in AllFunctionsMustHaveAtLeastOneTestTester
        in ./coverage_tests/audit_all_functions_get_tested_at_least_once.phpt
633) Do not see any tests for function/method testMakingCoordinateUrlAbsolute from file ../lib/simpletest/test/url_test.php -- ALL functions must have a corresponding test. at [/svn/goodstorm/www/t/coverage_tests/audit_all_functions_get_tested_at_least_once.phpt line 132]
        in testVerifyThatAllFunctionsGetTested
        in AllFunctionsMustHaveAtLeastOneTestTester
        in ./coverage_tests/audit_all_functions_get_tested_at_least_once.phpt
634) Do not see any tests for function/method testMakingAbsoluteAppendedPath from file ../lib/simpletest/test/url_test.php -- ALL functions must have a corresponding test. at [/svn/goodstorm/www/t/coverage_tests/audit_all_functions_get_tested_at_least_once.phpt line 132]
        in testVerifyThatAllFunctionsGetTested
        in AllFunctionsMustHaveAtLeastOneTestTester
        in ./coverage_tests/audit_all_functions_get_tested_at_least_once.phpt
635) Do not see any tests for function/method testMakingAbsoluteBadlyFormedAppendedPath from file ../lib/simpletest/test/url_test.php -- ALL functions must have a corresponding test. at [/svn/goodstorm/www/t/coverage_tests/audit_all_functions_get_tested_at_least_once.phpt line 132]
        in testVerifyThatAllFunctionsGetTested
        in AllFunctionsMustHaveAtLeastOneTestTester
        in ./coverage_tests/audit_all_functions_get_tested_at_least_once.phpt
636) Do not see any tests for function/method testMakingAbsoluteHasNoEffectWhenAlreadyAbsolute from file ../lib/simpletest/test/url_test.php -- ALL functions must have a corresponding test. at [/svn/goodstorm/www/t/coverage_tests/audit_all_functions_get_tested_at_least_once.phpt line 132]
        in testVerifyThatAllFunctionsGetTested
        in AllFunctionsMustHaveAtLeastOneTestTester
        in ./coverage_tests/audit_all_functions_get_tested_at_least_once.phpt
637) Do not see any tests for function/method testMakingAbsoluteCarriesAuthenticationWhenAlreadyAbsolute from file ../lib/simpletest/test/url_test.php -- ALL functions must have a corresponding test. at [/svn/goodstorm/www/t/coverage_tests/audit_all_functions_get_tested_at_least_once.phpt line 132]
        in testVerifyThatAllFunctionsGetTested
        in AllFunctionsMustHaveAtLeastOneTestTester
        in ./coverage_tests/audit_all_functions_get_tested_at_least_once.phpt
638) Do not see any tests for function/method testMakingHostOnlyAbsoluteDoesNotCarryAnyOtherInformation from file ../lib/simpletest/test/url_test.php -- ALL functions must have a corresponding test. at [/svn/goodstorm/www/t/coverage_tests/audit_all_functions_get_tested_at_least_once.phpt line 132]
        in testVerifyThatAllFunctionsGetTested
        in AllFunctionsMustHaveAtLeastOneTestTester
        in ./coverage_tests/audit_all_functions_get_tested_at_least_once.phpt
639) Do not see any tests for function/method testTargetAttachment from file ../lib/simpletest/test/url_test.php -- ALL functions must have a corresponding test. at [/svn/goodstorm/www/t/coverage_tests/audit_all_functions_get_tested_at_least_once.phpt line 132]
        in testVerifyThatAllFunctionsGetTested
        in AllFunctionsMustHaveAtLeastOneTestTester
        in ./coverage_tests/audit_all_functions_get_tested_at_least_once.phpt
640) Do not see any tests for function/method TestDisplayClass from file ../lib/simpletest/test/visual_test.php -- ALL functions must have a corresponding test. at [/svn/goodstorm/www/t/coverage_tests/audit_all_functions_get_tested_at_least_once.phpt line 132]
        in testVerifyThatAllFunctionsGetTested
        in AllFunctionsMustHaveAtLeastOneTestTester
        in ./coverage_tests/audit_all_functions_get_tested_at_least_once.phpt
641) Do not see any tests for function/method testOfResults from file ../lib/simpletest/test/visual_test.php -- ALL functions must have a corresponding test. at [/svn/goodstorm/www/t/coverage_tests/audit_all_functions_get_tested_at_least_once.phpt line 132]
        in testVerifyThatAllFunctionsGetTested
        in AllFunctionsMustHaveAtLeastOneTestTester
        in ./coverage_tests/audit_all_functions_get_tested_at_least_once.phpt
642) Do not see any tests for function/method testTrue from file ../lib/simpletest/test/visual_test.php -- ALL functions must have a corresponding test. at [/svn/goodstorm/www/t/coverage_tests/audit_all_functions_get_tested_at_least_once.phpt line 132]
        in testVerifyThatAllFunctionsGetTested
        in AllFunctionsMustHaveAtLeastOneTestTester
        in ./coverage_tests/audit_all_functions_get_tested_at_least_once.phpt
643) Do not see any tests for function/method testFalse from file ../lib/simpletest/test/visual_test.php -- ALL functions must have a corresponding test. at [/svn/goodstorm/www/t/coverage_tests/audit_all_functions_get_tested_at_least_once.phpt line 132]
        in testVerifyThatAllFunctionsGetTested
        in AllFunctionsMustHaveAtLeastOneTestTester
        in ./coverage_tests/audit_all_functions_get_tested_at_least_once.phpt
644) Do not see any tests for function/method testExpectation from file ../lib/simpletest/test/visual_test.php -- ALL functions must have a corresponding test. at [/svn/goodstorm/www/t/coverage_tests/audit_all_functions_get_tested_at_least_once.phpt line 132]
        in testVerifyThatAllFunctionsGetTested
        in AllFunctionsMustHaveAtLeastOneTestTester
        in ./coverage_tests/audit_all_functions_get_tested_at_least_once.phpt
645) Do not see any tests for function/method testNull from file ../lib/simpletest/test/visual_test.php -- ALL functions must have a corresponding test. at [/svn/goodstorm/www/t/coverage_tests/audit_all_functions_get_tested_at_least_once.phpt line 132]
        in testVerifyThatAllFunctionsGetTested
        in AllFunctionsMustHaveAtLeastOneTestTester
        in ./coverage_tests/audit_all_functions_get_tested_at_least_once.phpt
646) Do not see any tests for function/method testType from file ../lib/simpletest/test/visual_test.php -- ALL functions must have a corresponding test. at [/svn/goodstorm/www/t/coverage_tests/audit_all_functions_get_tested_at_least_once.phpt line 132]
        in testVerifyThatAllFunctionsGetTested
        in AllFunctionsMustHaveAtLeastOneTestTester
        in ./coverage_tests/audit_all_functions_get_tested_at_least_once.phpt
647) Do not see any tests for function/method testTypeEquality from file ../lib/simpletest/test/visual_test.php -- ALL functions must have a corresponding test. at [/svn/goodstorm/www/t/coverage_tests/audit_all_functions_get_tested_at_least_once.phpt line 132]
        in testVerifyThatAllFunctionsGetTested
        in AllFunctionsMustHaveAtLeastOneTestTester
        in ./coverage_tests/audit_all_functions_get_tested_at_least_once.phpt
648) Do not see any tests for function/method testNullEquality from file ../lib/simpletest/test/visual_test.php -- ALL functions must have a corresponding test. at [/svn/goodstorm/www/t/coverage_tests/audit_all_functions_get_tested_at_least_once.phpt line 132]
        in testVerifyThatAllFunctionsGetTested
        in AllFunctionsMustHaveAtLeastOneTestTester
        in ./coverage_tests/audit_all_functions_get_tested_at_least_once.phpt
649) Do not see any tests for function/method testIntegerEquality from file ../lib/simpletest/test/visual_test.php -- ALL functions must have a corresponding test. at [/svn/goodstorm/www/t/coverage_tests/audit_all_functions_get_tested_at_least_once.phpt line 132]
        in testVerifyThatAllFunctionsGetTested
        in AllFunctionsMustHaveAtLeastOneTestTester
        in ./coverage_tests/audit_all_functions_get_tested_at_least_once.phpt
650) Do not see any tests for function/method testStringEquality from file ../lib/simpletest/test/visual_test.php -- ALL functions must have a corresponding test. at [/svn/goodstorm/www/t/coverage_tests/audit_all_functions_get_tested_at_least_once.phpt line 132]
        in testVerifyThatAllFunctionsGetTested
        in AllFunctionsMustHaveAtLeastOneTestTester
        in ./coverage_tests/audit_all_functions_get_tested_at_least_once.phpt
651) Do not see any tests for function/method testHashEquality from file ../lib/simpletest/test/visual_test.php -- ALL functions must have a corresponding test. at [/svn/goodstorm/www/t/coverage_tests/audit_all_functions_get_tested_at_least_once.phpt line 132]
        in testVerifyThatAllFunctionsGetTested
        in AllFunctionsMustHaveAtLeastOneTestTester
        in ./coverage_tests/audit_all_functions_get_tested_at_least_once.phpt
652) Do not see any tests for function/method testWithin from file ../lib/simpletest/test/visual_test.php -- ALL functions must have a corresponding test. at [/svn/goodstorm/www/t/coverage_tests/audit_all_functions_get_tested_at_least_once.phpt line 132]
        in testVerifyThatAllFunctionsGetTested
        in AllFunctionsMustHaveAtLeastOneTestTester
        in ./coverage_tests/audit_all_functions_get_tested_at_least_once.phpt
653) Do not see any tests for function/method testOutside from file ../lib/simpletest/test/visual_test.php -- ALL functions must have a corresponding test. at [/svn/goodstorm/www/t/coverage_tests/audit_all_functions_get_tested_at_least_once.phpt line 132]
        in testVerifyThatAllFunctionsGetTested
        in AllFunctionsMustHaveAtLeastOneTestTester
        in ./coverage_tests/audit_all_functions_get_tested_at_least_once.phpt
654) Do not see any tests for function/method testStringIdentity from file ../lib/simpletest/test/visual_test.php -- ALL functions must have a corresponding test. at [/svn/goodstorm/www/t/coverage_tests/audit_all_functions_get_tested_at_least_once.phpt line 132]
        in testVerifyThatAllFunctionsGetTested
        in AllFunctionsMustHaveAtLeastOneTestTester
        in ./coverage_tests/audit_all_functions_get_tested_at_least_once.phpt
655) Do not see any tests for function/method testTypeIdentity from file ../lib/simpletest/test/visual_test.php -- ALL functions must have a corresponding test. at [/svn/goodstorm/www/t/coverage_tests/audit_all_functions_get_tested_at_least_once.phpt line 132]
        in testVerifyThatAllFunctionsGetTested
        in AllFunctionsMustHaveAtLeastOneTestTester
        in ./coverage_tests/audit_all_functions_get_tested_at_least_once.phpt
656) Do not see any tests for function/method testNullIdentity from file ../lib/simpletest/test/visual_test.php -- ALL functions must have a corresponding test. at [/svn/goodstorm/www/t/coverage_tests/audit_all_functions_get_tested_at_least_once.phpt line 132]
        in testVerifyThatAllFunctionsGetTested
        in AllFunctionsMustHaveAtLeastOneTestTester
        in ./coverage_tests/audit_all_functions_get_tested_at_least_once.phpt
657) Do not see any tests for function/method testHashIdentity from file ../lib/simpletest/test/visual_test.php -- ALL functions must have a corresponding test. at [/svn/goodstorm/www/t/coverage_tests/audit_all_functions_get_tested_at_least_once.phpt line 132]
        in testVerifyThatAllFunctionsGetTested
        in AllFunctionsMustHaveAtLeastOneTestTester
        in ./coverage_tests/audit_all_functions_get_tested_at_least_once.phpt
658) Do not see any tests for function/method testObjectEquality from file ../lib/simpletest/test/visual_test.php -- ALL functions must have a corresponding test. at [/svn/goodstorm/www/t/coverage_tests/audit_all_functions_get_tested_at_least_once.phpt line 132]
        in testVerifyThatAllFunctionsGetTested
        in AllFunctionsMustHaveAtLeastOneTestTester
        in ./coverage_tests/audit_all_functions_get_tested_at_least_once.phpt
659) Do not see any tests for function/method testObjectIndentity from file ../lib/simpletest/test/visual_test.php -- ALL functions must have a corresponding test. at [/svn/goodstorm/www/t/coverage_tests/audit_all_functions_get_tested_at_least_once.phpt line 132]
        in testVerifyThatAllFunctionsGetTested
        in AllFunctionsMustHaveAtLeastOneTestTester
        in ./coverage_tests/audit_all_functions_get_tested_at_least_once.phpt
660) Do not see any tests for function/method testReference from file ../lib/simpletest/test/visual_test.php -- ALL functions must have a corresponding test. at [/svn/goodstorm/www/t/coverage_tests/audit_all_functions_get_tested_at_least_once.phpt line 132]
        in testVerifyThatAllFunctionsGetTested
        in AllFunctionsMustHaveAtLeastOneTestTester
        in ./coverage_tests/audit_all_functions_get_tested_at_least_once.phpt
661) Do not see any tests for function/method testCloneOnDifferentObjects from file ../lib/simpletest/test/visual_test.php -- ALL functions must have a corresponding test. at [/svn/goodstorm/www/t/coverage_tests/audit_all_functions_get_tested_at_least_once.phpt line 132]
        in testVerifyThatAllFunctionsGetTested
        in AllFunctionsMustHaveAtLeastOneTestTester
        in ./coverage_tests/audit_all_functions_get_tested_at_least_once.phpt
662) Do not see any tests for function/method testPatterns from file ../lib/simpletest/test/visual_test.php -- ALL functions must have a corresponding test. at [/svn/goodstorm/www/t/coverage_tests/audit_all_functions_get_tested_at_least_once.phpt line 132]
        in testVerifyThatAllFunctionsGetTested
        in AllFunctionsMustHaveAtLeastOneTestTester
        in ./coverage_tests/audit_all_functions_get_tested_at_least_once.phpt
663) Do not see any tests for function/method testLongStrings from file ../lib/simpletest/test/visual_test.php -- ALL functions must have a corresponding test. at [/svn/goodstorm/www/t/coverage_tests/audit_all_functions_get_tested_at_least_once.phpt line 132]
        in testVerifyThatAllFunctionsGetTested
        in AllFunctionsMustHaveAtLeastOneTestTester
        in ./coverage_tests/audit_all_functions_get_tested_at_least_once.phpt
664) Do not see any tests for function/method testOfResults from file ../lib/simpletest/test/visual_test.php -- ALL functions must have a corresponding test. at [/svn/goodstorm/www/t/coverage_tests/audit_all_functions_get_tested_at_least_once.phpt line 132]
        in testVerifyThatAllFunctionsGetTested
        in AllFunctionsMustHaveAtLeastOneTestTester
        in ./coverage_tests/audit_all_functions_get_tested_at_least_once.phpt
665) Do not see any tests for function/method testTrue from file ../lib/simpletest/test/visual_test.php -- ALL functions must have a corresponding test. at [/svn/goodstorm/www/t/coverage_tests/audit_all_functions_get_tested_at_least_once.phpt line 132]
        in testVerifyThatAllFunctionsGetTested
        in AllFunctionsMustHaveAtLeastOneTestTester
        in ./coverage_tests/audit_all_functions_get_tested_at_least_once.phpt
666) Do not see any tests for function/method testFalse from file ../lib/simpletest/test/visual_test.php -- ALL functions must have a corresponding test. at [/svn/goodstorm/www/t/coverage_tests/audit_all_functions_get_tested_at_least_once.phpt line 132]
        in testVerifyThatAllFunctionsGetTested
        in AllFunctionsMustHaveAtLeastOneTestTester
        in ./coverage_tests/audit_all_functions_get_tested_at_least_once.phpt
667) Do not see any tests for function/method testExpectation from file ../lib/simpletest/test/visual_test.php -- ALL functions must have a corresponding test. at [/svn/goodstorm/www/t/coverage_tests/audit_all_functions_get_tested_at_least_once.phpt line 132]
        in testVerifyThatAllFunctionsGetTested
        in AllFunctionsMustHaveAtLeastOneTestTester
        in ./coverage_tests/audit_all_functions_get_tested_at_least_once.phpt
668) Do not see any tests for function/method testNull from file ../lib/simpletest/test/visual_test.php -- ALL functions must have a corresponding test. at [/svn/goodstorm/www/t/coverage_tests/audit_all_functions_get_tested_at_least_once.phpt line 132]
        in testVerifyThatAllFunctionsGetTested
        in AllFunctionsMustHaveAtLeastOneTestTester
        in ./coverage_tests/audit_all_functions_get_tested_at_least_once.phpt
669) Do not see any tests for function/method testType from file ../lib/simpletest/test/visual_test.php -- ALL functions must have a corresponding test. at [/svn/goodstorm/www/t/coverage_tests/audit_all_functions_get_tested_at_least_once.phpt line 132]
        in testVerifyThatAllFunctionsGetTested
        in AllFunctionsMustHaveAtLeastOneTestTester
        in ./coverage_tests/audit_all_functions_get_tested_at_least_once.phpt
670) Do not see any tests for function/method testTypeEquality from file ../lib/simpletest/test/visual_test.php -- ALL functions must have a corresponding test. at [/svn/goodstorm/www/t/coverage_tests/audit_all_functions_get_tested_at_least_once.phpt line 132]
        in testVerifyThatAllFunctionsGetTested
        in AllFunctionsMustHaveAtLeastOneTestTester
        in ./coverage_tests/audit_all_functions_get_tested_at_least_once.phpt
671) Do not see any tests for function/method testNullEquality from file ../lib/simpletest/test/visual_test.php -- ALL functions must have a corresponding test. at [/svn/goodstorm/www/t/coverage_tests/audit_all_functions_get_tested_at_least_once.phpt line 132]
        in testVerifyThatAllFunctionsGetTested
        in AllFunctionsMustHaveAtLeastOneTestTester
        in ./coverage_tests/audit_all_functions_get_tested_at_least_once.phpt
672) Do not see any tests for function/method testIntegerEquality from file ../lib/simpletest/test/visual_test.php -- ALL functions must have a corresponding test. at [/svn/goodstorm/www/t/coverage_tests/audit_all_functions_get_tested_at_least_once.phpt line 132]
        in testVerifyThatAllFunctionsGetTested
        in AllFunctionsMustHaveAtLeastOneTestTester
        in ./coverage_tests/audit_all_functions_get_tested_at_least_once.phpt
673) Do not see any tests for function/method testStringEquality from file ../lib/simpletest/test/visual_test.php -- ALL functions must have a corresponding test. at [/svn/goodstorm/www/t/coverage_tests/audit_all_functions_get_tested_at_least_once.phpt line 132]
        in testVerifyThatAllFunctionsGetTested
        in AllFunctionsMustHaveAtLeastOneTestTester
        in ./coverage_tests/audit_all_functions_get_tested_at_least_once.phpt
674) Do not see any tests for function/method testHashEquality from file ../lib/simpletest/test/visual_test.php -- ALL functions must have a corresponding test. at [/svn/goodstorm/www/t/coverage_tests/audit_all_functions_get_tested_at_least_once.phpt line 132]
        in testVerifyThatAllFunctionsGetTested
        in AllFunctionsMustHaveAtLeastOneTestTester
        in ./coverage_tests/audit_all_functions_get_tested_at_least_once.phpt
675) Do not see any tests for function/method testWithin from file ../lib/simpletest/test/visual_test.php -- ALL functions must have a corresponding test. at [/svn/goodstorm/www/t/coverage_tests/audit_all_functions_get_tested_at_least_once.phpt line 132]
        in testVerifyThatAllFunctionsGetTested
        in AllFunctionsMustHaveAtLeastOneTestTester
        in ./coverage_tests/audit_all_functions_get_tested_at_least_once.phpt
676) Do not see any tests for function/method testOutside from file ../lib/simpletest/test/visual_test.php -- ALL functions must have a corresponding test. at [/svn/goodstorm/www/t/coverage_tests/audit_all_functions_get_tested_at_least_once.phpt line 132]
        in testVerifyThatAllFunctionsGetTested
        in AllFunctionsMustHaveAtLeastOneTestTester
        in ./coverage_tests/audit_all_functions_get_tested_at_least_once.phpt
677) Do not see any tests for function/method testStringIdentity from file ../lib/simpletest/test/visual_test.php -- ALL functions must have a corresponding test. at [/svn/goodstorm/www/t/coverage_tests/audit_all_functions_get_tested_at_least_once.phpt line 132]
        in testVerifyThatAllFunctionsGetTested
        in AllFunctionsMustHaveAtLeastOneTestTester
        in ./coverage_tests/audit_all_functions_get_tested_at_least_once.phpt
678) Do not see any tests for function/method testTypeIdentity from file ../lib/simpletest/test/visual_test.php -- ALL functions must have a corresponding test. at [/svn/goodstorm/www/t/coverage_tests/audit_all_functions_get_tested_at_least_once.phpt line 132]
        in testVerifyThatAllFunctionsGetTested
        in AllFunctionsMustHaveAtLeastOneTestTester
        in ./coverage_tests/audit_all_functions_get_tested_at_least_once.phpt
679) Do not see any tests for function/method testNullIdentity from file ../lib/simpletest/test/visual_test.php -- ALL functions must have a corresponding test. at [/svn/goodstorm/www/t/coverage_tests/audit_all_functions_get_tested_at_least_once.phpt line 132]
        in testVerifyThatAllFunctionsGetTested
        in AllFunctionsMustHaveAtLeastOneTestTester
        in ./coverage_tests/audit_all_functions_get_tested_at_least_once.phpt
680) Do not see any tests for function/method testHashIdentity from file ../lib/simpletest/test/visual_test.php -- ALL functions must have a corresponding test. at [/svn/goodstorm/www/t/coverage_tests/audit_all_functions_get_tested_at_least_once.phpt line 132]
        in testVerifyThatAllFunctionsGetTested
        in AllFunctionsMustHaveAtLeastOneTestTester
        in ./coverage_tests/audit_all_functions_get_tested_at_least_once.phpt
681) Do not see any tests for function/method testObjectEquality from file ../lib/simpletest/test/visual_test.php -- ALL functions must have a corresponding test. at [/svn/goodstorm/www/t/coverage_tests/audit_all_functions_get_tested_at_least_once.phpt line 132]
        in testVerifyThatAllFunctionsGetTested
        in AllFunctionsMustHaveAtLeastOneTestTester
        in ./coverage_tests/audit_all_functions_get_tested_at_least_once.phpt
682) Do not see any tests for function/method testObjectIndentity from file ../lib/simpletest/test/visual_test.php -- ALL functions must have a corresponding test. at [/svn/goodstorm/www/t/coverage_tests/audit_all_functions_get_tested_at_least_once.phpt line 132]
        in testVerifyThatAllFunctionsGetTested
        in AllFunctionsMustHaveAtLeastOneTestTester
        in ./coverage_tests/audit_all_functions_get_tested_at_least_once.phpt
683) Do not see any tests for function/method testReference from file ../lib/simpletest/test/visual_test.php -- ALL functions must have a corresponding test. at [/svn/goodstorm/www/t/coverage_tests/audit_all_functions_get_tested_at_least_once.phpt line 132]
        in testVerifyThatAllFunctionsGetTested
        in AllFunctionsMustHaveAtLeastOneTestTester
        in ./coverage_tests/audit_all_functions_get_tested_at_least_once.phpt
684) Do not see any tests for function/method testCloneOnDifferentObjects from file ../lib/simpletest/test/visual_test.php -- ALL functions must have a corresponding test. at [/svn/goodstorm/www/t/coverage_tests/audit_all_functions_get_tested_at_least_once.phpt line 132]
        in testVerifyThatAllFunctionsGetTested
        in AllFunctionsMustHaveAtLeastOneTestTester
        in ./coverage_tests/audit_all_functions_get_tested_at_least_once.phpt
685) Do not see any tests for function/method testPatterns from file ../lib/simpletest/test/visual_test.php -- ALL functions must have a corresponding test. at [/svn/goodstorm/www/t/coverage_tests/audit_all_functions_get_tested_at_least_once.phpt line 132]
        in testVerifyThatAllFunctionsGetTested
        in AllFunctionsMustHaveAtLeastOneTestTester
        in ./coverage_tests/audit_all_functions_get_tested_at_least_once.phpt
686) Do not see any tests for function/method testLongStrings from file ../lib/simpletest/test/visual_test.php -- ALL functions must have a corresponding test. at [/svn/goodstorm/www/t/coverage_tests/audit_all_functions_get_tested_at_least_once.phpt line 132]
        in testVerifyThatAllFunctionsGetTested
        in AllFunctionsMustHaveAtLeastOneTestTester
        in ./coverage_tests/audit_all_functions_get_tested_at_least_once.phpt
687) Do not see any tests for function/method Dummy from file ../lib/simpletest/test/visual_test.php -- ALL functions must have a corresponding test. at [/svn/goodstorm/www/t/coverage_tests/audit_all_functions_get_tested_at_least_once.phpt line 132]
        in testVerifyThatAllFunctionsGetTested
        in AllFunctionsMustHaveAtLeastOneTestTester
        in ./coverage_tests/audit_all_functions_get_tested_at_least_once.phpt
688) Do not see any tests for function/method a from file ../lib/simpletest/test/visual_test.php -- ALL functions must have a corresponding test. at [/svn/goodstorm/www/t/coverage_tests/audit_all_functions_get_tested_at_least_once.phpt line 132]
        in testVerifyThatAllFunctionsGetTested
        in AllFunctionsMustHaveAtLeastOneTestTester
        in ./coverage_tests/audit_all_functions_get_tested_at_least_once.phpt
689) Do not see any tests for function/method testCallCounts from file ../lib/simpletest/test/visual_test.php -- ALL functions must have a corresponding test. at [/svn/goodstorm/www/t/coverage_tests/audit_all_functions_get_tested_at_least_once.phpt line 132]
        in testVerifyThatAllFunctionsGetTested
        in AllFunctionsMustHaveAtLeastOneTestTester
        in ./coverage_tests/audit_all_functions_get_tested_at_least_once.phpt
690) Do not see any tests for function/method testMinimumCallCounts from file ../lib/simpletest/test/visual_test.php -- ALL functions must have a corresponding test. at [/svn/goodstorm/www/t/coverage_tests/audit_all_functions_get_tested_at_least_once.phpt line 132]
        in testVerifyThatAllFunctionsGetTested
        in AllFunctionsMustHaveAtLeastOneTestTester
        in ./coverage_tests/audit_all_functions_get_tested_at_least_once.phpt
691) Do not see any tests for function/method testEmptyMatching from file ../lib/simpletest/test/visual_test.php -- ALL functions must have a corresponding test. at [/svn/goodstorm/www/t/coverage_tests/audit_all_functions_get_tested_at_least_once.phpt line 132]
        in testVerifyThatAllFunctionsGetTested
        in AllFunctionsMustHaveAtLeastOneTestTester
        in ./coverage_tests/audit_all_functions_get_tested_at_least_once.phpt
692) Do not see any tests for function/method testEmptyMatchingWithCustomMessage from file ../lib/simpletest/test/visual_test.php -- ALL functions must have a corresponding test. at [/svn/goodstorm/www/t/coverage_tests/audit_all_functions_get_tested_at_least_once.phpt line 132]
        in testVerifyThatAllFunctionsGetTested
        in AllFunctionsMustHaveAtLeastOneTestTester
        in ./coverage_tests/audit_all_functions_get_tested_at_least_once.phpt
693) Do not see any tests for function/method testNullMatching from file ../lib/simpletest/test/visual_test.php -- ALL functions must have a corresponding test. at [/svn/goodstorm/www/t/coverage_tests/audit_all_functions_get_tested_at_least_once.phpt line 132]
        in testVerifyThatAllFunctionsGetTested
        in AllFunctionsMustHaveAtLeastOneTestTester
        in ./coverage_tests/audit_all_functions_get_tested_at_least_once.phpt
694) Do not see any tests for function/method testBooleanMatching from file ../lib/simpletest/test/visual_test.php -- ALL functions must have a corresponding test. at [/svn/goodstorm/www/t/coverage_tests/audit_all_functions_get_tested_at_least_once.phpt line 132]
        in testVerifyThatAllFunctionsGetTested
        in AllFunctionsMustHaveAtLeastOneTestTester
        in ./coverage_tests/audit_all_functions_get_tested_at_least_once.phpt
695) Do not see any tests for function/method testIntegerMatching from file ../lib/simpletest/test/visual_test.php -- ALL functions must have a corresponding test. at [/svn/goodstorm/www/t/coverage_tests/audit_all_functions_get_tested_at_least_once.phpt line 132]
        in testVerifyThatAllFunctionsGetTested
        in AllFunctionsMustHaveAtLeastOneTestTester
        in ./coverage_tests/audit_all_functions_get_tested_at_least_once.phpt
696) Do not see any tests for function/method testFloatMatching from file ../lib/simpletest/test/visual_test.php -- ALL functions must have a corresponding test. at [/svn/goodstorm/www/t/coverage_tests/audit_all_functions_get_tested_at_least_once.phpt line 132]
        in testVerifyThatAllFunctionsGetTested
        in AllFunctionsMustHaveAtLeastOneTestTester
        in ./coverage_tests/audit_all_functions_get_tested_at_least_once.phpt
697) Do not see any tests for function/method testStringMatching from file ../lib/simpletest/test/visual_test.php -- ALL functions must have a corresponding test. at [/svn/goodstorm/www/t/coverage_tests/audit_all_functions_get_tested_at_least_once.phpt line 132]
        in testVerifyThatAllFunctionsGetTested
        in AllFunctionsMustHaveAtLeastOneTestTester
        in ./coverage_tests/audit_all_functions_get_tested_at_least_once.phpt
698) Do not see any tests for function/method testEmptyMatchingWithCustomExpectationMessage from file ../lib/simpletest/test/visual_test.php -- ALL functions must have a corresponding test. at [/svn/goodstorm/www/t/coverage_tests/audit_all_functions_get_tested_at_least_once.phpt line 132]
        in testVerifyThatAllFunctionsGetTested
        in AllFunctionsMustHaveAtLeastOneTestTester
        in ./coverage_tests/audit_all_functions_get_tested_at_least_once.phpt
699) Do not see any tests for function/method testArrayMatching from file ../lib/simpletest/test/visual_test.php -- ALL functions must have a corresponding test. at [/svn/goodstorm/www/t/coverage_tests/audit_all_functions_get_tested_at_least_once.phpt line 132]
        in testVerifyThatAllFunctionsGetTested
        in AllFunctionsMustHaveAtLeastOneTestTester
        in ./coverage_tests/audit_all_functions_get_tested_at_least_once.phpt
700) Do not see any tests for function/method testObjectMatching from file ../lib/simpletest/test/visual_test.php -- ALL functions must have a corresponding test. at [/svn/goodstorm/www/t/coverage_tests/audit_all_functions_get_tested_at_least_once.phpt line 132]
        in testVerifyThatAllFunctionsGetTested
        in AllFunctionsMustHaveAtLeastOneTestTester
        in ./coverage_tests/audit_all_functions_get_tested_at_least_once.phpt
701) Do not see any tests for function/method testBigList from file ../lib/simpletest/test/visual_test.php -- ALL functions must have a corresponding test. at [/svn/goodstorm/www/t/coverage_tests/audit_all_functions_get_tested_at_least_once.phpt line 132]
        in testVerifyThatAllFunctionsGetTested
        in AllFunctionsMustHaveAtLeastOneTestTester
        in ./coverage_tests/audit_all_functions_get_tested_at_least_once.phpt
702) Do not see any tests for function/method testMixedTypes from file ../lib/simpletest/test/visual_test.php -- ALL functions must have a corresponding test. at [/svn/goodstorm/www/t/coverage_tests/audit_all_functions_get_tested_at_least_once.phpt line 132]
        in testVerifyThatAllFunctionsGetTested
        in AllFunctionsMustHaveAtLeastOneTestTester
        in ./coverage_tests/audit_all_functions_get_tested_at_least_once.phpt
703) Do not see any tests for function/method testMockWildcards from file ../lib/simpletest/test/visual_test.php -- ALL functions must have a corresponding test. at [/svn/goodstorm/www/t/coverage_tests/audit_all_functions_get_tested_at_least_once.phpt line 132]
        in testVerifyThatAllFunctionsGetTested
        in AllFunctionsMustHaveAtLeastOneTestTester
        in ./coverage_tests/audit_all_functions_get_tested_at_least_once.phpt
704) Do not see any tests for function/method testDump from file ../lib/simpletest/test/visual_test.php -- ALL functions must have a corresponding test. at [/svn/goodstorm/www/t/coverage_tests/audit_all_functions_get_tested_at_least_once.phpt line 132]
        in testVerifyThatAllFunctionsGetTested
        in AllFunctionsMustHaveAtLeastOneTestTester
        in ./coverage_tests/audit_all_functions_get_tested_at_least_once.phpt
705) Do not see any tests for function/method testDumpOfList from file ../lib/simpletest/test/visual_test.php -- ALL functions must have a corresponding test. at [/svn/goodstorm/www/t/coverage_tests/audit_all_functions_get_tested_at_least_once.phpt line 132]
        in testVerifyThatAllFunctionsGetTested
        in AllFunctionsMustHaveAtLeastOneTestTester
        in ./coverage_tests/audit_all_functions_get_tested_at_least_once.phpt
706) Do not see any tests for function/method \_getCss from file ../lib/simpletest/test/visual_test.php -- ALL functions must have a corresponding test. at [/svn/goodstorm/www/t/coverage_tests/audit_all_functions_get_tested_at_least_once.phpt line 132]
        in testVerifyThatAllFunctionsGetTested
        in AllFunctionsMustHaveAtLeastOneTestTester
        in ./coverage_tests/audit_all_functions_get_tested_at_least_once.phpt
707) Do not see any tests for function/method paintPass from file ../lib/simpletest/test/visual_test.php -- ALL functions must have a corresponding test. at [/svn/goodstorm/www/t/coverage_tests/audit_all_functions_get_tested_at_least_once.phpt line 132]
        in testVerifyThatAllFunctionsGetTested
        in AllFunctionsMustHaveAtLeastOneTestTester
        in ./coverage_tests/audit_all_functions_get_tested_at_least_once.phpt
708) Do not see any tests for function/method paintSignal from file ../lib/simpletest/test/visual_test.php -- ALL functions must have a corresponding test. at [/svn/goodstorm/www/t/coverage_tests/audit_all_functions_get_tested_at_least_once.phpt line 132]
        in testVerifyThatAllFunctionsGetTested
        in AllFunctionsMustHaveAtLeastOneTestTester
        in ./coverage_tests/audit_all_functions_get_tested_at_least_once.phpt
709) Do not see any tests for function/method skip from file ../lib/simpletest/test/visual_test.php -- ALL functions must have a corresponding test. at [/svn/goodstorm/www/t/coverage_tests/audit_all_functions_get_tested_at_least_once.phpt line 132]
        in testVerifyThatAllFunctionsGetTested
        in AllFunctionsMustHaveAtLeastOneTestTester
        in ./coverage_tests/audit_all_functions_get_tested_at_least_once.phpt
710) Do not see any tests for function/method testFail from file ../lib/simpletest/test/visual_test.php -- ALL functions must have a corresponding test. at [/svn/goodstorm/www/t/coverage_tests/audit_all_functions_get_tested_at_least_once.phpt line 132]
        in testVerifyThatAllFunctionsGetTested
        in AllFunctionsMustHaveAtLeastOneTestTester
        in ./coverage_tests/audit_all_functions_get_tested_at_least_once.phpt
711) Do not see any tests for function/method skip from file ../lib/simpletest/test/visual_test.php -- ALL functions must have a corresponding test. at [/svn/goodstorm/www/t/coverage_tests/audit_all_functions_get_tested_at_least_once.phpt line 132]
        in testVerifyThatAllFunctionsGetTested
        in AllFunctionsMustHaveAtLeastOneTestTester
        in ./coverage_tests/audit_all_functions_get_tested_at_least_once.phpt
712) Do not see any tests for function/method testFail from file ../lib/simpletest/test/visual_test.php -- ALL functions must have a corresponding test. at [/svn/goodstorm/www/t/coverage_tests/audit_all_functions_get_tested_at_least_once.phpt line 132]
        in testVerifyThatAllFunctionsGetTested
        in AllFunctionsMustHaveAtLeastOneTestTester
        in ./coverage_tests/audit_all_functions_get_tested_at_least_once.phpt
713) Do not see any tests for function/method skip from file ../lib/simpletest/test/visual_test.php -- ALL functions must have a corresponding test. at [/svn/goodstorm/www/t/coverage_tests/audit_all_functions_get_tested_at_least_once.phpt line 132]
        in testVerifyThatAllFunctionsGetTested
        in AllFunctionsMustHaveAtLeastOneTestTester
        in ./coverage_tests/audit_all_functions_get_tested_at_least_once.phpt
714) Do not see any tests for function/method testFail from file ../lib/simpletest/test/visual_test.php -- ALL functions must have a corresponding test. at [/svn/goodstorm/www/t/coverage_tests/audit_all_functions_get_tested_at_least_once.phpt line 132]
        in testVerifyThatAllFunctionsGetTested
        in AllFunctionsMustHaveAtLeastOneTestTester
        in ./coverage_tests/audit_all_functions_get_tested_at_least_once.phpt
715) Do not see any tests for function/method skip from file ../lib/simpletest/test/visual_test.php -- ALL functions must have a corresponding test. at [/svn/goodstorm/www/t/coverage_tests/audit_all_functions_get_tested_at_least_once.phpt line 132]
        in testVerifyThatAllFunctionsGetTested
        in AllFunctionsMustHaveAtLeastOneTestTester
        in ./coverage_tests/audit_all_functions_get_tested_at_least_once.phpt
716) Do not see any tests for function/method testFail from file ../lib/simpletest/test/visual_test.php -- ALL functions must have a corresponding test. at [/svn/goodstorm/www/t/coverage_tests/audit_all_functions_get_tested_at_least_once.phpt line 132]
        in testVerifyThatAllFunctionsGetTested
        in AllFunctionsMustHaveAtLeastOneTestTester
        in ./coverage_tests/audit_all_functions_get_tested_at_least_once.phpt
717) Do not see any tests for function/method testPass from file ../lib/simpletest/test/visual_test.php -- ALL functions must have a corresponding test. at [/svn/goodstorm/www/t/coverage_tests/audit_all_functions_get_tested_at_least_once.phpt line 132]
        in testVerifyThatAllFunctionsGetTested
        in AllFunctionsMustHaveAtLeastOneTestTester
        in ./coverage_tests/audit_all_functions_get_tested_at_least_once.phpt
718) Do not see any tests for function/method testStringMatchingIsCaseSensitive from file ../lib/simpletest/test/web_tester_test.php -- ALL functions must have a corresponding test. at [/svn/goodstorm/www/t/coverage_tests/audit_all_functions_get_tested_at_least_once.phpt line 132]
        in testVerifyThatAllFunctionsGetTested
        in AllFunctionsMustHaveAtLeastOneTestTester
        in ./coverage_tests/audit_all_functions_get_tested_at_least_once.phpt
719) Do not see any tests for function/method testMatchesInteger from file ../lib/simpletest/test/web_tester_test.php -- ALL functions must have a corresponding test. at [/svn/goodstorm/www/t/coverage_tests/audit_all_functions_get_tested_at_least_once.phpt line 132]
        in testVerifyThatAllFunctionsGetTested
        in AllFunctionsMustHaveAtLeastOneTestTester
        in ./coverage_tests/audit_all_functions_get_tested_at_least_once.phpt
720) Do not see any tests for function/method testNonStringFailsExpectation from file ../lib/simpletest/test/web_tester_test.php -- ALL functions must have a corresponding test. at [/svn/goodstorm/www/t/coverage_tests/audit_all_functions_get_tested_at_least_once.phpt line 132]
        in testVerifyThatAllFunctionsGetTested
        in AllFunctionsMustHaveAtLeastOneTestTester
        in ./coverage_tests/audit_all_functions_get_tested_at_least_once.phpt
721) Do not see any tests for function/method testUnsetFieldCanBeTestedFor from file ../lib/simpletest/test/web_tester_test.php -- ALL functions must have a corresponding test. at [/svn/goodstorm/www/t/coverage_tests/audit_all_functions_get_tested_at_least_once.phpt line 132]
        in testVerifyThatAllFunctionsGetTested
        in AllFunctionsMustHaveAtLeastOneTestTester
        in ./coverage_tests/audit_all_functions_get_tested_at_least_once.phpt
722) Do not see any tests for function/method testMultipleValuesCanBeInAnyOrder from file ../lib/simpletest/test/web_tester_test.php -- ALL functions must have a corresponding test. at [/svn/goodstorm/www/t/coverage_tests/audit_all_functions_get_tested_at_least_once.phpt line 132]
        in testVerifyThatAllFunctionsGetTested
        in AllFunctionsMustHaveAtLeastOneTestTester
        in ./coverage_tests/audit_all_functions_get_tested_at_least_once.phpt
723) Do not see any tests for function/method testSingleItemCanBeArrayOrString from file ../lib/simpletest/test/web_tester_test.php -- ALL functions must have a corresponding test. at [/svn/goodstorm/www/t/coverage_tests/audit_all_functions_get_tested_at_least_once.phpt line 132]
        in testVerifyThatAllFunctionsGetTested
        in AllFunctionsMustHaveAtLeastOneTestTester
        in ./coverage_tests/audit_all_functions_get_tested_at_least_once.phpt
724) Do not see any tests for function/method testExpectingOnlyTheHeaderName from file ../lib/simpletest/test/web_tester_test.php -- ALL functions must have a corresponding test. at [/svn/goodstorm/www/t/coverage_tests/audit_all_functions_get_tested_at_least_once.phpt line 132]
        in testVerifyThatAllFunctionsGetTested
        in AllFunctionsMustHaveAtLeastOneTestTester
        in ./coverage_tests/audit_all_functions_get_tested_at_least_once.phpt
725) Do not see any tests for function/method testHeaderValueAsWell from file ../lib/simpletest/test/web_tester_test.php -- ALL functions must have a corresponding test. at [/svn/goodstorm/www/t/coverage_tests/audit_all_functions_get_tested_at_least_once.phpt line 132]
        in testVerifyThatAllFunctionsGetTested
        in AllFunctionsMustHaveAtLeastOneTestTester
        in ./coverage_tests/audit_all_functions_get_tested_at_least_once.phpt
726) Do not see any tests for function/method testHeaderValueWithColons from file ../lib/simpletest/test/web_tester_test.php -- ALL functions must have a corresponding test. at [/svn/goodstorm/www/t/coverage_tests/audit_all_functions_get_tested_at_least_once.phpt line 132]
        in testVerifyThatAllFunctionsGetTested
        in AllFunctionsMustHaveAtLeastOneTestTester
        in ./coverage_tests/audit_all_functions_get_tested_at_least_once.phpt
727) Do not see any tests for function/method testMultilineSearch from file ../lib/simpletest/test/web_tester_test.php -- ALL functions must have a corresponding test. at [/svn/goodstorm/www/t/coverage_tests/audit_all_functions_get_tested_at_least_once.phpt line 132]
        in testVerifyThatAllFunctionsGetTested
        in AllFunctionsMustHaveAtLeastOneTestTester
        in ./coverage_tests/audit_all_functions_get_tested_at_least_once.phpt
728) Do not see any tests for function/method testMultilineSearchWithPadding from file ../lib/simpletest/test/web_tester_test.php -- ALL functions must have a corresponding test. at [/svn/goodstorm/www/t/coverage_tests/audit_all_functions_get_tested_at_least_once.phpt line 132]
        in testVerifyThatAllFunctionsGetTested
        in AllFunctionsMustHaveAtLeastOneTestTester
        in ./coverage_tests/audit_all_functions_get_tested_at_least_once.phpt
729) Do not see any tests for function/method testPatternMatching from file ../lib/simpletest/test/web_tester_test.php -- ALL functions must have a corresponding test. at [/svn/goodstorm/www/t/coverage_tests/audit_all_functions_get_tested_at_least_once.phpt line 132]
        in testVerifyThatAllFunctionsGetTested
        in AllFunctionsMustHaveAtLeastOneTestTester
        in ./coverage_tests/audit_all_functions_get_tested_at_least_once.phpt
730) Do not see any tests for function/method testCaseInsensitivePatternMatching from file ../lib/simpletest/test/web_tester_test.php -- ALL functions must have a corresponding test. at [/svn/goodstorm/www/t/coverage_tests/audit_all_functions_get_tested_at_least_once.phpt line 132]
        in testVerifyThatAllFunctionsGetTested
        in AllFunctionsMustHaveAtLeastOneTestTester
        in ./coverage_tests/audit_all_functions_get_tested_at_least_once.phpt
731) Do not see any tests for function/method testUnwantedHeader from file ../lib/simpletest/test/web_tester_test.php -- ALL functions must have a corresponding test. at [/svn/goodstorm/www/t/coverage_tests/audit_all_functions_get_tested_at_least_once.phpt line 132]
        in testVerifyThatAllFunctionsGetTested
        in AllFunctionsMustHaveAtLeastOneTestTester
        in ./coverage_tests/audit_all_functions_get_tested_at_least_once.phpt
732) Do not see any tests for function/method testMultilineUnwantedSearch from file ../lib/simpletest/test/web_tester_test.php -- ALL functions must have a corresponding test. at [/svn/goodstorm/www/t/coverage_tests/audit_all_functions_get_tested_at_least_once.phpt line 132]
        in testVerifyThatAllFunctionsGetTested
        in AllFunctionsMustHaveAtLeastOneTestTester
        in ./coverage_tests/audit_all_functions_get_tested_at_least_once.phpt
733) Do not see any tests for function/method testLocationHeaderSplitsCorrectly from file ../lib/simpletest/test/web_tester_test.php -- ALL functions must have a corresponding test. at [/svn/goodstorm/www/t/coverage_tests/audit_all_functions_get_tested_at_least_once.phpt line 132]
        in testVerifyThatAllFunctionsGetTested
        in AllFunctionsMustHaveAtLeastOneTestTester
        in ./coverage_tests/audit_all_functions_get_tested_at_least_once.phpt
734) Do not see any tests for function/method testMatchingSubString from file ../lib/simpletest/test/web_tester_test.php -- ALL functions must have a corresponding test. at [/svn/goodstorm/www/t/coverage_tests/audit_all_functions_get_tested_at_least_once.phpt line 132]
        in testVerifyThatAllFunctionsGetTested
        in AllFunctionsMustHaveAtLeastOneTestTester
        in ./coverage_tests/audit_all_functions_get_tested_at_least_once.phpt
735) Do not see any tests for function/method testNotMatchingSubString from file ../lib/simpletest/test/web_tester_test.php -- ALL functions must have a corresponding test. at [/svn/goodstorm/www/t/coverage_tests/audit_all_functions_get_tested_at_least_once.phpt line 132]
        in testVerifyThatAllFunctionsGetTested
        in AllFunctionsMustHaveAtLeastOneTestTester
        in ./coverage_tests/audit_all_functions_get_tested_at_least_once.phpt
736) Do not see any tests for function/method testEquality from file ../lib/simpletest/test/web_tester_test.php -- ALL functions must have a corresponding test. at [/svn/goodstorm/www/t/coverage_tests/audit_all_functions_get_tested_at_least_once.phpt line 132]
        in testVerifyThatAllFunctionsGetTested
        in AllFunctionsMustHaveAtLeastOneTestTester
        in ./coverage_tests/audit_all_functions_get_tested_at_least_once.phpt
737) Do not see any tests for function/method Taxation from file ../lib/Taxation/Taxation.php.class -- ALL functions must have a corresponding test. at [/svn/goodstorm/www/t/coverage_tests/audit_all_functions_get_tested_at_least_once.phpt line 132]
        in testVerifyThatAllFunctionsGetTested
        in AllFunctionsMustHaveAtLeastOneTestTester
        in ./coverage_tests/audit_all_functions_get_tested_at_least_once.phpt
738) Do not see any tests for function/method Track from file ../lib/Track/Track.php.class -- ALL functions must have a corresponding test. at [/svn/goodstorm/www/t/coverage_tests/audit_all_functions_get_tested_at_least_once.phpt line 132]
        in testVerifyThatAllFunctionsGetTested
        in AllFunctionsMustHaveAtLeastOneTestTester
        in ./coverage_tests/audit_all_functions_get_tested_at_least_once.phpt
739) Do not see any tests for function/method \_version\_history from file ../lib/Track/Track.php.class -- ALL functions must have a corresponding test. at [/svn/goodstorm/www/t/coverage_tests/audit_all_functions_get_tested_at_least_once.phpt line 132]
        in testVerifyThatAllFunctionsGetTested
        in AllFunctionsMustHaveAtLeastOneTestTester
        in ./coverage_tests/audit_all_functions_get_tested_at_least_once.phpt
740) Do not see any tests for function/method albums from file ../lib/Track/Track.php.class -- ALL functions must have a corresponding test. at [/svn/goodstorm/www/t/coverage_tests/audit_all_functions_get_tested_at_least_once.phpt line 132]
        in testVerifyThatAllFunctionsGetTested
        in AllFunctionsMustHaveAtLeastOneTestTester
        in ./coverage_tests/audit_all_functions_get_tested_at_least_once.phpt
741) Do not see any tests for function/method TrackAdmin from file ../lib/TrackAdmin/TrackAdmin.php.class -- ALL functions must have a corresponding test. at [/svn/goodstorm/www/t/coverage_tests/audit_all_functions_get_tested_at_least_once.phpt line 132]
        in testVerifyThatAllFunctionsGetTested
        in AllFunctionsMustHaveAtLeastOneTestTester
        in ./coverage_tests/audit_all_functions_get_tested_at_least_once.phpt
742) Do not see any tests for function/method TransactionAdmin from file ../lib/Transaction/Admin/TransactionAdmin.php.class -- ALL functions must have a corresponding test. at [/svn/goodstorm/www/t/coverage_tests/audit_all_functions_get_tested_at_least_once.phpt line 132]
        in testVerifyThatAllFunctionsGetTested
        in AllFunctionsMustHaveAtLeastOneTestTester
        in ./coverage_tests/audit_all_functions_get_tested_at_least_once.phpt
743) Do not see any tests for function/method TransactionPaymentRecord from file ../lib/Transaction/PaymentRecord/TransactionPaymentRecord.php.class -- ALL functions must have a corresponding test. at [/svn/goodstorm/www/t/coverage_tests/audit_all_functions_get_tested_at_least_once.phpt line 132]
        in testVerifyThatAllFunctionsGetTested
        in AllFunctionsMustHaveAtLeastOneTestTester
        in ./coverage_tests/audit_all_functions_get_tested_at_least_once.phpt
744) Do not see any tests for function/method Shipping from file ../lib/Transaction/Product/TransactionProduct.php.class -- ALL functions must have a corresponding test. at [/svn/goodstorm/www/t/coverage_tests/audit_all_functions_get_tested_at_least_once.phpt line 132]
        in testVerifyThatAllFunctionsGetTested
        in AllFunctionsMustHaveAtLeastOneTestTester
        in ./coverage_tests/audit_all_functions_get_tested_at_least_once.phpt
745) Do not see any tests for function/method TransactionRevenueSplit from file ../lib/Transaction/RevenueSplit/TransactionRevenueSplit.php.class -- ALL functions must have a corresponding test. at [/svn/goodstorm/www/t/coverage_tests/audit_all_functions_get_tested_at_least_once.phpt line 132]
        in testVerifyThatAllFunctionsGetTested
        in AllFunctionsMustHaveAtLeastOneTestTester
        in ./coverage_tests/audit_all_functions_get_tested_at_least_once.phpt
746) Do not see any tests for function/method TransactionShippingRecord from file ../lib/Transaction/ShippingRecord/TransactionShippingRecord.php.class -- ALL functions must have a corresponding test. at [/svn/goodstorm/www/t/coverage_tests/audit_all_functions_get_tested_at_least_once.phpt line 132]
        in testVerifyThatAllFunctionsGetTested
        in AllFunctionsMustHaveAtLeastOneTestTester
        in ./coverage_tests/audit_all_functions_get_tested_at_least_once.phpt
747) Do not see any tests for function/method TransactionTaxationRecord from file ../lib/Transaction/TaxationRecord/TransactionTaxationRecord.php.class -- ALL functions must have a corresponding test. at [/svn/goodstorm/www/t/coverage_tests/audit_all_functions_get_tested_at_least_once.phpt line 132]
        in testVerifyThatAllFunctionsGetTested
        in AllFunctionsMustHaveAtLeastOneTestTester
        in ./coverage_tests/audit_all_functions_get_tested_at_least_once.phpt
748) Do not see any tests for function/method \_stub from file ../lib/Transaction/TaxationRecord/TransactionTaxationRecord.php.class -- ALL functions must have a corresponding test. at [/svn/goodstorm/www/t/coverage_tests/audit_all_functions_get_tested_at_least_once.phpt line 132]
        in testVerifyThatAllFunctionsGetTested
        in AllFunctionsMustHaveAtLeastOneTestTester
        in ./coverage_tests/audit_all_functions_get_tested_at_least_once.phpt
749) Do not see any tests for function/method Transaction from file ../lib/Transaction/Transaction.php.class -- ALL functions must have a corresponding test. at [/svn/goodstorm/www/t/coverage_tests/audit_all_functions_get_tested_at_least_once.phpt line 132]
        in testVerifyThatAllFunctionsGetTested
        in AllFunctionsMustHaveAtLeastOneTestTester
        in ./coverage_tests/audit_all_functions_get_tested_at_least_once.phpt
750) Do not see any tests for function/method TransactionVendorRecord from file ../lib/Transaction/VendorRecord/TransactionVendorRecord.php.class -- ALL functions must have a corresponding test. at [/svn/goodstorm/www/t/coverage_tests/audit_all_functions_get_tested_at_least_once.phpt line 132]
        in testVerifyThatAllFunctionsGetTested
        in AllFunctionsMustHaveAtLeastOneTestTester
        in ./coverage_tests/audit_all_functions_get_tested_at_least_once.phpt
751) Do not see any tests for function/method User from file ../lib/User/User.php.class -- ALL functions must have a corresponding test. at [/svn/goodstorm/www/t/coverage_tests/audit_all_functions_get_tested_at_least_once.phpt line 132]
        in testVerifyThatAllFunctionsGetTested
        in AllFunctionsMustHaveAtLeastOneTestTester
        in ./coverage_tests/audit_all_functions_get_tested_at_least_once.phpt
752) Do not see any tests for function/method access from file ../lib/User/User.php.class -- ALL functions must have a corresponding test. at [/svn/goodstorm/www/t/coverage_tests/audit_all_functions_get_tested_at_least_once.phpt line 132]
        in testVerifyThatAllFunctionsGetTested
        in AllFunctionsMustHaveAtLeastOneTestTester
        in ./coverage_tests/audit_all_functions_get_tested_at_least_once.phpt
753) Do not see any tests for function/method has\_role from file ../lib/User/User.php.class -- ALL functions must have a corresponding test. at [/svn/goodstorm/www/t/coverage_tests/audit_all_functions_get_tested_at_least_once.phpt line 132]
        in testVerifyThatAllFunctionsGetTested
        in AllFunctionsMustHaveAtLeastOneTestTester
        in ./coverage_tests/audit_all_functions_get_tested_at_least_once.phpt
754) Do not see any tests for function/method authenticate from file ../lib/User/User.php.class -- ALL functions must have a corresponding test. at [/svn/goodstorm/www/t/coverage_tests/audit_all_functions_get_tested_at_least_once.phpt line 132]
        in testVerifyThatAllFunctionsGetTested
        in AllFunctionsMustHaveAtLeastOneTestTester
        in ./coverage_tests/audit_all_functions_get_tested_at_least_once.phpt
755) Do not see any tests for function/method can from file ../lib/User/User.php.class -- ALL functions must have a corresponding test. at [/svn/goodstorm/www/t/coverage_tests/audit_all_functions_get_tested_at_least_once.phpt line 132]
        in testVerifyThatAllFunctionsGetTested
        in AllFunctionsMustHaveAtLeastOneTestTester
        in ./coverage_tests/audit_all_functions_get_tested_at_least_once.phpt
756) Do not see any tests for function/method UserAdmin from file ../lib/UserAdmin/UserAdmin.php.class -- ALL functions must have a corresponding test. at [/svn/goodstorm/www/t/coverage_tests/audit_all_functions_get_tested_at_least_once.phpt line 132]
        in testVerifyThatAllFunctionsGetTested
        in AllFunctionsMustHaveAtLeastOneTestTester
        in ./coverage_tests/audit_all_functions_get_tested_at_least_once.phpt
757) Do not see any tests for function/method create\_user from file ../lib/UserAdmin/UserAdmin.php.class -- ALL functions must have a corresponding test. at [/svn/goodstorm/www/t/coverage_tests/audit_all_functions_get_tested_at_least_once.phpt line 132]
        in testVerifyThatAllFunctionsGetTested
        in AllFunctionsMustHaveAtLeastOneTestTester
        in ./coverage_tests/audit_all_functions_get_tested_at_least_once.phpt
758) Do not see any tests for function/method update\_user from file ../lib/UserAdmin/UserAdmin.php.class -- ALL functions must have a corresponding test. at [/svn/goodstorm/www/t/coverage_tests/audit_all_functions_get_tested_at_least_once.phpt line 132]
        in testVerifyThatAllFunctionsGetTested
        in AllFunctionsMustHaveAtLeastOneTestTester
        in ./coverage_tests/audit_all_functions_get_tested_at_least_once.phpt
759) Do not see any tests for function/method UserMaker from file ../lib/UserMaker/UserMaker.php.class -- ALL functions must have a corresponding test. at [/svn/goodstorm/www/t/coverage_tests/audit_all_functions_get_tested_at_least_once.phpt line 132]
        in testVerifyThatAllFunctionsGetTested
        in AllFunctionsMustHaveAtLeastOneTestTester
        in ./coverage_tests/audit_all_functions_get_tested_at_least_once.phpt
760) Do not see any tests for function/method create\_user from file ../lib/UserMaker/UserMaker.php.class -- ALL functions must have a corresponding test. at [/svn/goodstorm/www/t/coverage_tests/audit_all_functions_get_tested_at_least_once.phpt line 132]
        in testVerifyThatAllFunctionsGetTested
        in AllFunctionsMustHaveAtLeastOneTestTester
        in ./coverage_tests/audit_all_functions_get_tested_at_least_once.phpt
761) Expected to see a test for class Artist/Artist.php.class -- instead saw a test for  -- Looks like there is a class without unit tests - TEST FAILED. at [/svn/goodstorm/www/t/coverage_tests/audit_class_unit_tests.phpt line 88]
        in testEachClassHasAtLeastOneTestFile
        in ClassHasTestsTester
        in ./coverage_tests/audit_class_unit_tests.phpt
762) Expected to see a test for class Form/Form.php.class -- instead saw a test for  -- Looks like there is a class without unit tests - TEST FAILED. at [/svn/goodstorm/www/t/coverage_tests/audit_class_unit_tests.phpt line 88]
        in testEachClassHasAtLeastOneTestFile
        in ClassHasTestsTester
        in ./coverage_tests/audit_class_unit_tests.phpt
763) Expected to see a test for class Container/ContainerProduct.php.class -- instead saw a test for  -- Looks like there is a class without unit tests - TEST FAILED. at [/svn/goodstorm/www/t/coverage_tests/audit_class_unit_tests.phpt line 88]
        in testEachClassHasAtLeastOneTestFile
        in ClassHasTestsTester
        in ./coverage_tests/audit_class_unit_tests.phpt
764) Expected to see a test for class Digital/DigitalProduct.php.class -- instead saw a test for  -- Looks like there is a class without unit tests - TEST FAILED. at [/svn/goodstorm/www/t/coverage_tests/audit_class_unit_tests.phpt line 88]
        in testEachClassHasAtLeastOneTestFile
        in ClassHasTestsTester
        in ./coverage_tests/audit_class_unit_tests.phpt
765) Expected to see a test for class Mp3/Mp3Product.php.class -- instead saw a test for  -- Looks like there is a class without unit tests - TEST FAILED. at [/svn/goodstorm/www/t/coverage_tests/audit_class_unit_tests.phpt line 88]
        in testEachClassHasAtLeastOneTestFile
        in ClassHasTestsTester
        in ./coverage_tests/audit_class_unit_tests.phpt
766) Expected to see a test for class Pdf/PdfProduct.php.class -- instead saw a test for  -- Looks like there is a class without unit tests - TEST FAILED. at [/svn/goodstorm/www/t/coverage_tests/audit_class_unit_tests.phpt line 88]
        in testEachClassHasAtLeastOneTestFile
        in ClassHasTestsTester
        in ./coverage_tests/audit_class_unit_tests.phpt
767) Expected to see a test for class Product/Product.php.class -- instead saw a test for  -- Looks like there is a class without unit tests - TEST FAILED. at [/svn/goodstorm/www/t/coverage_tests/audit_class_unit_tests.phpt line 88]
        in testEachClassHasAtLeastOneTestFile
        in ClassHasTestsTester
        in ./coverage_tests/audit_class_unit_tests.phpt
768) Expected to see a test for class Shippable/ShippableProduct.php.class -- instead saw a test for  -- Looks like there is a class without unit tests - TEST FAILED. at [/svn/goodstorm/www/t/coverage_tests/audit_class_unit_tests.phpt line 88]
        in testEachClassHasAtLeastOneTestFile
        in ClassHasTestsTester
        in ./coverage_tests/audit_class_unit_tests.phpt
769) Expected to see a test for class RevenueSplit/RevenueSplit.php.class -- instead saw a test for  -- Looks like there is a class without unit tests - TEST FAILED. at [/svn/goodstorm/www/t/coverage_tests/audit_class_unit_tests.phpt line 88]
        in testEachClassHasAtLeastOneTestFile
        in ClassHasTestsTester
        in ./coverage_tests/audit_class_unit_tests.phpt
770) Expected to see a test for class Shipping/Shipping.php.class -- instead saw a test for  -- Looks like there is a class without unit tests - TEST FAILED. at [/svn/goodstorm/www/t/coverage_tests/audit_class_unit_tests.phpt line 88]
        in testEachClassHasAtLeastOneTestFile
        in ClassHasTestsTester
        in ./coverage_tests/audit_class_unit_tests.phpt
771) Expected to see a test for class Taxation/Taxation.php.class -- instead saw a test for  -- Looks like there is a class without unit tests - TEST FAILED. at [/svn/goodstorm/www/t/coverage_tests/audit_class_unit_tests.phpt line 88]
        in testEachClassHasAtLeastOneTestFile
        in ClassHasTestsTester
        in ./coverage_tests/audit_class_unit_tests.phpt
772) Expected to see a test for class Track/Track.php.class -- instead saw a test for  -- Looks like there is a class without unit tests - TEST FAILED. at [/svn/goodstorm/www/t/coverage_tests/audit_class_unit_tests.phpt line 88]
        in testEachClassHasAtLeastOneTestFile
        in ClassHasTestsTester
        in ./coverage_tests/audit_class_unit_tests.phpt
773) Expected to see a test for class TrackAdmin/TrackAdmin.php.class -- instead saw a test for  -- Looks like there is a class without unit tests - TEST FAILED. at [/svn/goodstorm/www/t/coverage_tests/audit_class_unit_tests.phpt line 88]
        in testEachClassHasAtLeastOneTestFile
        in ClassHasTestsTester
        in ./coverage_tests/audit_class_unit_tests.phpt
774) Expected to see a test for class Admin/TransactionAdmin.php.class -- instead saw a test for  -- Looks like there is a class without unit tests - TEST FAILED. at [/svn/goodstorm/www/t/coverage_tests/audit_class_unit_tests.phpt line 88]
        in testEachClassHasAtLeastOneTestFile
        in ClassHasTestsTester
        in ./coverage_tests/audit_class_unit_tests.phpt
775) Expected to see a test for class PaymentRecord/TransactionPaymentRecord.php.class -- instead saw a test for  -- Looks like there is a class without unit tests - TEST FAILED. at [/svn/goodstorm/www/t/coverage_tests/audit_class_unit_tests.phpt line 88]
        in testEachClassHasAtLeastOneTestFile
        in ClassHasTestsTester
        in ./coverage_tests/audit_class_unit_tests.phpt
776) Expected to see a test for class Product/TransactionProduct.php.class -- instead saw a test for  -- Looks like there is a class without unit tests - TEST FAILED. at [/svn/goodstorm/www/t/coverage_tests/audit_class_unit_tests.phpt line 88]
        in testEachClassHasAtLeastOneTestFile
        in ClassHasTestsTester
        in ./coverage_tests/audit_class_unit_tests.phpt
777) Expected to see a test for class RevenueSplit/TransactionRevenueSplit.php.class -- instead saw a test for  -- Looks like there is a class without unit tests - TEST FAILED. at [/svn/goodstorm/www/t/coverage_tests/audit_class_unit_tests.phpt line 88]
        in testEachClassHasAtLeastOneTestFile
        in ClassHasTestsTester
        in ./coverage_tests/audit_class_unit_tests.phpt
778) Expected to see a test for class ShippingRecord/TransactionShippingRecord.php.class -- instead saw a test for  -- Looks like there is a class without unit tests - TEST FAILED. at [/svn/goodstorm/www/t/coverage_tests/audit_class_unit_tests.phpt line 88]
        in testEachClassHasAtLeastOneTestFile
        in ClassHasTestsTester
        in ./coverage_tests/audit_class_unit_tests.phpt
779) Expected to see a test for class TaxationRecord/TransactionTaxationRecord.php.class -- instead saw a test for  -- Looks like there is a class without unit tests - TEST FAILED. at [/svn/goodstorm/www/t/coverage_tests/audit_class_unit_tests.phpt line 88]
        in testEachClassHasAtLeastOneTestFile
        in ClassHasTestsTester
        in ./coverage_tests/audit_class_unit_tests.phpt
780) Expected to see a test for class Transaction/Transaction.php.class -- instead saw a test for  -- Looks like there is a class without unit tests - TEST FAILED. at [/svn/goodstorm/www/t/coverage_tests/audit_class_unit_tests.phpt line 88]
        in testEachClassHasAtLeastOneTestFile
        in ClassHasTestsTester
        in ./coverage_tests/audit_class_unit_tests.phpt
781) Expected to see a test for class VendorRecord/TransactionVendorRecord.php.class -- instead saw a test for  -- Looks like there is a class without unit tests - TEST FAILED. at [/svn/goodstorm/www/t/coverage_tests/audit_class_unit_tests.phpt line 88]
        in testEachClassHasAtLeastOneTestFile
        in ClassHasTestsTester
        in ./coverage_tests/audit_class_unit_tests.phpt
782) Expected to see a test for class User/User.php.class -- instead saw a test for  -- Looks like there is a class without unit tests - TEST FAILED. at [/svn/goodstorm/www/t/coverage_tests/audit_class_unit_tests.phpt line 88]
        in testEachClassHasAtLeastOneTestFile
        in ClassHasTestsTester
        in ./coverage_tests/audit_class_unit_tests.phpt
783) Expected to see a test for class UserAdmin/UserAdmin.php.class -- instead saw a test for  -- Looks like there is a class without unit tests - TEST FAILED. at [/svn/goodstorm/www/t/coverage_tests/audit_class_unit_tests.phpt line 88]
        in testEachClassHasAtLeastOneTestFile
        in ClassHasTestsTester
        in ./coverage_tests/audit_class_unit_tests.phpt
784) Expected to see a test for class UserMaker/UserMaker.php.class -- instead saw a test for  -- Looks like there is a class without unit tests - TEST FAILED. at [/svn/goodstorm/www/t/coverage_tests/audit_class_unit_tests.phpt line 88]
        in testEachClassHasAtLeastOneTestFile
        in ClassHasTestsTester
        in ./coverage_tests/audit_class_unit_tests.phpt
Array
(
    [0] => function TestDoxReporter($test_case_pattern 
    [1] => function paintCaseStart($test_name) 
    [2] => function paintCaseEnd() 
    [3] => function paintMethodStart($test_name) 
    [4] => function paintMethodEnd() 
    [5] => function paintFail() 
)
Array
(
)
785) Class TestDoxReporter File ../lib/simpletest/extensions/testdox.php: Does block count 0 match function count 6?  If not, something has an invalid or missing documentation comment at [/svn/goodstorm/www/t/coverage_tests/audit_documentation_coverage.phpt line 133]
        in testCoverage
        in DocumentationCoverageTester
        in ./coverage_tests/audit_documentation_coverage.phpt
Array
(
    [0] => function testBoolean() 
    [1] => function testName() 
    [2] => function testPass() 
    [3] => function testNulls() 
    [4] => function testType() 
    [5] => function testEquals() 
    [6] => function testSame() 
    [7] => function testRegExp() 
    [8] => function TestOfPhpUnitAdapter() 
    [9] => function testBoolean() 
    [10] => function testName() 
    [11] => function testEquals() 
    [12] => function testMultilineEquals() 
    [13] => function testRegExp() 
)
Array
(
)
786) Class SameTestClass File ../lib/simpletest/test/adapter_test.php: Does block count 0 match function count 14?  If not, something has an invalid or missing documentation comment at [/svn/goodstorm/www/t/coverage_tests/audit_documentation_coverage.phpt line 133]
        in testCoverage
        in DocumentationCoverageTester
        in ./coverage_tests/audit_documentation_coverage.phpt
Array
(
    [0] => function testWithinSameUrl() 
    [1] => function testInsideWithLongerUrl() 
    [2] => function testBelowRootIsOutside() 
    [3] => function testOldNetscapeDefinitionIsOutside() 
    [4] => function testInsideWithMissingTrailingSlash() 
    [5] => function testDifferentPageNameStillInside() 
    [6] => function testNewUrlInSameDirectoryDoesNotChangeRealm() 
    [7] => function testNewUrlMakesRealmTheCommonPath() 
    [8] => function testNoRealms() 
    [9] => function &createSingleRealm() 
    [10] => function testOutsideRealm() 
    [11] => function testWithinRealm() 
    [12] => function testRestartingClearsRealm() 
    [13] => function testDifferentHostIsOutsideRealm() 
)
Array
(
)
787) Class TestOfRealm File ../lib/simpletest/test/authentication_test.php: Does block count 0 match function count 14?  If not, something has an invalid or missing documentation comment at [/svn/goodstorm/www/t/coverage_tests/audit_documentation_coverage.phpt line 133]
        in testCoverage
        in DocumentationCoverageTester
        in ./coverage_tests/audit_documentation_coverage.phpt
Array
(
    [0] => function BadTestCases() 
)
Array
(
)
788) Class BadTestCases File ../lib/simpletest/test/bad_test_suite.php: Does block count 0 match function count 1?  If not, something has an invalid or missing documentation comment at [/svn/goodstorm/www/t/coverage_tests/audit_documentation_coverage.phpt line 133]
        in testCoverage
        in DocumentationCoverageTester
        in ./coverage_tests/audit_documentation_coverage.phpt
Array
(
    [0] => function testEmptyHistoryHasFalseContents() 
    [1] => function testCannotMoveInEmptyHistory() 
    [2] => function testCurrentTargetAccessors() 
    [3] => function testSecondEntryAccessors() 
    [4] => function testGoingBackwards() 
    [5] => function testGoingBackwardsOffBeginning() 
    [6] => function testGoingForwardsOffEnd() 
    [7] => function testGoingBackwardsAndForwards() 
    [8] => function testNewEntryReplacesNextOne() 
    [9] => function testNewEntryDropsFutureEntries() 
    [10] => function &loadPage(&$page) 
    [11] => function testAccessorsWhenNoPage() 
    [12] => function testParse() 
    [13] => function testLinkAffirmationWhenPresent() 
    [14] => function testLinkAffirmationByIdWhenPresent() 
    [15] => function testSettingFieldIsPassedToPage() 
    [16] => function &createBrowser(&$agent, 
    [17] => function testClickLinkRequestsPage() 
    [18] => function testClickLinkWithUnknownFrameStillRequestsWholePage() 
    [19] => function testClickingMissingLinkFails() 
    [20] => function testClickIndexedLink() 
    [21] => function testClinkLinkById() 
    [22] => function testClickingMissingLinkIdFails() 
    [23] => function testSubmitFormByLabel() 
    [24] => function testDefaultSubmitFormByLabel() 
    [25] => function testSubmitFormByName() 
    [26] => function testSubmitFormById() 
    [27] => function testSubmitFormByImageLabel() 
    [28] => function testSubmitFormByImageName() 
    [29] => function testSubmitFormByImageId() 
    [30] => function testSubmitFormByFormId() 
    [31] => function &createBrowser(&$agent) 
    [32] => function &createUserAgent($pages) 
    [33] => function testSimplePageHasNoFrames() 
    [34] => function testFramesetWithNoFrames() 
    [35] => function testFramesetWithSingleFrame() 
    [36] => function testTitleTakenFromFramesetPage() 
    [37] => function testFramesetWithSingleUnnamedFrame() 
    [38] => function testFramesetWithMultipleFrames() 
    [39] => function testFrameFocusByName() 
    [40] => function testFramesetWithSomeNamedFrames() 
    [41] => function testFrameFocusWithMixedNamesAndIndexes() 
    [42] => function testNestedFrameset() 
    [43] => function testCanNavigateToNestedFrame() 
    [44] => function testCanNavigateToNestedFrameByIndex() 
)
Array
(
)
789) Class TestOfHistory File ../lib/simpletest/test/browser_test.php: Does block count 0 match function count 45?  If not, something has an invalid or missing documentation comment at [/svn/goodstorm/www/t/coverage_tests/audit_documentation_coverage.phpt line 133]
        in testCoverage
        in DocumentationCoverageTester
        in ./coverage_tests/audit_documentation_coverage.phpt
Array
(
    [0] => function testDefaultsToEmptyStringToMeanNullToTheSelectiveReporter() 
    [1] => function testNotXmlByDefault() 
    [2] => function testCanDetectRequestForXml() 
    [3] => function testCanReadAssignmentSyntax() 
    [4] => function testCanReadFollowOnSyntax() 
    [5] => function testCanReadShortForms() 
)
Array
(
)
790) Class TestOfCommandLineParsing File ../lib/simpletest/test/command_line_test.php: Does block count 0 match function count 6?  If not, something has an invalid or missing documentation comment at [/svn/goodstorm/www/t/coverage_tests/audit_documentation_coverage.phpt line 133]
        in testCoverage
        in DocumentationCoverageTester
        in ./coverage_tests/audit_documentation_coverage.phpt
Array
(
    [0] => function testCookieDefaults() 
    [1] => function testCookieAccessors() 
    [2] => function testFullHostname() 
    [3] => function testHostTruncation() 
    [4] => function testBadHosts() 
    [5] => function testHostValidity() 
    [6] => function testPathValidity() 
    [7] => function testSessionExpiring() 
    [8] => function testTimestampExpiry() 
    [9] => function testDateExpiry() 
    [10] => function testAging() 
    [11] => function testAddCookie() 
    [12] => function testHostFilter() 
    [13] => function testPathFilter() 
    [14] => function testPathFilterDeeply() 
    [15] => function testMultipleCookieWithDifferentPathsButSameName() 
    [16] => function testOverwrite() 
    [17] => function testClearSessionCookies() 
    [18] => function testExpiryFilterByDate() 
    [19] => function testExpiryFilterByAgeing() 
    [20] => function testCookieClearing() 
    [21] => function testCookieClearByLoweringDate() 
)
Array
(
)
791) Class TestOfCookie File ../lib/simpletest/test/cookies_test.php: Does block count 0 match function count 22?  If not, something has an invalid or missing documentation comment at [/svn/goodstorm/www/t/coverage_tests/audit_documentation_coverage.phpt line 133]
        in testCoverage
        in DocumentationCoverageTester
        in ./coverage_tests/audit_documentation_coverage.phpt
WARNING:  FILE ../lib/simpletest/test/detached_test.php DOESN'T SEEM TO CONTAIN ANY FUNCTIONS..
Array
(
    [0] => function testClipping() 
    [1] => function testDescribeNull() 
    [2] => function testDescribeBoolean() 
    [3] => function testDescribeString() 
    [4] => function testDescribeInteger() 
    [5] => function testDescribeFloat() 
    [6] => function testDescribeArray() 
    [7] => function testDescribeObject() 
)
Array
(
)
792) Class DumperDummy File ../lib/simpletest/test/dumper_test.php: Does block count 0 match function count 8?  If not, something has an invalid or missing documentation comment at [/svn/goodstorm/www/t/coverage_tests/audit_documentation_coverage.phpt line 133]
        in testCoverage
        in DocumentationCoverageTester
        in ./coverage_tests/audit_documentation_coverage.phpt
Array
(
    [0] => function testFormEncodedAsKeyEqualsValue() 
    [1] => function testMimeEncodedAsHeadersAndContent() 
    [2] => function testAttachmentEncodedAsHeadersWithDispositionAndContent() 
    [3] => function write($content) 
    [4] => function clear() 
    [5] => function assertWritten($encoding, 
    [6] => function testGetEmpty() 
    [7] => function testPostEmpty() 
    [8] => function testPrefilled() 
    [9] => function testPrefilledWithObject() 
    [10] => function testMultiplePrefilled() 
    [11] => function testSingleParameter() 
    [12] => function testFalseParameter() 
    [13] => function testUrlEncoding() 
    [14] => function testUrlEncodingOfKey() 
    [15] => function testMultipleParameter() 
    [16] => function testEmptyParameters() 
    [17] => function testRepeatedParameter() 
    [18] => function testAddingLists() 
    [19] => function testMergeInHash() 
    [20] => function testMergeInObject() 
    [21] => function testPrefilledMultipart() 
    [22] => function testAttachment() 
    [23] => function testEmptyEncodingWritesZeroContentLength() 
    [24] => function testEmptyMultipartEncodingWritesEndBoundaryContentLength() 
)
Array
(
)
793) Class TestOfEncodedParts File ../lib/simpletest/test/encoding_test.php: Does block count 0 match function count 25?  If not, something has an invalid or missing documentation comment at [/svn/goodstorm/www/t/coverage_tests/audit_documentation_coverage.phpt line 133]
        in testCoverage
        in DocumentationCoverageTester
        in ./coverage_tests/audit_documentation_coverage.phpt
Array
(
    [0] => function testBoolean() 
    [1] => function testStringMatch() 
    [2] => function testInteger() 
    [3] => function testFloat() 
    [4] => function testArray() 
    [5] => function testHash() 
    [6] => function testHashWithOutOfOrderKeysShouldStillMatch() 
    [7] => function testWithinFloatingPointMargin() 
    [8] => function testOutsideFloatingPointMargin() 
    [9] => function testStringMismatch() 
    [10] => function RecursiveNasty() 
    [11] => function testType() 
    [12] => function _testNastyPhp5Bug() 
    [13] => function _testReallyHorribleRecursiveStructure() 
    [14] => function testReference() 
    [15] => function testObjectsReferencesDualityForPhp5AndPhp4() 
    [16] => function testReallyHorribleRecursiveStructure() 
    [17] => function testType() 
    [18] => function testWanted() 
    [19] => function testUnwanted() 
    [20] => function hasThisMethod() 
    [21] => function testHasMethod() 
    [22] => function testString() 
    [23] => function testBoolean() 
    [24] => function testBool() 
    [25] => function testDouble() 
    [26] => function testFloat() 
    [27] => function testReal() 
    [28] => function testInteger() 
    [29] => function testInt() 
    [30] => function testString() 
)
Array
(
)
794) Class TestOfEquality File ../lib/simpletest/test/expectation_test.php: Does block count 0 match function count 31?  If not, something has an invalid or missing documentation comment at [/svn/goodstorm/www/t/coverage_tests/audit_documentation_coverage.phpt line 133]
        in testCoverage
        in DocumentationCoverageTester
        in ./coverage_tests/audit_documentation_coverage.phpt
Array
(
    [0] => function &page($url, 
    [1] => function testFormAttributes() 
    [2] => function testAction() 
    [3] => function testEmptyAction() 
    [4] => function testMissingAction() 
    [5] => function testRootAction() 
    [6] => function testDefaultFrameTargetOnForm() 
    [7] => function testTextWidget() 
    [8] => function testTextWidgetById() 
    [9] => function testTextWidgetByLabel() 
    [10] => function testSubmitEmpty() 
    [11] => function testSubmitButton() 
    [12] => function testSubmitWithAdditionalParameters() 
    [13] => function testSubmitButtonWithLabelOfSubmit() 
    [14] => function testSubmitButtonWithWhitespacePaddedLabelOfSubmit() 
    [15] => function testImageSubmitButton() 
    [16] => function testImageSubmitButtonWithAdditionalData() 
    [17] => function testButtonTag() 
    [18] => function testSingleSelectFieldSubmitted() 
    [19] => function testSingleSelectFieldSubmittedWithPost() 
    [20] => function testUnchecked() 
    [21] => function testChecked() 
    [22] => function testSingleUncheckedRadioButton() 
    [23] => function testSingleCheckedRadioButton() 
    [24] => function testUncheckedRadioButtons() 
    [25] => function testCheckedRadioButtons() 
    [26] => function testMultipleFieldsWithSameKey() 
)
Array
(
)
795) Class TestOfForm File ../lib/simpletest/test/form_test.php: Does block count 0 match function count 27?  If not, something has an invalid or missing documentation comment at [/svn/goodstorm/www/t/coverage_tests/audit_documentation_coverage.phpt line 133]
        in testCoverage
        in DocumentationCoverageTester
        in ./coverage_tests/audit_documentation_coverage.phpt
Array
(
    [0] => function testTitleReadFromFramesetPage() 
    [1] => function TestHeadersReadFromFramesetByDefault() 
    [2] => function testEmptyFramesetHasNoContent() 
    [3] => function testRawContentIsFromOnlyFrame() 
    [4] => function testRawContentIsFromAllFrames() 
    [5] => function testTextContentIsFromOnlyFrame() 
    [6] => function testTextContentIsFromAllFrames() 
    [7] => function testFieldFoundIsFirstInFramelist() 
    [8] => function testFrameReplacementByIndex() 
    [9] => function testFrameReplacementByName() 
    [10] => function testStartsWithoutFrameFocus() 
    [11] => function testCanFocusOnSingleFrame() 
    [12] => function testContentComesFromFrameInFocus() 
    [13] => function testCanFocusByName() 
    [14] => function TestOfFramesetPageInterface() 
    [15] => function assertListInAnyOrder($list, 
    [16] => function _getPageMethods() 
    [17] => function _getFramesetMethods() 
    [18] => function testFramsetHasPageInterface() 
    [19] => function testHeadersReadFromFrameIfInFocus() 
    [20] => function testUrlsComeFromBothFrames() 
    [21] => function testLabelledUrlsComeFromBothFrames() 
    [22] => function testUrlByIdComesFromFirstFrameToRespond() 
    [23] => function testReadUrlsFromFrameInFocus() 
    [24] => function testReadFrameTaggedUrlsFromFrameInFocus() 
    [25] => function testFindingFormsById() 
    [26] => function testFindingFormsBySubmit() 
    [27] => function testFindingFormsByImage() 
    [28] => function testSettingAllFrameFieldsWhenNoFrameFocus() 
    [29] => function testOnlySettingFieldFromFocusedFrame() 
    [30] => function testOnlyGettingFieldFromFocusedFrame() 
)
Array
(
)
796) Class TestOfFrameset File ../lib/simpletest/test/frames_test.php: Does block count 0 match function count 31?  If not, something has an invalid or missing documentation comment at [/svn/goodstorm/www/t/coverage_tests/audit_documentation_coverage.phpt line 133]
        in testCoverage
        in DocumentationCoverageTester
        in ./coverage_tests/audit_documentation_coverage.phpt
Array
(
    [0] => function testDefaultGetRequest() 
    [1] => function testDefaultPostRequest() 
    [2] => function testGetWithPort() 
    [3] => function testGetWithParameters() 
    [4] => function testDefaultGet() 
    [5] => function testDefaultPost() 
    [6] => function testGetWithPort() 
    [7] => function testGetWithParameters() 
    [8] => function testGetWithAuthentication() 
    [9] => function testReadingBadConnection() 
    [10] => function testReadingGoodConnection() 
    [11] => function testWritingAdditionalHeaders() 
    [12] => function testCookieWriting() 
    [13] => function testMultipleCookieWriting() 
    [14] => function testReadingBadConnectionCausesErrorBecauseOfDeadSocket() 
    [15] => function testReadingGoodConnection() 
    [16] => function testContentHeadersCalculated() 
    [17] => function testParseBasicHeaders() 
    [18] => function testNonStandardResponseHeader() 
    [19] => function testCanParseMultipleCookies() 
    [20] => function testCanRecogniseRedirect() 
    [21] => function testCanParseChallenge() 
    [22] => function testBadRequest() 
    [23] => function testBadSocketDuringResponse() 
    [24] => function testIncompleteHeader() 
    [25] => function testParseOfResponseHeadersWhenChunked() 
    [26] => function testRedirect() 
    [27] => function testRedirectWithPort() 
)
Array
(
)
797) Class TestOfDirectRoute File ../lib/simpletest/test/http_test.php: Does block count 0 match function count 28?  If not, something has an invalid or missing documentation comment at [/svn/goodstorm/www/t/coverage_tests/audit_documentation_coverage.phpt line 133]
        in testCoverage
        in DocumentationCoverageTester
        in ./coverage_tests/audit_documentation_coverage.phpt
Array
(
    [0] => function testCanMockAnInterface() 
    [1] => function testMockedInterfaceExpectsParameters() 
    [2] => function testCannotPartiallyMockAnInterface() 
    [3] => function skip() 
    [4] => function testCanMockAllSplClasses() 
    [5] => function testExtensionOfCommonSplClasses() 
    [6] => function hinted(DummyInterface 
    [7] => function aMethod() 
    [8] => function anotherMethod($a) 
    [9] => function &referenceMethod(&$a) 
    [10] => function extraMethod($a 
    [11] => function testMockedInterfaceCanPassThroughTypeHint() 
    [12] => function testImplementedInterfacesAreCarried() 
    [13] => function testNoSpuriousWarningsWhenSkippingDefaultedParameter() 
    [14] => function testBasicConstructOfAnInterface() 
    [15] => function method(array 
    [16] => function testBasicConstructOfAnInterfaceWithHintInSignature() 
    [17] => function testCanMockWithoutErrors() 
)
Array
(
)
798) Class TestOfMockInterfaces File ../lib/simpletest/test/interfaces_test.php: Does block count 0 match function count 18?  If not, something has an invalid or missing documentation comment at [/svn/goodstorm/www/t/coverage_tests/audit_documentation_coverage.phpt line 133]
        in testCoverage
        in DocumentationCoverageTester
        in ./coverage_tests/audit_documentation_coverage.phpt
Array
(
    [0] => function testLink() 
    [1] => function testLinkWithId() 
    [2] => function testLinkExtraction() 
    [3] => function testMultipleLinks() 
    [4] => function testTitle() 
    [5] => function testForm() 
    [6] => function testParseMechanics() 
    [7] => function testInterfaceOnEmptyPage() 
    [8] => function testUrlAccessor() 
    [9] => function testTransportError() 
    [10] => function testHeadersAccessor() 
    [11] => function testMimeAccessor() 
    [12] => function testResponseAccessor() 
    [13] => function testAuthenticationAccessors() 
    [14] => function testRawAccessor() 
    [15] => function testTextAccessor() 
    [16] => function testNoLinks() 
    [17] => function testAddAbsoluteLink() 
    [18] => function testAddStrictRelativeLink() 
    [19] => function testAddBareRelativeLink() 
    [20] => function testAddRelativeLinkWithBaseTag() 
    [21] => function testAddAbsoluteLinkWithBaseTag() 
    [22] => function testLinkIds() 
    [23] => function testFindLinkWithNormalisation() 
    [24] => function testFindLinkWithImage() 
    [25] => function testTitleSetting() 
    [26] => function testFramesetAbsence() 
    [27] => function testHasEmptyFrameset() 
    [28] => function testFramesInPage() 
    [29] => function testNamedFramesInPage() 
    [30] => function testRelativeFramesRespectBaseTag() 
    [31] => function testFormCanBeSubmitted() 
    [32] => function testInputFieldCanBeReadBack() 
    [33] => function testInputFieldCanBeReadBackByLabel() 
    [34] => function &parse($response) 
    [35] => function testEmptyPage() 
    [36] => function testUninterestingPage() 
    [37] => function testLinksPage() 
    [38] => function testTitle() 
    [39] => function testNastyTitle() 
    [40] => function testCompleteForm() 
    [41] => function testUnclosedForm() 
    [42] => function testEmptyFrameset() 
    [43] => function testSingleFrame() 
    [44] => function testSingleFrameInNestedFrameset() 
    [45] => function testFrameWithNoSource() 
    [46] => function testFramesCollectedWithNestedFramesetTags() 
    [47] => function testNamedFrames() 
    [48] => function testFindFormByLabel() 
    [49] => function testConfirmSubmitAttributesAreCaseSensitive() 
    [50] => function testFindFormByImage() 
    [51] => function testFindFormByButtonTag() 
    [52] => function testFindFormById() 
    [53] => function testReadingTextField() 
    [54] => function testReadingTextFieldIsCaseInsensitive() 
    [55] => function testSettingTextField() 
    [56] => function testSettingTextFieldByEnclosingLabel() 
    [57] => function testGettingTextFieldByEnclosingLabelWithConflictingOtherFields() 
    [58] => function testSettingTextFieldByExternalLabel() 
    [59] => function testReadingTextArea() 
    [60] => function testSettingTextArea() 
    [61] => function testSettingSelectionField() 
    [62] => function testSettingSelectionFieldByEnclosingLabel() 
    [63] => function testSettingRadioButtonByEnclosingLabel() 
)
Array
(
)
799) Class TestOfPageBuilder File ../lib/simpletest/test/page_test.php: Does block count 0 match function count 64?  If not, something has an invalid or missing documentation comment at [/svn/goodstorm/www/t/coverage_tests/audit_documentation_coverage.phpt line 133]
        in testCoverage
        in DocumentationCoverageTester
        in ./coverage_tests/audit_documentation_coverage.phpt
WARNING:  FILE ../lib/simpletest/test/parse_error_test.php DOESN'T SEEM TO CONTAIN ANY FUNCTIONS..
Array
(
    [0] => function testNoPatterns() 
    [1] => function testNoSubject() 
    [2] => function testMatchAll() 
    [3] => function testCaseSensitive() 
    [4] => function testCaseInsensitive() 
    [5] => function testMatchMultiple() 
    [6] => function testPatternLabels() 
    [7] => function testStartState() 
    [8] => function testExhaustion() 
    [9] => function testStateMoves() 
    [10] => function accept() 
    [11] => function a() 
    [12] => function b() 
    [13] => function testEmptyPage() 
    [14] => function testSinglePattern() 
    [15] => function testMultiplePattern() 
    [16] => function testIsolatedPattern() 
    [17] => function testModeChange() 
    [18] => function testNesting() 
    [19] => function testSingular() 
    [20] => function testUnwindTooFar() 
    [21] => function testModeMapping() 
    [22] => function &createParser() 
    [23] => function testNoContent() 
    [24] => function testUninteresting() 
    [25] => function testSkipCss() 
    [26] => function testSkipJavaScript() 
    [27] => function testSkipHtmlComments() 
    [28] => function testTagWithNoAttributes() 
    [29] => function testTagWithAttributes() 
    [30] => function &createListener() 
    [31] => function testFramesetTag() 
    [32] => function testTagWithUnquotedAttributes() 
    [33] => function testTagInsideContent() 
    [34] => function testTagWithInternalContent() 
    [35] => function testLinkAddress() 
    [36] => function testEncodedAttribute() 
    [37] => function testTagWithId() 
    [38] => function testTagWithEmptyAttributes() 
    [39] => function testComplexTagWithLotsOfCaseVariations() 
    [40] => function testXhtmlSelfClosingTag() 
    [41] => function testNestedFrameInFrameset() 
    [42] => function testSpaceNormalisation() 
    [43] => function testTagSuppression() 
    [44] => function testAdjoiningTagSuppression() 
    [45] => function testExtractImageAltTextWithDifferentQuotes() 
    [46] => function testExtractImageAltTextMultipleTimes() 
    [47] => function testHtmlEntityTranslation() 
)
Array
(
)
800) Class TestOfParallelRegex File ../lib/simpletest/test/parser_test.php: Does block count 0 match function count 48?  If not, something has an invalid or missing documentation comment at [/svn/goodstorm/www/t/coverage_tests/audit_documentation_coverage.phpt line 133]
        in testCoverage
        in DocumentationCoverageTester
        in ./coverage_tests/audit_documentation_coverage.phpt
Array
(
    [0] => function aMethod() 
    [1] => function testClassExistence() 
    [2] => function testClassNonExistence() 
    [3] => function testDetectionOfInterfacesAlwaysFalse() 
    [4] => function testFindingParentClass() 
    [5] => function testMethodsListFromClass() 
    [6] => function testNoInterfacesForPHP4() 
    [7] => function testMostGeneralPossibleSignature() 
    [8] => function assertEqualIgnoringCase($a, 
)
Array
(
)
801) Class AnyOldThing File ../lib/simpletest/test/reflection_php4_test.php: Does block count 0 match function count 9?  If not, something has an invalid or missing documentation comment at [/svn/goodstorm/www/t/coverage_tests/audit_documentation_coverage.phpt line 133]
        in testCoverage
        in DocumentationCoverageTester
        in ./coverage_tests/audit_documentation_coverage.phpt
Array
(
    [0] => function aMethod() 
    [1] => function aMethod() 
    [2] => function aMethod() 
    [3] => function aMethod(AnyOldInterface 
    [4] => function aMethod() 
    [5] => function extraMethod() 
    [6] => function aMethod(AnyOldInterface 
    [7] => function aMethod($argument) 
    [8] => function aMethod(AnyOldInterface 
    [9] => function aMethod(AnyOldInterface 
    [10] => function aMethod() 
    [11] => function __isset($key) 
    [12] => function __unset($key) 
    [13] => function aStatic() 
    [14] => function aStaticWithParameters($arg1, 
    [15] => function anAbstractWithMultipleParameters($foo, 
    [16] => function testClassExistence() 
    [17] => function testClassNonExistence() 
    [18] => function testDetectionOfAbstractClass() 
    [19] => function testDetectionOfFinalMethods() 
    [20] => function testFindingParentClass() 
    [21] => function testInterfaceExistence() 
    [22] => function testMethodsListFromClass() 
    [23] => function testMethodsListFromInterface() 
    [24] => function testMethodsComeFromDescendentInterfacesASWell() 
    [25] => function testCanSeparateInterfaceMethodsFromOthers() 
    [26] => function testMethodsComeFromDescendentInterfacesInAbstractClass() 
    [27] => function testInterfaceHasOnlyItselfToImplement() 
    [28] => function testInterfacesListedForClass() 
    [29] => function testInterfacesListedForSubclass() 
    [30] => function testNoParameterCreationWhenNoInterface() 
    [31] => function = 
    [32] => function amethod()', 
    [33] => function aMethod()', 
    [34] => function testParameterCreationWithoutTypeHinting() 
    [35] => function = 
    [36] => function amethod(AnyOldInterface 
    [37] => function aMethod(AnyOldInterface 
    [38] => function testParameterCreationForTypeHinting() 
    [39] => function = 
    [40] => function amethod(AnyOldInterface 
    [41] => function aMethod(AnyOldInterface 
    [42] => function testIssetFunctionSignature() 
    [43] => function = 
    [44] => function __isset($key)', 
    [45] => function __isset()', 
    [46] => function testUnsetFunctionSignature() 
    [47] => function = 
    [48] => function __unset($key)', 
    [49] => function __unset()', 
    [50] => function testProperlyReflectsTheFinalInterfaceWhenObjectImplementsAnExtendedInterface() 
    [51] => function testCreatingSignatureForAbstractMethod() 
    [52] => function aMethod(AnyOldInterface 
    [53] => function testCanProperlyGenerateStaticMethodSignatures() 
    [54] => function aStatic()', 
    [55] => function aStaticWithParameters($arg1, 
    [56] => function skip() 
    [57] => function testParameterCreationForTypeHintingWithArray() 
    [58] => function amethod(array 
    [59] => function amethod(array 
    [60] => function = 
    [61] => function amethod(array 
    [62] => function testCanProperlyGenerateAbstractMethods() 
    [63] => function anAbstractWithMultipleParameters($foo, 
)
Array
(
)
802) Class AnyOldLeafClass File ../lib/simpletest/test/reflection_php5_test.php: Does block count 0 match function count 64?  If not, something has an invalid or missing documentation comment at [/svn/goodstorm/www/t/coverage_tests/audit_documentation_coverage.phpt line 133]
        in testCoverage
        in DocumentationCoverageTester
        in ./coverage_tests/audit_documentation_coverage.phpt
WARNING:  FILE ../lib/simpletest/test/remote_test.php DOESN'T SEEM TO CONTAIN ANY FUNCTIONS..
Array
(
    [0] => function testEcho() 
    [1] => function testBadCommand() 
    [2] => function testEcho() 
    [3] => function testFileExistence() 
    [4] => function testFilePatterns() 
)
Array
(
)
803) Class TestOfShell File ../lib/simpletest/test/shell_test.php: Does block count 0 match function count 5?  If not, something has an invalid or missing documentation comment at [/svn/goodstorm/www/t/coverage_tests/audit_documentation_coverage.phpt line 133]
        in testCoverage
        in DocumentationCoverageTester
        in ./coverage_tests/audit_documentation_coverage.phpt
Array
(
    [0] => function &_getShell() 
    [1] => function testGenericEquality() 
    [2] => function testExitCode() 
    [3] => function testOutput() 
    [4] => function testOutputPatterns() 
)
Array
(
)
804) Class TestOfShellTestCase File ../lib/simpletest/test/shell_tester_test.php: Does block count 0 match function count 5?  If not, something has an invalid or missing documentation comment at [/svn/goodstorm/www/t/coverage_tests/audit_documentation_coverage.phpt line 133]
        in testCoverage
        in DocumentationCoverageTester
        in ./coverage_tests/audit_documentation_coverage.phpt
Array
(
    [0] => function testSettingError() 
    [1] => function testClearingError() 
)
Array
(
)
805) Class TestOfSimpleStickyError File ../lib/simpletest/test/socket_test.php: Does block count 0 match function count 2?  If not, something has an invalid or missing documentation comment at [/svn/goodstorm/www/t/coverage_tests/audit_documentation_coverage.phpt line 133]
        in testCoverage
        in DocumentationCoverageTester
        in ./coverage_tests/audit_documentation_coverage.phpt
WARNING:  FILE ../lib/simpletest/test/support/empty_test_file.php DOESN'T SEEM TO CONTAIN ANY FUNCTIONS..
Array
(
    [0] => function current() 
    [1] => function next() 
    [2] => function key() 
    [3] => function valid() 
    [4] => function rewind() 
    [5] => function getIterator() 
)
Array
(
)
806) Class IteratorImplementation File ../lib/simpletest/test/support/spl_examples.php: Does block count 0 match function count 6?  If not, something has an invalid or missing documentation comment at [/svn/goodstorm/www/t/coverage_tests/audit_documentation_coverage.phpt line 133]
        in testCoverage
        in DocumentationCoverageTester
        in ./coverage_tests/audit_documentation_coverage.phpt
Array
(
    [0] => function testStartValuesWithoutAdditionalContent() 
    [1] => function testTitleContent() 
    [2] => function testMessyTitleContent() 
    [3] => function testTagWithNoEnd() 
    [4] => function testAnchorHref() 
    [5] => function testIsIdMatchesIdAttribute() 
    [6] => function testTextEmptyDefault() 
    [7] => function testSettingOfExternalLabel() 
    [8] => function testTextDefault() 
    [9] => function testSettingTextValue() 
    [10] => function testFailToSetHiddenValue() 
    [11] => function testSubmitDefaults() 
    [12] => function testPopulatedSubmit() 
    [13] => function testImageSubmit() 
    [14] => function testImageSubmitTitlePreferredOverAltForLabel() 
    [15] => function testButton() 
    [16] => function testDefault() 
    [17] => function testWrapping() 
    [18] => function testWrappingRemovesLeadingcariageReturn() 
    [19] => function testBreaksAreNewlineAndCarriageReturn() 
    [20] => function testCanSetCheckboxToNamedValueWithBooleanTrue() 
    [21] => function testEmpty() 
    [22] => function testSingle() 
    [23] => function testSingleDefault() 
    [24] => function testSingleMappedDefault() 
    [25] => function testStartsWithDefault() 
    [26] => function testSettingOption() 
    [27] => function testSettingMappedOption() 
    [28] => function testSelectionDespiteSpuriousWhitespace() 
    [29] => function testFailToSetIllegalOption() 
    [30] => function testNastyOptionValuesThatLookLikeFalse() 
    [31] => function testBlankOption() 
    [32] => function testMultipleDefaultWithNoSelections() 
    [33] => function testMultipleDefaultWithSelections() 
    [34] => function testSettingMultiple() 
    [35] => function testFailToSetIllegalOptionsInMultiple() 
    [36] => function testEmptyGroup() 
    [37] => function testReadingSingleButtonGroup() 
    [38] => function testReadingMultipleButtonGroup() 
    [39] => function testFailToSetUnlistedValue() 
    [40] => function testSettingNewValueClearsTheOldOne() 
    [41] => function testIsIdMatchesAnyWidgetInSet() 
    [42] => function testIsLabelMatchesAnyWidgetInSet() 
    [43] => function testReadingMultipleCheckboxGroup() 
    [44] => function testReadingMultipleUncheckedItems() 
    [45] => function testReadingMultipleCheckedItems() 
    [46] => function testSettingSingleValue() 
    [47] => function testSettingMultipleValues() 
    [48] => function testSettingNoValue() 
    [49] => function testIsIdMatchesAnyIdInSet() 
    [50] => function testValueIsFilePath() 
    [51] => function testSubmitsFileContents() 
    [52] => function testLabelShouldHaveAnEndTag() 
    [53] => function testContentIsTextOnly() 
)
Array
(
)
807) Class TestOfTag File ../lib/simpletest/test/tag_test.php: Does block count 0 match function count 54?  If not, something has an invalid or missing documentation comment at [/svn/goodstorm/www/t/coverage_tests/audit_documentation_coverage.phpt line 133]
        in testCoverage
        in DocumentationCoverageTester
        in ./coverage_tests/audit_documentation_coverage.phpt
WARNING:  FILE ../lib/simpletest/test/test_with_parse_error.php DOESN'T SEEM TO CONTAIN ANY FUNCTIONS..
Array
(
    [0] => function testAssertTrueReturnsAssertionAsBoolean() 
    [1] => function testAssertFalseReturnsAssertionAsBoolean() 
    [2] => function testAssertEqualReturnsAssertionAsBoolean() 
    [3] => function testAssertIdenticalReturnsAssertionAsBoolean() 
    [4] => function testCoreAssertionsDoNotThrowErrors() 
    [5] => function testReferenceAssertionOnObjects() 
    [6] => function testReferenceAssertionOnScalars() 
    [7] => function testCloneOnObjects() 
    [8] => function testCloneOnScalars() 
)
Array
(
)
808) Class ReferenceForTesting File ../lib/simpletest/test/unit_tester_test.php: Does block count 0 match function count 9?  If not, something has an invalid or missing documentation comment at [/svn/goodstorm/www/t/coverage_tests/audit_documentation_coverage.phpt line 133]
        in testCoverage
        in DocumentationCoverageTester
        in ./coverage_tests/audit_documentation_coverage.phpt
Array
(
    [0] => function testDefaultUrl() 
    [1] => function testBasicParsing() 
    [2] => function testRelativeUrls() 
    [3] => function testParseBareParameter() 
    [4] => function testParseEmptyParameter() 
    [5] => function testParseParameterPair() 
    [6] => function testParseMultipleParameters() 
    [7] => function testParsingParameterMixture() 
    [8] => function testAddParametersFromScratch() 
    [9] => function testClearingParameters() 
    [10] => function testEncodingParameters() 
    [11] => function testDecodingParameters() 
    [12] => function testUrlInQueryDoesNotConfuseParsing() 
    [13] => function testSettingCordinates() 
    [14] => function testParseCordinates() 
    [15] => function testClearingCordinates() 
    [16] => function testParsingParameterCordinateMixture() 
    [17] => function testParsingParameterWithBadCordinates() 
    [18] => function testPageSplitting() 
    [19] => function testAbsolutePathPageSplitting() 
    [20] => function testSplittingUrlWithNoPageGivesEmptyPage() 
    [21] => function testPathNormalisation() 
    [22] => function testPathNormalisationWithSinglePeriod() 
    [23] => function testUsernameAndPasswordAreUrlDecoded() 
    [24] => function testBlitz() 
    [25] => function testAmbiguousHosts() 
    [26] => function testAsString() 
    [27] => function assertUrl($raw, 
    [28] => function testUrlWithTwoSlashesInPath() 
    [29] => function assertPreserved($string) 
    [30] => function testMakingAbsolute() 
    [31] => function testMakingAnEmptyUrlAbsolute() 
    [32] => function testMakingAnEmptyUrlAbsoluteWithMissingPageName() 
    [33] => function testMakingAShortQueryUrlAbsolute() 
    [34] => function testMakingADirectoryUrlAbsolute() 
    [35] => function testMakingARootUrlAbsolute() 
    [36] => function testMakingARootPageUrlAbsolute() 
    [37] => function testCarryAuthenticationFromRootPage() 
    [38] => function testMakingCoordinateUrlAbsolute() 
    [39] => function testMakingAbsoluteAppendedPath() 
    [40] => function testMakingAbsoluteBadlyFormedAppendedPath() 
    [41] => function testMakingAbsoluteHasNoEffectWhenAlreadyAbsolute() 
    [42] => function testMakingAbsoluteCarriesAuthenticationWhenAlreadyAbsolute() 
    [43] => function testMakingHostOnlyAbsoluteDoesNotCarryAnyOtherInformation() 
    [44] => function testTargetAttachment() 
)
Array
(
)
809) Class TestOfUrl File ../lib/simpletest/test/url_test.php: Does block count 0 match function count 45?  If not, something has an invalid or missing documentation comment at [/svn/goodstorm/www/t/coverage_tests/audit_documentation_coverage.phpt line 133]
        in testCoverage
        in DocumentationCoverageTester
        in ./coverage_tests/audit_documentation_coverage.phpt
Array
(
    [0] => function TestDisplayClass($a) 
    [1] => function testOfResults() 
    [2] => function testTrue() 
    [3] => function testFalse() 
    [4] => function testExpectation() 
    [5] => function testNull() 
    [6] => function testType() 
    [7] => function testTypeEquality() 
    [8] => function testNullEquality() 
    [9] => function testIntegerEquality() 
    [10] => function testStringEquality() 
    [11] => function testHashEquality() 
    [12] => function testWithin() 
    [13] => function testOutside() 
    [14] => function testStringIdentity() 
    [15] => function testTypeIdentity() 
    [16] => function testNullIdentity() 
    [17] => function testHashIdentity() 
    [18] => function testObjectEquality() 
    [19] => function testObjectIndentity() 
    [20] => function testReference() 
    [21] => function testCloneOnDifferentObjects() 
    [22] => function testPatterns() 
    [23] => function testLongStrings() 
    [24] => function testOfResults() 
    [25] => function testTrue() 
    [26] => function testFalse() 
    [27] => function testExpectation() 
    [28] => function testNull() 
    [29] => function testType() 
    [30] => function testTypeEquality() 
    [31] => function testNullEquality() 
    [32] => function testIntegerEquality() 
    [33] => function testStringEquality() 
    [34] => function testHashEquality() 
    [35] => function testWithin() 
    [36] => function testOutside() 
    [37] => function testStringIdentity() 
    [38] => function testTypeIdentity() 
    [39] => function testNullIdentity() 
    [40] => function testHashIdentity() 
    [41] => function testObjectEquality() 
    [42] => function testObjectIndentity() 
    [43] => function testReference() 
    [44] => function testCloneOnDifferentObjects() 
    [45] => function testPatterns() 
    [46] => function testLongStrings() 
    [47] => function Dummy() 
    [48] => function a() 
    [49] => function testCallCounts() 
    [50] => function testMinimumCallCounts() 
    [51] => function testEmptyMatching() 
    [52] => function testEmptyMatchingWithCustomMessage() 
    [53] => function testNullMatching() 
    [54] => function testBooleanMatching() 
    [55] => function testIntegerMatching() 
    [56] => function testFloatMatching() 
    [57] => function testStringMatching() 
    [58] => function testEmptyMatchingWithCustomExpectationMessage() 
    [59] => function testArrayMatching() 
    [60] => function testObjectMatching() 
    [61] => function testBigList() 
    [62] => function testMixedTypes() 
    [63] => function testMockWildcards() 
    [64] => function testDump() 
    [65] => function testDumpOfList() 
    [66] => function _getCss() 
    [67] => function paintPass($message) 
    [68] => function paintSignal($type, 
    [69] => function skip() 
    [70] => function testFail() 
    [71] => function skip() 
    [72] => function testFail() 
    [73] => function skip() 
    [74] => function testFail() 
    [75] => function skip() 
    [76] => function testFail() 
    [77] => function testPass() 
)
Array
(
)
810) Class TestDisplayClass File ../lib/simpletest/test/visual_test.php: Does block count 0 match function count 78?  If not, something has an invalid or missing documentation comment at [/svn/goodstorm/www/t/coverage_tests/audit_documentation_coverage.phpt line 133]
        in testCoverage
        in DocumentationCoverageTester
        in ./coverage_tests/audit_documentation_coverage.phpt
Array
(
    [0] => function testStringMatchingIsCaseSensitive() 
    [1] => function testMatchesInteger() 
    [2] => function testNonStringFailsExpectation() 
    [3] => function testUnsetFieldCanBeTestedFor() 
    [4] => function testMultipleValuesCanBeInAnyOrder() 
    [5] => function testSingleItemCanBeArrayOrString() 
    [6] => function testExpectingOnlyTheHeaderName() 
    [7] => function testHeaderValueAsWell() 
    [8] => function testHeaderValueWithColons() 
    [9] => function testMultilineSearch() 
    [10] => function testMultilineSearchWithPadding() 
    [11] => function testPatternMatching() 
    [12] => function testCaseInsensitivePatternMatching() 
    [13] => function testUnwantedHeader() 
    [14] => function testMultilineUnwantedSearch() 
    [15] => function testLocationHeaderSplitsCorrectly() 
    [16] => function testMatchingSubString() 
    [17] => function testNotMatchingSubString() 
    [18] => function testEquality() 
)
Array
(
)
811) Class TestOfFieldExpectation File ../lib/simpletest/test/web_tester_test.php: Does block count 0 match function count 19?  If not, something has an invalid or missing documentation comment at [/svn/goodstorm/www/t/coverage_tests/audit_documentation_coverage.phpt line 133]
        in testCoverage
        in DocumentationCoverageTester
        in ./coverage_tests/audit_documentation_coverage.phpt
Array
(
    [0] => function TransactionRevenueSplit( 
)
Array
(
)
812) Class TransactionRevenueSplit File ../lib/Transaction/RevenueSplit/TransactionRevenueSplit.php.class: Does block count 0 match function count 1?  If not, something has an invalid or missing documentation comment at [/svn/goodstorm/www/t/coverage_tests/audit_documentation_coverage.phpt line 133]
        in testCoverage
        in DocumentationCoverageTester
        in ./coverage_tests/audit_documentation_coverage.phpt
813) ../lib/simpletest/extensions/testdox.php seems to violate encapsulation by using foo::function instead of using the object methods.   That's not allowed. at [/svn/goodstorm/www/t/style_enforcement/enforce_encapsulation.phpt line 91]
        in testForEncapsulationViolations
        in CatchEncapsulatoinViolationsTester
        in ./style_enforcement/enforce_encapsulation.phpt
814) ../lib/simpletest/test/authentication_test.php seems to violate encapsulation by using foo::function instead of using the object methods.   That's not allowed. at [/svn/goodstorm/www/t/style_enforcement/enforce_encapsulation.phpt line 91]
        in testForEncapsulationViolations
        in CatchEncapsulatoinViolationsTester
        in ./style_enforcement/enforce_encapsulation.phpt
815) ../lib/simpletest/test/browser_test.php seems to violate encapsulation by using foo::function instead of using the object methods.   That's not allowed. at [/svn/goodstorm/www/t/style_enforcement/enforce_encapsulation.phpt line 91]
        in testForEncapsulationViolations
        in CatchEncapsulatoinViolationsTester
        in ./style_enforcement/enforce_encapsulation.phpt
816) ../lib/simpletest/test/detached_test.php seems to violate encapsulation by using foo::function instead of using the object methods.   That's not allowed. at [/svn/goodstorm/www/t/style_enforcement/enforce_encapsulation.phpt line 91]
        in testForEncapsulationViolations
        in CatchEncapsulatoinViolationsTester
        in ./style_enforcement/enforce_encapsulation.phpt
817) ../lib/simpletest/test/encoding_test.php seems to violate encapsulation by using foo::function instead of using the object methods.   That's not allowed. at [/svn/goodstorm/www/t/style_enforcement/enforce_encapsulation.phpt line 91]
        in testForEncapsulationViolations
        in CatchEncapsulatoinViolationsTester
        in ./style_enforcement/enforce_encapsulation.phpt
818) ../lib/simpletest/test/form_test.php seems to violate encapsulation by using foo::function instead of using the object methods.   That's not allowed. at [/svn/goodstorm/www/t/style_enforcement/enforce_encapsulation.phpt line 91]
        in testForEncapsulationViolations
        in CatchEncapsulatoinViolationsTester
        in ./style_enforcement/enforce_encapsulation.phpt
819) ../lib/simpletest/test/frames_test.php seems to violate encapsulation by using foo::function instead of using the object methods.   That's not allowed. at [/svn/goodstorm/www/t/style_enforcement/enforce_encapsulation.phpt line 91]
        in testForEncapsulationViolations
        in CatchEncapsulatoinViolationsTester
        in ./style_enforcement/enforce_encapsulation.phpt
820) ../lib/simpletest/test/http_test.php seems to violate encapsulation by using foo::function instead of using the object methods.   That's not allowed. at [/svn/goodstorm/www/t/style_enforcement/enforce_encapsulation.phpt line 91]
        in testForEncapsulationViolations
        in CatchEncapsulatoinViolationsTester
        in ./style_enforcement/enforce_encapsulation.phpt
821) ../lib/simpletest/test/interfaces_test.php seems to violate encapsulation by using foo::function instead of using the object methods.   That's not allowed. at [/svn/goodstorm/www/t/style_enforcement/enforce_encapsulation.phpt line 91]
        in testForEncapsulationViolations
        in CatchEncapsulatoinViolationsTester
        in ./style_enforcement/enforce_encapsulation.phpt
822) ../lib/simpletest/test/page_test.php seems to violate encapsulation by using foo::function instead of using the object methods.   That's not allowed. at [/svn/goodstorm/www/t/style_enforcement/enforce_encapsulation.phpt line 91]
        in testForEncapsulationViolations
        in CatchEncapsulatoinViolationsTester
        in ./style_enforcement/enforce_encapsulation.phpt
823) ../lib/simpletest/test/parser_test.php seems to violate encapsulation by using foo::function instead of using the object methods.   That's not allowed. at [/svn/goodstorm/www/t/style_enforcement/enforce_encapsulation.phpt line 91]
        in testForEncapsulationViolations
        in CatchEncapsulatoinViolationsTester
        in ./style_enforcement/enforce_encapsulation.phpt
824) ../lib/simpletest/test/remote_test.php seems to violate encapsulation by using foo::function instead of using the object methods.   That's not allowed. at [/svn/goodstorm/www/t/style_enforcement/enforce_encapsulation.phpt line 91]
        in testForEncapsulationViolations
        in CatchEncapsulatoinViolationsTester
        in ./style_enforcement/enforce_encapsulation.phpt
825) ../lib/simpletest/test/shell_tester_test.php seems to violate encapsulation by using foo::function instead of using the object methods.   That's not allowed. at [/svn/goodstorm/www/t/style_enforcement/enforce_encapsulation.phpt line 91]
        in testForEncapsulationViolations
        in CatchEncapsulatoinViolationsTester
        in ./style_enforcement/enforce_encapsulation.phpt
826) ../lib/simpletest/test/socket_test.php seems to violate encapsulation by using foo::function instead of using the object methods.   That's not allowed. at [/svn/goodstorm/www/t/style_enforcement/enforce_encapsulation.phpt line 91]
        in testForEncapsulationViolations
        in CatchEncapsulatoinViolationsTester
        in ./style_enforcement/enforce_encapsulation.phpt
827) ../lib/simpletest/test/tag_test.php seems to violate encapsulation by using foo::function instead of using the object methods.   That's not allowed. at [/svn/goodstorm/www/t/style_enforcement/enforce_encapsulation.phpt line 91]
        in testForEncapsulationViolations
        in CatchEncapsulatoinViolationsTester
        in ./style_enforcement/enforce_encapsulation.phpt
828) ../lib/simpletest/test/url_test.php seems to violate encapsulation by using foo::function instead of using the object methods.   That's not allowed. at [/svn/goodstorm/www/t/style_enforcement/enforce_encapsulation.phpt line 91]
        in testForEncapsulationViolations
        in CatchEncapsulatoinViolationsTester
        in ./style_enforcement/enforce_encapsulation.phpt
829) ../lib/simpletest/test/visual_test.php seems to violate encapsulation by using foo::function instead of using the object methods.   That's not allowed. at [/svn/goodstorm/www/t/style_enforcement/enforce_encapsulation.phpt line 91]
        in testForEncapsulationViolations
        in CatchEncapsulatoinViolationsTester
        in ./style_enforcement/enforce_encapsulation.phpt
FAILURES!!!
Test cases run: 33/33, Passes: 400, Failures: 829, Exceptions: 0