touch /home/ubuntu/openwrt/kamikaze_7.07_broadcom/build_mipsel/mutella-0.4.5/.configured
CFLAGS="-Os -pipe -mips32 -mtune=mips32 -funit-at-a-time -I/home/ubuntu/openwrt/kamikaze_7.07_broadcom/staging_dir_mipsel/usr/include -I/home/ubuntu/openwrt/kamikaze_7.07_broadcom/staging_dir_mipsel/include" CXXFLAGS="-Os -pipe -mips32 -mtune=mips32 -funit-at-a-time -I/home/ubuntu/openwrt/kamikaze_7.07_broadcom/staging_dir_mipsel/usr/include -I/home/ubuntu/openwrt/kamikaze_7.07_broadcom/staging_dir_mipsel/include" LDFLAGS="-L/home/ubuntu/openwrt/kamikaze_7.07_broadcom/staging_dir_mipsel/usr/lib -L/home/ubuntu/openwrt/kamikaze_7.07_broadcom/staging_dir_mipsel/lib " make -C /home/ubuntu/openwrt/kamikaze_7.07_broadcom/build_mipsel/mutella-0.4.5/. AR=mipsel-linux-uclibc-ar AS="ccache mipsel-linux-uclibc-gcc -c -Os -pipe -mips32 -mtune=mips32 -funit-at-a-time" LD=mipsel-linux-uclibc-ld NM=mipsel-linux-uclibc-nm CC="ccache mipsel-linux-uclibc-gcc" GCC="ccache mipsel-linux-uclibc-gcc" CXX=mipsel-linux-uclibc-g++ RANLIB=mipsel-linux-uclibc-ranlib STRIP=mipsel-linux-uclibc-strip OBJCOPY=mipsel-linux-uclibc-objcopy OBJDUMP=mipsel-linux-uclibc-objdump SIZE=mipsel-linux-uclibc-size CROSS="mipsel-linux-uclibc-" ARCH="mipsel" LDFLAGS="-L/home/ubuntu/openwrt/kamikaze_7.07_broadcom/staging_dir_mipsel/usr/lib -L/home/ubuntu/openwrt/kamikaze_7.07_broadcom/staging_dir_mipsel/lib -luClibc++ -lssl -lm -lpthread -lcrypto -ldl" CFLAGS="-Os -pipe -mips32 -mtune=mips32 -funit-at-a-time" CPPFLAGS="-Os -pipe -mips32 -mtune=mips32 -funit-at-a-time" CXX="mipsel-linux-uclibc-g++" ;
make[3]: Entering directory `/home/ubuntu/openwrt/kamikaze_7.07_broadcom/build_mipsel/mutella-0.4.5'
make all-recursive
make[4]: Entering directory `/home/ubuntu/openwrt/kamikaze_7.07_broadcom/build_mipsel/mutella-0.4.5'
Making all in mutella
make[5]: Entering directory `/home/ubuntu/openwrt/kamikaze_7.07_broadcom/build_mipsel/mutella-0.4.5/mutella'
Making all in docs
make[6]: Entering directory `/home/ubuntu/openwrt/kamikaze_7.07_broadcom/build_mipsel/mutella-0.4.5/mutella/docs'
Making all in en
make[7]: Entering directory `/home/ubuntu/openwrt/kamikaze_7.07_broadcom/build_mipsel/mutella-0.4.5/mutella/docs/en'
make[7]: Nothing to be done for `all'.
make[7]: Leaving directory `/home/ubuntu/openwrt/kamikaze_7.07_broadcom/build_mipsel/mutella-0.4.5/mutella/docs/en'
make[7]: Entering directory `/home/ubuntu/openwrt/kamikaze_7.07_broadcom/build_mipsel/mutella-0.4.5/mutella/docs'
make[7]: Nothing to be done for `all-am'.
make[7]: Leaving directory `/home/ubuntu/openwrt/kamikaze_7.07_broadcom/build_mipsel/mutella-0.4.5/mutella/docs'
make[6]: Leaving directory `/home/ubuntu/openwrt/kamikaze_7.07_broadcom/build_mipsel/mutella-0.4.5/mutella/docs'
make[6]: Entering directory `/home/ubuntu/openwrt/kamikaze_7.07_broadcom/build_mipsel/mutella-0.4.5/mutella'
if mipsel-linux-uclibc-g++ -DHAVE_CONFIG_H -I. -I. -I.. -I/usr/include -Os -pipe -mips32 -mtune=mips32 -funit-at-a-time -Os -pipe -mips32 -mtune=mips32 -funit-at-a-time -I/home/ubuntu/openwrt/kamikaze_7.07_broadcom/staging_dir_mipsel/usr/include -I/home/ubuntu/openwrt/kamikaze_7.07_broadcom/staging_dir_mipsel/include -O0 -MT uilocalsocket.o -MD -MP -MF ".deps/uilocalsocket.Tpo" -c -o uilocalsocket.o uilocalsocket.cpp; \
then mv -f ".deps/uilocalsocket.Tpo" ".deps/uilocalsocket.Po"; else rm -f ".deps/uilocalsocket.Tpo"; exit 1; fi
In file included from /usr/include/bits/sigcontext.h:28,
from /usr/include/signal.h:333,
from /usr/include/sys/wait.h:31,
from uilocalsocket.cpp:30:
/usr/include/asm/sigcontext.h:9:4: warning: #warning This machine appears to be neither x86_64 nor i386.
In file included from /usr/include/bits/socket.h:310,
from /usr/include/sys/socket.h:35,
from uilocalsocket.cpp:34:
/usr/include/asm/socket.h:9:4: warning: #warning This machine appears to be neither x86_64 nor i386.
In file included from /home/ubuntu/openwrt/kamikaze_7.07_broadcom/staging_dir_mipsel/lib/gcc/mipsel-linux-uclibc/3.4.6/../../../../include/c++/3.4.6/bits/locale_facets.h:132,
from /home/ubuntu/openwrt/kamikaze_7.07_broadcom/staging_dir_mipsel/lib/gcc/mipsel-linux-uclibc/3.4.6/../../../../include/c++/3.4.6/bits/basic_ios.h:44,
from /home/ubuntu/openwrt/kamikaze_7.07_broadcom/staging_dir_mipsel/lib/gcc/mipsel-linux-uclibc/3.4.6/../../../../include/c++/3.4.6/ios:51,
from /home/ubuntu/openwrt/kamikaze_7.07_broadcom/staging_dir_mipsel/lib/gcc/mipsel-linux-uclibc/3.4.6/../../../../include/c++/3.4.6/ostream:45,
from /home/ubuntu/openwrt/kamikaze_7.07_broadcom/staging_dir_mipsel/lib/gcc/mipsel-linux-uclibc/3.4.6/../../../../include/c++/3.4.6/iterator:71,
from mutella.h:59,
from uilocalsocket.cpp:37:
/home/ubuntu/openwrt/kamikaze_7.07_broadcom/staging_dir_mipsel/lib/gcc/mipsel-linux-uclibc/3.4.6/../../../../include/c++/3.4.6/mipsel-linux-uclibc/bits/ctype_base.h:42: error: expected `;' before '*' token
/home/ubuntu/openwrt/kamikaze_7.07_broadcom/staging_dir_mipsel/lib/gcc/mipsel-linux-uclibc/3.4.6/../../../../include/c++/3.4.6/mipsel-linux-uclibc/bits/ctype_base.h:46: error: `__ctype_mask_t' does not name a type
/home/ubuntu/openwrt/kamikaze_7.07_broadcom/staging_dir_mipsel/lib/gcc/mipsel-linux-uclibc/3.4.6/../../../../include/c++/3.4.6/mipsel-linux-uclibc/bits/ctype_base.h:47: error: `mask' does not name a type
/home/ubuntu/openwrt/kamikaze_7.07_broadcom/staging_dir_mipsel/lib/gcc/mipsel-linux-uclibc/3.4.6/../../../../include/c++/3.4.6/mipsel-linux-uclibc/bits/ctype_base.h:48: error: `mask' does not name a type
/home/ubuntu/openwrt/kamikaze_7.07_broadcom/staging_dir_mipsel/lib/gcc/mipsel-linux-uclibc/3.4.6/../../../../include/c++/3.4.6/mipsel-linux-uclibc/bits/ctype_base.h:49: error: `mask' does not name a type
/home/ubuntu/openwrt/kamikaze_7.07_broadcom/staging_dir_mipsel/lib/gcc/mipsel-linux-uclibc/3.4.6/../../../../include/c++/3.4.6/mipsel-linux-uclibc/bits/ctype_base.h:50: error: `mask' does not name a type
/home/ubuntu/openwrt/kamikaze_7.07_broadcom/staging_dir_mipsel/lib/gcc/mipsel-linux-uclibc/3.4.6/../../../../include/c++/3.4.6/mipsel-linux-uclibc/bits/ctype_base.h:51: error: `mask' does not name a type
/home/ubuntu/openwrt/kamikaze_7.07_broadcom/staging_dir_mipsel/lib/gcc/mipsel-linux-uclibc/3.4.6/../../../../include/c++/3.4.6/mipsel-linux-uclibc/bits/ctype_base.h:52: error: `mask' does not name a type
/home/ubuntu/openwrt/kamikaze_7.07_broadcom/staging_dir_mipsel/lib/gcc/mipsel-linux-uclibc/3.4.6/../../../../include/c++/3.4.6/mipsel-linux-uclibc/bits/ctype_base.h:53: error: `mask' does not name a type
/home/ubuntu/openwrt/kamikaze_7.07_broadcom/staging_dir_mipsel/lib/gcc/mipsel-linux-uclibc/3.4.6/../../../../include/c++/3.4.6/mipsel-linux-uclibc/bits/ctype_base.h:54: error: `mask' does not name a type
/home/ubuntu/openwrt/kamikaze_7.07_broadcom/staging_dir_mipsel/lib/gcc/mipsel-linux-uclibc/3.4.6/../../../../include/c++/3.4.6/mipsel-linux-uclibc/bits/ctype_base.h:55: error: `mask' does not name a type
/home/ubuntu/openwrt/kamikaze_7.07_broadcom/staging_dir_mipsel/lib/gcc/mipsel-linux-uclibc/3.4.6/../../../../include/c++/3.4.6/mipsel-linux-uclibc/bits/ctype_base.h:56: error: `mask' does not name a type
/home/ubuntu/openwrt/kamikaze_7.07_broadcom/staging_dir_mipsel/lib/gcc/mipsel-linux-uclibc/3.4.6/../../../../include/c++/3.4.6/mipsel-linux-uclibc/bits/ctype_base.h:57: error: `mask' does not name a type
In file included from /home/ubuntu/openwrt/kamikaze_7.07_broadcom/staging_dir_mipsel/lib/gcc/mipsel-linux-uclibc/3.4.6/../../../../include/c++/3.4.6/bits/basic_ios.h:44,
from /home/ubuntu/openwrt/kamikaze_7.07_broadcom/staging_dir_mipsel/lib/gcc/mipsel-linux-uclibc/3.4.6/../../../../include/c++/3.4.6/ios:51,
from /home/ubuntu/openwrt/kamikaze_7.07_broadcom/staging_dir_mipsel/lib/gcc/mipsel-linux-uclibc/3.4.6/../../../../include/c++/3.4.6/ostream:45,
from /home/ubuntu/openwrt/kamikaze_7.07_broadcom/staging_dir_mipsel/lib/gcc/mipsel-linux-uclibc/3.4.6/../../../../include/c++/3.4.6/iterator:71,
from mutella.h:59,
from uilocalsocket.cpp:37:
/home/ubuntu/openwrt/kamikaze_7.07_broadcom/staging_dir_mipsel/lib/gcc/mipsel-linux-uclibc/3.4.6/../../../../include/c++/3.4.6/bits/locale_facets.h:163: error: `mask' has not been declared
/home/ubuntu/openwrt/kamikaze_7.07_broadcom/staging_dir_mipsel/lib/gcc/mipsel-linux-uclibc/3.4.6/../../../../include/c++/3.4.6/bits/locale_facets.h:180: error: `mask' has not been declared
/home/ubuntu/openwrt/kamikaze_7.07_broadcom/staging_dir_mipsel/lib/gcc/mipsel-linux-uclibc/3.4.6/../../../../include/c++/3.4.6/bits/locale_facets.h:196: error: expected `;' before '(' token
/home/ubuntu/openwrt/kamikaze_7.07_broadcom/staging_dir_mipsel/lib/gcc/mipsel-linux-uclibc/3.4.6/../../../../include/c++/3.4.6/bits/locale_facets.h:211: error: expected `;' before "const"
/home/ubuntu/openwrt/kamikaze_7.07_broadcom/staging_dir_mipsel/lib/gcc/mipsel-linux-uclibc/3.4.6/../../../../include/c++/3.4.6/bits/locale_facets.h:212: error: expected `;' before '(' token
/home/ubuntu/openwrt/kamikaze_7.07_broadcom/staging_dir_mipsel/lib/gcc/mipsel-linux-uclibc/3.4.6/../../../../include/c++/3.4.6/bits/locale_facets.h:225: error: expected `;' before "char_type"
/home/ubuntu/openwrt/kamikaze_7.07_broadcom/staging_dir_mipsel/lib/gcc/mipsel-linux-uclibc/3.4.6/../../../../include/c++/3.4.6/bits/locale_facets.h:372: error: `mask' has not been declared
/home/ubuntu/openwrt/kamikaze_7.07_broadcom/staging_dir_mipsel/lib/gcc/mipsel-linux-uclibc/3.4.6/../../../../include/c++/3.4.6/bits/locale_facets.h:392: error: `mask' has not been declared
/home/ubuntu/openwrt/kamikaze_7.07_broadcom/staging_dir_mipsel/lib/gcc/mipsel-linux-uclibc/3.4.6/../../../../include/c++/3.4.6/bits/locale_facets.h:410: error: `do_scan_is' declared as a `virtual' field
/home/ubuntu/openwrt/kamikaze_7.07_broadcom/staging_dir_mipsel/lib/gcc/mipsel-linux-uclibc/3.4.6/../../../../include/c++/3.4.6/bits/locale_facets.h:410: error: expected `;' before '(' token
/home/ubuntu/openwrt/kamikaze_7.07_broadcom/staging_dir_mipsel/lib/gcc/mipsel-linux-uclibc/3.4.6/../../../../include/c++/3.4.6/bits/locale_facets.h:429: error: `do_scan_not' declared as a `virtual' field
/home/ubuntu/openwrt/kamikaze_7.07_broadcom/staging_dir_mipsel/lib/gcc/mipsel-linux-uclibc/3.4.6/../../../../include/c++/3.4.6/bits/locale_facets.h:429: error: expected `;' before '(' token
/home/ubuntu/openwrt/kamikaze_7.07_broadcom/staging_dir_mipsel/lib/gcc/mipsel-linux-uclibc/3.4.6/../../../../include/c++/3.4.6/bits/locale_facets.h:686: error: `__to_type' does not name a type
/home/ubuntu/openwrt/kamikaze_7.07_broadcom/staging_dir_mipsel/lib/gcc/mipsel-linux-uclibc/3.4.6/../../../../include/c++/3.4.6/bits/locale_facets.h:687: error: `__to_type' does not name a type
/home/ubuntu/openwrt/kamikaze_7.07_broadcom/staging_dir_mipsel/lib/gcc/mipsel-linux-uclibc/3.4.6/../../../../include/c++/3.4.6/bits/locale_facets.h:688: error: expected `;' before '*' token
/home/ubuntu/openwrt/kamikaze_7.07_broadcom/staging_dir_mipsel/lib/gcc/mipsel-linux-uclibc/3.4.6/../../../../include/c++/3.4.6/bits/locale_facets.h:712: error: expected `,' or `...' before '*' token
/home/ubuntu/openwrt/kamikaze_7.07_broadcom/staging_dir_mipsel/lib/gcc/mipsel-linux-uclibc/3.4.6/../../../../include/c++/3.4.6/bits/locale_facets.h:725: error: expected `,' or `...' before '*' token
/home/ubuntu/openwrt/kamikaze_7.07_broadcom/staging_dir_mipsel/lib/gcc/mipsel-linux-uclibc/3.4.6/../../../../include/c++/3.4.6/bits/locale_facets.h:738: error: `mask' has not been declared
/home/ubuntu/openwrt/kamikaze_7.07_broadcom/staging_dir_mipsel/lib/gcc/mipsel-linux-uclibc/3.4.6/../../../../include/c++/3.4.6/bits/locale_facets.h:753: error: `mask' has not been declared
/home/ubuntu/openwrt/kamikaze_7.07_broadcom/staging_dir_mipsel/lib/gcc/mipsel-linux-uclibc/3.4.6/../../../../include/c++/3.4.6/bits/locale_facets.h:767: error: `scan_is' declared as an `inline' field
/home/ubuntu/openwrt/kamikaze_7.07_broadcom/staging_dir_mipsel/lib/gcc/mipsel-linux-uclibc/3.4.6/../../../../include/c++/3.4.6/bits/locale_facets.h:767: error: expected `;' before '(' token
/home/ubuntu/openwrt/kamikaze_7.07_broadcom/staging_dir_mipsel/lib/gcc/mipsel-linux-uclibc/3.4.6/../../../../include/c++/3.4.6/bits/locale_facets.h:781: error: `scan_not' declared as an `inline' field
/home/ubuntu/openwrt/kamikaze_7.07_broadcom/staging_dir_mipsel/lib/gcc/mipsel-linux-uclibc/3.4.6/../../../../include/c++/3.4.6/bits/locale_facets.h:781: error: expected `;' before '(' token
/home/ubuntu/openwrt/kamikaze_7.07_broadcom/staging_dir_mipsel/lib/gcc/mipsel-linux-uclibc/3.4.6/../../../../include/c++/3.4.6/bits/locale_facets.h:973: error: expected `;' before '*' token
/home/ubuntu/openwrt/kamikaze_7.07_broadcom/staging_dir_mipsel/lib/gcc/mipsel-linux-uclibc/3.4.6/../../../../include/c++/3.4.6/bits/locale_facets.h:978: error: expected `;' before "static"
/home/ubuntu/openwrt/kamikaze_7.07_broadcom/staging_dir_mipsel/lib/gcc/mipsel-linux-uclibc/3.4.6/../../../../include/c++/3.4.6/bits/locale_facets.h:978: error: expected `;' before '*' token
In file included from /home/ubuntu/openwrt/kamikaze_7.07_broadcom/staging_dir_mipsel/lib/gcc/mipsel-linux-uclibc/3.4.6/../../../../include/c++/3.4.6/bits/locale_facets.h:1508,
from /home/ubuntu/openwrt/kamikaze_7.07_broadcom/staging_dir_mipsel/lib/gcc/mipsel-linux-uclibc/3.4.6/../../../../include/c++/3.4.6/bits/basic_ios.h:44,
from /home/ubuntu/openwrt/kamikaze_7.07_broadcom/staging_dir_mipsel/lib/gcc/mipsel-linux-uclibc/3.4.6/../../../../include/c++/3.4.6/ios:51,
from /home/ubuntu/openwrt/kamikaze_7.07_broadcom/staging_dir_mipsel/lib/gcc/mipsel-linux-uclibc/3.4.6/../../../../include/c++/3.4.6/ostream:45,
from /home/ubuntu/openwrt/kamikaze_7.07_broadcom/staging_dir_mipsel/lib/gcc/mipsel-linux-uclibc/3.4.6/../../../../include/c++/3.4.6/iterator:71,
from mutella.h:59,
from uilocalsocket.cpp:37:
/home/ubuntu/openwrt/kamikaze_7.07_broadcom/staging_dir_mipsel/lib/gcc/mipsel-linux-uclibc/3.4.6/../../../../include/c++/3.4.6/mipsel-linux-uclibc/bits/ctype_inline.h:39: error: `bool std::ctype<char>::is' is not a static member of `class std::ctype<char>'
/home/ubuntu/openwrt/kamikaze_7.07_broadcom/staging_dir_mipsel/lib/gcc/mipsel-linux-uclibc/3.4.6/../../../../include/c++/3.4.6/mipsel-linux-uclibc/bits/ctype_inline.h:39: error: `mask' was not declared in this scope
/home/ubuntu/openwrt/kamikaze_7.07_broadcom/staging_dir_mipsel/lib/gcc/mipsel-linux-uclibc/3.4.6/../../../../include/c++/3.4.6/mipsel-linux-uclibc/bits/ctype_inline.h:39: error: expected primary-expression before "char"
/home/ubuntu/openwrt/kamikaze_7.07_broadcom/staging_dir_mipsel/lib/gcc/mipsel-linux-uclibc/3.4.6/../../../../include/c++/3.4.6/mipsel-linux-uclibc/bits/ctype_inline.h:39: error: initializer expression list treated as compound expression
/home/ubuntu/openwrt/kamikaze_7.07_broadcom/staging_dir_mipsel/lib/gcc/mipsel-linux-uclibc/3.4.6/../../../../include/c++/3.4.6/mipsel-linux-uclibc/bits/ctype_inline.h:39: error: expected `,' or `;' before "const"
/home/ubuntu/openwrt/kamikaze_7.07_broadcom/staging_dir_mipsel/lib/gcc/mipsel-linux-uclibc/3.4.6/../../../../include/c++/3.4.6/mipsel-linux-uclibc/bits/ctype_inline.h:44: error: `mask' has not been declared
/home/ubuntu/openwrt/kamikaze_7.07_broadcom/staging_dir_mipsel/lib/gcc/mipsel-linux-uclibc/3.4.6/../../../../include/c++/3.4.6/mipsel-linux-uclibc/bits/ctype_inline.h: In member function `const char* std::ctype<char>::is(const char*, const char*, int*) const':
/home/ubuntu/openwrt/kamikaze_7.07_broadcom/staging_dir_mipsel/lib/gcc/mipsel-linux-uclibc/3.4.6/../../../../include/c++/3.4.6/mipsel-linux-uclibc/bits/ctype_inline.h:47: error: `_M_table' was not declared in this scope
/home/ubuntu/openwrt/kamikaze_7.07_broadcom/staging_dir_mipsel/lib/gcc/mipsel-linux-uclibc/3.4.6/../../../../include/c++/3.4.6/mipsel-linux-uclibc/bits/ctype_inline.h: At global scope:
/home/ubuntu/openwrt/kamikaze_7.07_broadcom/staging_dir_mipsel/lib/gcc/mipsel-linux-uclibc/3.4.6/../../../../include/c++/3.4.6/mipsel-linux-uclibc/bits/ctype_inline.h:53: error: `const char*std::ctype<char>::scan_is' is not a static member of `class std::ctype<char>'
/home/ubuntu/openwrt/kamikaze_7.07_broadcom/staging_dir_mipsel/lib/gcc/mipsel-linux-uclibc/3.4.6/../../../../include/c++/3.4.6/mipsel-linux-uclibc/bits/ctype_inline.h:53: error: `mask' was not declared in this scope
/home/ubuntu/openwrt/kamikaze_7.07_broadcom/staging_dir_mipsel/lib/gcc/mipsel-linux-uclibc/3.4.6/../../../../include/c++/3.4.6/mipsel-linux-uclibc/bits/ctype_inline.h:53: error: expected primary-expression before "const"
/home/ubuntu/openwrt/kamikaze_7.07_broadcom/staging_dir_mipsel/lib/gcc/mipsel-linux-uclibc/3.4.6/../../../../include/c++/3.4.6/mipsel-linux-uclibc/bits/ctype_inline.h:53: error: expected primary-expression before "const"
/home/ubuntu/openwrt/kamikaze_7.07_broadcom/staging_dir_mipsel/lib/gcc/mipsel-linux-uclibc/3.4.6/../../../../include/c++/3.4.6/mipsel-linux-uclibc/bits/ctype_inline.h:53: error: initializer expression list treated as compound expression
/home/ubuntu/openwrt/kamikaze_7.07_broadcom/staging_dir_mipsel/lib/gcc/mipsel-linux-uclibc/3.4.6/../../../../include/c++/3.4.6/mipsel-linux-uclibc/bits/ctype_inline.h:53: error: expected `,' or `;' before "const"
/home/ubuntu/openwrt/kamikaze_7.07_broadcom/staging_dir_mipsel/lib/gcc/mipsel-linux-uclibc/3.4.6/../../../../include/c++/3.4.6/mipsel-linux-uclibc/bits/ctype_inline.h:63: error: `const char*std::ctype<char>::scan_not' is not a static member of `class std::ctype<char>'
/home/ubuntu/openwrt/kamikaze_7.07_broadcom/staging_dir_mipsel/lib/gcc/mipsel-linux-uclibc/3.4.6/../../../../include/c++/3.4.6/mipsel-linux-uclibc/bits/ctype_inline.h:63: error: `mask' was not declared in this scope
/home/ubuntu/openwrt/kamikaze_7.07_broadcom/staging_dir_mipsel/lib/gcc/mipsel-linux-uclibc/3.4.6/../../../../include/c++/3.4.6/mipsel-linux-uclibc/bits/ctype_inline.h:63: error: expected primary-expression before "const"
/home/ubuntu/openwrt/kamikaze_7.07_broadcom/staging_dir_mipsel/lib/gcc/mipsel-linux-uclibc/3.4.6/../../../../include/c++/3.4.6/mipsel-linux-uclibc/bits/ctype_inline.h:63: error: expected primary-expression before "const"
/home/ubuntu/openwrt/kamikaze_7.07_broadcom/staging_dir_mipsel/lib/gcc/mipsel-linux-uclibc/3.4.6/../../../../include/c++/3.4.6/mipsel-linux-uclibc/bits/ctype_inline.h:63: error: initializer expression list treated as compound expression
/home/ubuntu/openwrt/kamikaze_7.07_broadcom/staging_dir_mipsel/lib/gcc/mipsel-linux-uclibc/3.4.6/../../../../include/c++/3.4.6/mipsel-linux-uclibc/bits/ctype_inline.h:63: error: expected `,' or `;' before "const"
In file included from /home/ubuntu/openwrt/kamikaze_7.07_broadcom/staging_dir_mipsel/lib/gcc/mipsel-linux-uclibc/3.4.6/../../../../include/c++/3.4.6/bits/basic_ios.h:44,
from /home/ubuntu/openwrt/kamikaze_7.07_broadcom/staging_dir_mipsel/lib/gcc/mipsel-linux-uclibc/3.4.6/../../../../include/c++/3.4.6/ios:51,
from /home/ubuntu/openwrt/kamikaze_7.07_broadcom/staging_dir_mipsel/lib/gcc/mipsel-linux-uclibc/3.4.6/../../../../include/c++/3.4.6/ostream:45,
from /home/ubuntu/openwrt/kamikaze_7.07_broadcom/staging_dir_mipsel/lib/gcc/mipsel-linux-uclibc/3.4.6/../../../../include/c++/3.4.6/iterator:71,
from mutella.h:59,
from uilocalsocket.cpp:37:
/home/ubuntu/openwrt/kamikaze_7.07_broadcom/staging_dir_mipsel/lib/gcc/mipsel-linux-uclibc/3.4.6/../../../../include/c++/3.4.6/bits/locale_facets.h: In instantiation of `std::ctype<wchar_t>':
/home/ubuntu/openwrt/kamikaze_7.07_broadcom/staging_dir_mipsel/lib/gcc/mipsel-linux-uclibc/3.4.6/../../../../include/c++/3.4.6/bits/locale_facets.h:1513: instantiated from `std::ctype_byname<wchar_t>'
/home/ubuntu/openwrt/kamikaze_7.07_broadcom/staging_dir_mipsel/lib/gcc/mipsel-linux-uclibc/3.4.6/../../../../include/c++/3.4.6/bits/locale_facets.h:1530: instantiated from here
/home/ubuntu/openwrt/kamikaze_7.07_broadcom/staging_dir_mipsel/lib/gcc/mipsel-linux-uclibc/3.4.6/../../../../include/c++/3.4.6/bits/locale_facets.h:611: error: no type named `mask' in `class std::__ctype_abstract_base<wchar_t>'
/home/ubuntu/openwrt/kamikaze_7.07_broadcom/staging_dir_mipsel/lib/gcc/mipsel-linux-uclibc/3.4.6/../../../../include/c++/3.4.6/bits/locale_facets.h:624: error: no type named `mask' in `class std::__ctype_abstract_base<wchar_t>'
/home/ubuntu/openwrt/kamikaze_7.07_broadcom/staging_dir_mipsel/lib/gcc/mipsel-linux-uclibc/3.4.6/../../../../include/c++/3.4.6/bits/locale_facets.h:627: error: no type named `mask' in `class std::__ctype_abstract_base<wchar_t>'
/home/ubuntu/openwrt/kamikaze_7.07_broadcom/staging_dir_mipsel/lib/gcc/mipsel-linux-uclibc/3.4.6/../../../../include/c++/3.4.6/bits/locale_facets.h:630: error: no type named `mask' in `class std::__ctype_abstract_base<wchar_t>'
/home/ubuntu/openwrt/kamikaze_7.07_broadcom/staging_dir_mipsel/lib/gcc/mipsel-linux-uclibc/3.4.6/../../../../include/c++/3.4.6/bits/locale_facets.h:634: error: no type named `mask' in `class std::__ctype_abstract_base<wchar_t>'
In file included from /home/ubuntu/openwrt/kamikaze_7.07_broadcom/staging_dir_mipsel/lib/gcc/mipsel-linux-uclibc/3.4.6/../../../../include/c++/3.4.6/bits/basic_ios.h:44,
from /home/ubuntu/openwrt/kamikaze_7.07_broadcom/staging_dir_mipsel/lib/gcc/mipsel-linux-uclibc/3.4.6/../../../../include/c++/3.4.6/ios:51,
from /home/ubuntu/openwrt/kamikaze_7.07_broadcom/staging_dir_mipsel/lib/gcc/mipsel-linux-uclibc/3.4.6/../../../../include/c++/3.4.6/ostream:45,
from /home/ubuntu/openwrt/kamikaze_7.07_broadcom/staging_dir_mipsel/lib/gcc/mipsel-linux-uclibc/3.4.6/../../../../include/c++/3.4.6/iterator:71,
from mutella.h:59,
from uilocalsocket.cpp:37:
/home/ubuntu/openwrt/kamikaze_7.07_broadcom/staging_dir_mipsel/lib/gcc/mipsel-linux-uclibc/3.4.6/../../../../include/c++/3.4.6/bits/locale_facets.h: In function `bool std::isspace(_CharT, const std::locale&)':
/home/ubuntu/openwrt/kamikaze_7.07_broadcom/staging_dir_mipsel/lib/gcc/mipsel-linux-uclibc/3.4.6/../../../../include/c++/3.4.6/bits/locale_facets.h:4495: error: `space' is not a member of `std::ctype_base'
/home/ubuntu/openwrt/kamikaze_7.07_broadcom/staging_dir_mipsel/lib/gcc/mipsel-linux-uclibc/3.4.6/../../../../include/c++/3.4.6/bits/locale_facets.h: In function `bool std::isprint(_CharT, const std::locale&)':
/home/ubuntu/openwrt/kamikaze_7.07_broadcom/staging_dir_mipsel/lib/gcc/mipsel-linux-uclibc/3.4.6/../../../../include/c++/3.4.6/bits/locale_facets.h:4500: error: `print' is not a member of `std::ctype_base'
/home/ubuntu/openwrt/kamikaze_7.07_broadcom/staging_dir_mipsel/lib/gcc/mipsel-linux-uclibc/3.4.6/../../../../include/c++/3.4.6/bits/locale_facets.h: In function `bool std::iscntrl(_CharT, const std::locale&)':
/home/ubuntu/openwrt/kamikaze_7.07_broadcom/staging_dir_mipsel/lib/gcc/mipsel-linux-uclibc/3.4.6/../../../../include/c++/3.4.6/bits/locale_facets.h:4505: error: `cntrl' is not a member of `std::ctype_base'
/home/ubuntu/openwrt/kamikaze_7.07_broadcom/staging_dir_mipsel/lib/gcc/mipsel-linux-uclibc/3.4.6/../../../../include/c++/3.4.6/bits/locale_facets.h: In function `bool std::isupper(_CharT, const std::locale&)':
/home/ubuntu/openwrt/kamikaze_7.07_broadcom/staging_dir_mipsel/lib/gcc/mipsel-linux-uclibc/3.4.6/../../../../include/c++/3.4.6/bits/locale_facets.h:4510: error: `upper' is not a member of `std::ctype_base'
/home/ubuntu/openwrt/kamikaze_7.07_broadcom/staging_dir_mipsel/lib/gcc/mipsel-linux-uclibc/3.4.6/../../../../include/c++/3.4.6/bits/locale_facets.h: In function `bool std::islower(_CharT, const std::locale&)':
/home/ubuntu/openwrt/kamikaze_7.07_broadcom/staging_dir_mipsel/lib/gcc/mipsel-linux-uclibc/3.4.6/../../../../include/c++/3.4.6/bits/locale_facets.h:4514: error: `lower' is not a member of `std::ctype_base'
/home/ubuntu/openwrt/kamikaze_7.07_broadcom/staging_dir_mipsel/lib/gcc/mipsel-linux-uclibc/3.4.6/../../../../include/c++/3.4.6/bits/locale_facets.h: In function `bool std::isalpha(_CharT, const std::locale&)':
/home/ubuntu/openwrt/kamikaze_7.07_broadcom/staging_dir_mipsel/lib/gcc/mipsel-linux-uclibc/3.4.6/../../../../include/c++/3.4.6/bits/locale_facets.h:4519: error: `alpha' is not a member of `std::ctype_base'
/home/ubuntu/openwrt/kamikaze_7.07_broadcom/staging_dir_mipsel/lib/gcc/mipsel-linux-uclibc/3.4.6/../../../../include/c++/3.4.6/bits/locale_facets.h: In function `bool std::isdigit(_CharT, const std::locale&)':
/home/ubuntu/openwrt/kamikaze_7.07_broadcom/staging_dir_mipsel/lib/gcc/mipsel-linux-uclibc/3.4.6/../../../../include/c++/3.4.6/bits/locale_facets.h:4524: error: `digit' is not a member of `std::ctype_base'
/home/ubuntu/openwrt/kamikaze_7.07_broadcom/staging_dir_mipsel/lib/gcc/mipsel-linux-uclibc/3.4.6/../../../../include/c++/3.4.6/bits/locale_facets.h: In function `bool std::ispunct(_CharT, const std::locale&)':
/home/ubuntu/openwrt/kamikaze_7.07_broadcom/staging_dir_mipsel/lib/gcc/mipsel-linux-uclibc/3.4.6/../../../../include/c++/3.4.6/bits/locale_facets.h:4529: error: `punct' is not a member of `std::ctype_base'
/home/ubuntu/openwrt/kamikaze_7.07_broadcom/staging_dir_mipsel/lib/gcc/mipsel-linux-uclibc/3.4.6/../../../../include/c++/3.4.6/bits/locale_facets.h: In function `bool std::isxdigit(_CharT, const std::locale&)':
/home/ubuntu/openwrt/kamikaze_7.07_broadcom/staging_dir_mipsel/lib/gcc/mipsel-linux-uclibc/3.4.6/../../../../include/c++/3.4.6/bits/locale_facets.h:4534: error: `xdigit' is not a member of `std::ctype_base'
/home/ubuntu/openwrt/kamikaze_7.07_broadcom/staging_dir_mipsel/lib/gcc/mipsel-linux-uclibc/3.4.6/../../../../include/c++/3.4.6/bits/locale_facets.h: In function `bool std::isalnum(_CharT, const std::locale&)':
/home/ubuntu/openwrt/kamikaze_7.07_broadcom/staging_dir_mipsel/lib/gcc/mipsel-linux-uclibc/3.4.6/../../../../include/c++/3.4.6/bits/locale_facets.h:4539: error: `alnum' is not a member of `std::ctype_base'
/home/ubuntu/openwrt/kamikaze_7.07_broadcom/staging_dir_mipsel/lib/gcc/mipsel-linux-uclibc/3.4.6/../../../../include/c++/3.4.6/bits/locale_facets.h: In function `bool std::isgraph(_CharT, const std::locale&)':
/home/ubuntu/openwrt/kamikaze_7.07_broadcom/staging_dir_mipsel/lib/gcc/mipsel-linux-uclibc/3.4.6/../../../../include/c++/3.4.6/bits/locale_facets.h:4544: error: `graph' is not a member of `std::ctype_base'
In file included from /home/ubuntu/openwrt/kamikaze_7.07_broadcom/staging_dir_mipsel/lib/gcc/mipsel-linux-uclibc/3.4.6/../../../../include/c++/3.4.6/locale:47,
from /home/ubuntu/openwrt/kamikaze_7.07_broadcom/staging_dir_mipsel/lib/gcc/mipsel-linux-uclibc/3.4.6/../../../../include/c++/3.4.6/bits/ostream.tcc:40,
from /home/ubuntu/openwrt/kamikaze_7.07_broadcom/staging_dir_mipsel/lib/gcc/mipsel-linux-uclibc/3.4.6/../../../../include/c++/3.4.6/ostream:545,
from /home/ubuntu/openwrt/kamikaze_7.07_broadcom/staging_dir_mipsel/lib/gcc/mipsel-linux-uclibc/3.4.6/../../../../include/c++/3.4.6/iterator:71,
from mutella.h:59,
from uilocalsocket.cpp:37:
/home/ubuntu/openwrt/kamikaze_7.07_broadcom/staging_dir_mipsel/lib/gcc/mipsel-linux-uclibc/3.4.6/../../../../include/c++/3.4.6/bits/locale_facets.tcc: In member function `_InIter std::money_get<_CharT, _InIter>::_M_extract(_InIter, _InIter, std::ios_base&, std::_Ios_Iostate&, std::string&) const':
/home/ubuntu/openwrt/kamikaze_7.07_broadcom/staging_dir_mipsel/lib/gcc/mipsel-linux-uclibc/3.4.6/../../../../include/c++/3.4.6/bits/locale_facets.tcc:1384: error: `space' is not a member of `std::ctype_base'
/home/ubuntu/openwrt/kamikaze_7.07_broadcom/staging_dir_mipsel/lib/gcc/mipsel-linux-uclibc/3.4.6/../../../../include/c++/3.4.6/bits/locale_facets.tcc:1392: error: `space' is not a member of `std::ctype_base'
/home/ubuntu/openwrt/kamikaze_7.07_broadcom/staging_dir_mipsel/lib/gcc/mipsel-linux-uclibc/3.4.6/../../../../include/c++/3.4.6/bits/locale_facets.tcc: In member function `_OutIter std::money_put<_CharT, _OutIter>::_M_insert(_OutIter, std::ios_base&, _CharT, const std::basic_string<_CharT, std::char_traits<_CharT>, std::allocator<_CharT> >&) const':
/home/ubuntu/openwrt/kamikaze_7.07_broadcom/staging_dir_mipsel/lib/gcc/mipsel-linux-uclibc/3.4.6/../../../../include/c++/3.4.6/bits/locale_facets.tcc:1541: error: `digit' is not a member of `std::ctype_base'
/home/ubuntu/openwrt/kamikaze_7.07_broadcom/staging_dir_mipsel/lib/gcc/mipsel-linux-uclibc/3.4.6/../../../../include/c++/3.4.6/bits/locale_facets.tcc: In member function `_InIter std::time_get<_CharT, _InIter>::_M_extract_via_format(_InIter, _InIter, std::ios_base&, std::_Ios_Iostate&, tm*, const _CharT*) const':
/home/ubuntu/openwrt/kamikaze_7.07_broadcom/staging_dir_mipsel/lib/gcc/mipsel-linux-uclibc/3.4.6/../../../../include/c++/3.4.6/bits/locale_facets.tcc:1789: error: `space' is not a member of `std::ctype_base'
/home/ubuntu/openwrt/kamikaze_7.07_broadcom/staging_dir_mipsel/lib/gcc/mipsel-linux-uclibc/3.4.6/../../../../include/c++/3.4.6/bits/locale_facets.tcc:1890: error: `upper' is not a member of `std::ctype_base'
In file included from /home/ubuntu/openwrt/kamikaze_7.07_broadcom/staging_dir_mipsel/lib/gcc/mipsel-linux-uclibc/3.4.6/../../../../include/c++/3.4.6/istream:771,
from /home/ubuntu/openwrt/kamikaze_7.07_broadcom/staging_dir_mipsel/lib/gcc/mipsel-linux-uclibc/3.4.6/../../../../include/c++/3.4.6/iterator:72,
from mutella.h:59,
from uilocalsocket.cpp:37:
/home/ubuntu/openwrt/kamikaze_7.07_broadcom/staging_dir_mipsel/lib/gcc/mipsel-linux-uclibc/3.4.6/../../../../include/c++/3.4.6/bits/istream.tcc: In constructor `std::basic_istream<_CharT, _Traits>::sentry::sentry(std::basic_istream<_CharT, _Traits>&, bool)':
/home/ubuntu/openwrt/kamikaze_7.07_broadcom/staging_dir_mipsel/lib/gcc/mipsel-linux-uclibc/3.4.6/../../../../include/c++/3.4.6/bits/istream.tcc:62: error: `space' is not a member of `std::ctype_base'
/home/ubuntu/openwrt/kamikaze_7.07_broadcom/staging_dir_mipsel/lib/gcc/mipsel-linux-uclibc/3.4.6/../../../../include/c++/3.4.6/bits/istream.tcc: In function `std::basic_istream<_CharT, _Traits>& std::operator>>(std::basic_istream<_CharT, _Traits>&, _CharT*)':
/home/ubuntu/openwrt/kamikaze_7.07_broadcom/staging_dir_mipsel/lib/gcc/mipsel-linux-uclibc/3.4.6/../../../../include/c++/3.4.6/bits/istream.tcc:975: error: `space' is not a member of `std::ctype_base'
/home/ubuntu/openwrt/kamikaze_7.07_broadcom/staging_dir_mipsel/lib/gcc/mipsel-linux-uclibc/3.4.6/../../../../include/c++/3.4.6/bits/istream.tcc: In function `std::basic_istream<_CharT, _Traits>& std::ws(std::basic_istream<_CharT, _Traits>&)':
/home/ubuntu/openwrt/kamikaze_7.07_broadcom/staging_dir_mipsel/lib/gcc/mipsel-linux-uclibc/3.4.6/../../../../include/c++/3.4.6/bits/istream.tcc:1016: error: `space' is not a member of `std::ctype_base'
/home/ubuntu/openwrt/kamikaze_7.07_broadcom/staging_dir_mipsel/lib/gcc/mipsel-linux-uclibc/3.4.6/../../../../include/c++/3.4.6/bits/istream.tcc: In function `std::basic_istream<_CharT, _Traits>& std::operator>>(std::basic_istream<_CharT, _Traits>&, std::basic_string<_CharT, _Traits, _Alloc>&)':
/home/ubuntu/openwrt/kamikaze_7.07_broadcom/staging_dir_mipsel/lib/gcc/mipsel-linux-uclibc/3.4.6/../../../../include/c++/3.4.6/bits/istream.tcc:1058: error: `space' is not a member of `std::ctype_base'
In file included from /usr/include/linux/errno.h:4,
from /usr/include/bits/errno.h:25,
from /usr/include/errno.h:36,
from mutella.h:81,
from uilocalsocket.cpp:37:
/usr/include/asm/errno.h:9:4: warning: #warning This machine appears to be neither x86_64 nor i386.
make[6]: *** [uilocalsocket.o] Error 1
make[6]: Leaving directory `/home/ubuntu/openwrt/kamikaze_7.07_broadcom/build_mipsel/mutella-0.4.5/mutella'
make[5]: *** [all-recursive] Error 1
make[5]: Leaving directory `/home/ubuntu/openwrt/kamikaze_7.07_broadcom/build_mipsel/mutella-0.4.5/mutella'
make[4]: *** [all-recursive] Error 1
make[4]: Leaving directory `/home/ubuntu/openwrt/kamikaze_7.07_broadcom/build_mipsel/mutella-0.4.5'
make[3]: *** [all] Error 2
make[3]: Leaving directory `/home/ubuntu/openwrt/kamikaze_7.07_broadcom/build_mipsel/mutella-0.4.5'
make[2]: *** [/home/ubuntu/openwrt/kamikaze_7.07_broadcom/build_mipsel/mutella-0.4.5/.built] Error 2
make[2]: Leaving directory `/home/ubuntu/openwrt/kamikaze_7.07_broadcom/feeds/packages/net/mutella'
*** mutella compile failed
make[1]: *** [mutella-compile] Error 1
make[1]: Leaving directory `/home/ubuntu/openwrt/kamikaze_7.07_broadcom/package'
Build failed. Please re-run make with V=99 to see what's going on
make: *** [package/mutella-compile] Fehler 1