rendered paste bodyThis file contains any messages produced by compilers while
running configure, to aid debugging if configure makes a mistake.
It was created by subversion configure 1.4.5, which was
generated by GNU Autoconf 2.59. Invocation command line was
$ ./configure --with-apr=/home/willem/subversion-1.4.5/apr
## --------- ##
## Platform. ##
## --------- ##
hostname = MyBookWorld
uname -m = armv5tejl
uname -r = 2.6.17.14
uname -s = Linux
uname -v = #1 PREEMPT Mon Mar 26 12:36:33 BST 2007
/usr/bin/uname -p = unknown
/bin/uname -X = unknown
/bin/arch = unknown
/usr/bin/arch -k = unknown
/usr/convex/getsysinfo = unknown
hostinfo = unknown
/bin/machine = unknown
/usr/bin/oslevel = unknown
/bin/universe = unknown
PATH: /bin
PATH: /sbin
PATH: /usr/bin
PATH: /usr/sbin
PATH: /usr/bin/X11
PATH: /usr/local/bin
## ----------- ##
## Core tests. ##
## ----------- ##
configure:1616: Configuring Subversion 1.4.5
configure:1626: creating config.nice
configure:1694: checking for gcc
configure:1710: found /usr/bin/gcc
configure:1720: result: gcc
configure:1964: checking for C compiler version
configure:1967: gcc --version </dev/null >&5
gcc (GCC) 3.4.2
Copyright (C) 2004 Free Software Foundation, Inc.
This is free software; see the source for copying conditions. There is NO
warranty; not even for MERCHANTABILITY or FITNESS FOR A PARTICULAR PURPOSE.
configure:1970: $? = 0
configure:1972: gcc -v </dev/null >&5
Using built-in specs.
Configured with: /data/releases/v1.18/buildroot/toolchain_build_arm_nofpu/gcc-3.4.2/configure --prefix=/usr --build=i386-pc-linux-gnu --host=arm-linux-uclibc --target=arm-linux-uclibc --enable-languages=c,c++ --enable-shared --with-gxx-include-dir=/usr/include/c++ --disable-__cxa_atexit --enable-target-optspace --with-gnu-ld --disable-nls --enable-threads --enable-multilib --with-float=soft
Thread model: posix
gcc version 3.4.2
configure:1975: $? = 0
configure:1977: gcc -V </dev/null >&5
gcc: `-V' option must have argument
configure:1980: $? = 1
configure:2003: checking for C compiler default output file name
configure:2006: gcc conftest.c >&5
configure:2009: $? = 0
configure:2055: result: a.out
configure:2060: checking whether the C compiler works
configure:2066: ./a.out
configure:2069: $? = 0
configure:2086: result: yes
configure:2093: checking whether we are cross compiling
configure:2095: result: no
configure:2098: checking for suffix of executables
configure:2100: gcc -o conftest conftest.c >&5
configure:2103: $? = 0
configure:2128: result:
configure:2134: checking for suffix of object files
configure:2155: gcc -c conftest.c >&5
configure:2158: $? = 0
configure:2180: result: o
configure:2184: checking whether we are using the GNU C compiler
configure:2208: gcc -c conftest.c >&5
configure:2214: $? = 0
configure:2218: test -z
|| test ! -s conftest.err
configure:2221: $? = 0
configure:2224: test -s conftest.o
configure:2227: $? = 0
configure:2240: result: yes
configure:2246: checking whether gcc accepts -g
configure:2267: gcc -c -g conftest.c >&5
configure:2273: $? = 0
configure:2277: test -z
|| test ! -s conftest.err
configure:2280: $? = 0
configure:2283: test -s conftest.o
configure:2286: $? = 0
configure:2297: result: yes
configure:2314: checking for gcc option to accept ANSI C
configure:2384: gcc -c -g -O2 conftest.c >&5
configure:2390: $? = 0
configure:2394: test -z
|| test ! -s conftest.err
configure:2397: $? = 0
configure:2400: test -s conftest.o
configure:2403: $? = 0
configure:2421: result: none needed
configure:2439: gcc -c -g -O2 conftest.c >&5
conftest.c:2: error: parse error before "me"
configure:2445: $? = 1
configure: failed program was:
| #ifndef __cplusplus
| choke me
| #endif
configure:2585: checking how to run the C preprocessor
configure:2620: gcc -E conftest.c
configure:2626: $? = 0
configure:2658: gcc -E conftest.c
conftest.c:9:28: ac_nonexistent.h: No such file or directory
configure:2664: $? = 1
configure: failed program was:
| /* confdefs.h. */
|
| #define PACKAGE_NAME "subversion"
| #define PACKAGE_TARNAME "subversion"
| #define PACKAGE_VERSION "1.4.5"
| #define PACKAGE_STRING "subversion 1.4.5"
| #define PACKAGE_BUGREPORT "http://subversion.tigris.org/"
| /* end confdefs.h. */
| #include <ac_nonexistent.h>
configure:2703: result: gcc -E
configure:2727: gcc -E conftest.c
configure:2733: $? = 0
configure:2765: gcc -E conftest.c
conftest.c:9:28: ac_nonexistent.h: No such file or directory
configure:2771: $? = 1
configure: failed program was:
| /* confdefs.h. */
|
| #define PACKAGE_NAME "subversion"
| #define PACKAGE_TARNAME "subversion"
| #define PACKAGE_VERSION "1.4.5"
| #define PACKAGE_STRING "subversion 1.4.5"
| #define PACKAGE_BUGREPORT "http://subversion.tigris.org/"
| /* end confdefs.h. */
| #include <ac_nonexistent.h>
configure:2822: checking build system type
configure:2840: result: armv5tejl-unknown-linux-gnu
configure:2848: checking host system type
configure:2862: result: armv5tejl-unknown-linux-gnu
configure:2870: checking target system type
configure:2884: result: armv5tejl-unknown-linux-gnu
configure:2901: checking for egrep
configure:2911: result: grep -E
configure:2917: checking whether ln -s works
configure:2921: result: yes
configure:2942: checking for a BSD-compatible install
configure:2997: result: /usr/bin/install -c
configure:3026: checking for static Apache module support
configure:3088: result: no
configure:3094: checking for Apache module support via DSO through APXS
configure:3132: result: found at /usr/local/apache2/bin/apxs
configure:3135: checking httpd version
configure:3151: result: recent enough
configure:3258: Apache Portable Runtime (APR) library configuration
configure:3286: checking for APR
configure:3368: result: yes
configure:3521: checking APR version
configure:3529: result: 0.9.12
configure:3613: Apache Portable Runtime Utility (APRUTIL) library configuration
configure:3641: checking for APR-util
configure:3723: result: reconfig
configure:3813: configuring package in apr-util now
configure:3867: checking APR-UTIL version
configure:3881: result: 0.9.12
configure:3962: checking neon library
configure:4085: checking neon library version
configure:4089: result: 0.25.5
configure:4192: configuring package in neon now
configure:4431: checking for ANSI C header files
configure:4456: gcc -c -g -O2 -g -O2 -pthread -D_LARGEFILE64_SOURCE -DNE_LFS -DLINUX=2 -D_REENTRANT -D_GNU_SOURCE conftest.c >&5
configure:4462: $? = 0
configure:4466: test -z
|| test ! -s conftest.err
configure:4469: $? = 0
configure:4472: test -s conftest.o
configure:4475: $? = 0
configure:4564: gcc -o conftest -g -O2 -g -O2 -pthread -D_LARGEFILE64_SOURCE -DNE_LFS -DLINUX=2 -D_REENTRANT -D_GNU_SOURCE -L/home/willem/subversion-1.4.5/apr-util/xml/expat/lib conftest.c >&5
configure:4567: $? = 0
configure:4569: ./conftest
configure:4572: $? = 0
configure:4587: result: yes
configure:4611: checking for sys/types.h
configure:4627: gcc -c -g -O2 -g -O2 -pthread -D_LARGEFILE64_SOURCE -DNE_LFS -DLINUX=2 -D_REENTRANT -D_GNU_SOURCE conftest.c >&5
configure:4633: $? = 0
configure:4637: test -z
|| test ! -s conftest.err
configure:4640: $? = 0
configure:4643: test -s conftest.o
configure:4646: $? = 0
configure:4657: result: yes
configure:4611: checking for sys/stat.h
configure:4627: gcc -c -g -O2 -g -O2 -pthread -D_LARGEFILE64_SOURCE -DNE_LFS -DLINUX=2 -D_REENTRANT -D_GNU_SOURCE conftest.c >&5
configure:4633: $? = 0
configure:4637: test -z
|| test ! -s conftest.err
configure:4640: $? = 0
configure:4643: test -s conftest.o
configure:4646: $? = 0
configure:4657: result: yes
configure:4611: checking for stdlib.h
configure:4627: gcc -c -g -O2 -g -O2 -pthread -D_LARGEFILE64_SOURCE -DNE_LFS -DLINUX=2 -D_REENTRANT -D_GNU_SOURCE conftest.c >&5
configure:4633: $? = 0
configure:4637: test -z
|| test ! -s conftest.err
configure:4640: $? = 0
configure:4643: test -s conftest.o
configure:4646: $? = 0
configure:4657: result: yes
configure:4611: checking for string.h
configure:4627: gcc -c -g -O2 -g -O2 -pthread -D_LARGEFILE64_SOURCE -DNE_LFS -DLINUX=2 -D_REENTRANT -D_GNU_SOURCE conftest.c >&5
configure:4633: $? = 0
configure:4637: test -z
|| test ! -s conftest.err
configure:4640: $? = 0
configure:4643: test -s conftest.o
configure:4646: $? = 0
configure:4657: result: yes
configure:4611: checking for memory.h
configure:4627: gcc -c -g -O2 -g -O2 -pthread -D_LARGEFILE64_SOURCE -DNE_LFS -DLINUX=2 -D_REENTRANT -D_GNU_SOURCE conftest.c >&5
configure:4633: $? = 0
configure:4637: test -z
|| test ! -s conftest.err
configure:4640: $? = 0
configure:4643: test -s conftest.o
configure:4646: $? = 0
configure:4657: result: yes
configure:4611: checking for strings.h
configure:4627: gcc -c -g -O2 -g -O2 -pthread -D_LARGEFILE64_SOURCE -DNE_LFS -DLINUX=2 -D_REENTRANT -D_GNU_SOURCE conftest.c >&5
configure:4633: $? = 0
configure:4637: test -z
|| test ! -s conftest.err
configure:4640: $? = 0
configure:4643: test -s conftest.o
configure:4646: $? = 0
configure:4657: result: yes
configure:4611: checking for inttypes.h
configure:4627: gcc -c -g -O2 -g -O2 -pthread -D_LARGEFILE64_SOURCE -DNE_LFS -DLINUX=2 -D_REENTRANT -D_GNU_SOURCE conftest.c >&5
configure:4633: $? = 0
configure:4637: test -z
|| test ! -s conftest.err
configure:4640: $? = 0
configure:4643: test -s conftest.o
configure:4646: $? = 0
configure:4657: result: yes
configure:4611: checking for stdint.h
configure:4627: gcc -c -g -O2 -g -O2 -pthread -D_LARGEFILE64_SOURCE -DNE_LFS -DLINUX=2 -D_REENTRANT -D_GNU_SOURCE conftest.c >&5
configure:4633: $? = 0
configure:4637: test -z
|| test ! -s conftest.err
configure:4640: $? = 0
configure:4643: test -s conftest.o
configure:4646: $? = 0
configure:4657: result: yes
configure:4611: checking for unistd.h
configure:4627: gcc -c -g -O2 -g -O2 -pthread -D_LARGEFILE64_SOURCE -DNE_LFS -DLINUX=2 -D_REENTRANT -D_GNU_SOURCE conftest.c >&5
configure:4633: $? = 0
configure:4637: test -z
|| test ! -s conftest.err
configure:4640: $? = 0
configure:4643: test -s conftest.o
configure:4646: $? = 0
configure:4657: result: yes
configure:5184: checking for a sed that does not truncate output
configure:5238: result: /bin/sed
configure:5252: checking for ld used by gcc
configure:5319: result: /usr/bin/ld
configure:5328: checking if the linker (/usr/bin/ld) is GNU ld
configure:5343: result: yes
configure:5348: checking for /usr/bin/ld option to reload object files
configure:5355: result: -r
configure:5373: checking for BSD-compatible nm
configure:5422: result: /usr/bin/nm -B
configure:5426: checking how to recognise dependent libraries
configure:5602: result: pass_all
configure:5847: checking dlfcn.h usability
configure:5859: gcc -c -g -O2 -g -O2 -pthread -D_LARGEFILE64_SOURCE -DNE_LFS -DLINUX=2 -D_REENTRANT -D_GNU_SOURCE conftest.c >&5
configure:5865: $? = 0
configure:5869: test -z
|| test ! -s conftest.err
configure:5872: $? = 0
configure:5875: test -s conftest.o
configure:5878: $? = 0
configure:5888: result: yes
configure:5892: checking dlfcn.h presence
configure:5902: gcc -E -DLINUX=2 -D_REENTRANT -D_GNU_SOURCE conftest.c
configure:5908: $? = 0
configure:5928: result: yes
configure:5963: checking for dlfcn.h
configure:5970: result: yes
configure:6035: checking for g++
configure:6051: found /usr/bin/g++
configure:6061: result: g++
configure:6077: checking for C++ compiler version
configure:6080: g++ --version </dev/null >&5
g++ (GCC) 3.4.2
Copyright (C) 2004 Free Software Foundation, Inc.
This is free software; see the source for copying conditions. There is NO
warranty; not even for MERCHANTABILITY or FITNESS FOR A PARTICULAR PURPOSE.
configure:6083: $? = 0
configure:6085: g++ -v </dev/null >&5
Using built-in specs.
Configured with: /data/releases/v1.18/buildroot/toolchain_build_arm_nofpu/gcc-3.4.2/configure --prefix=/usr --build=i386-pc-linux-gnu --host=arm-linux-uclibc --target=arm-linux-uclibc --enable-languages=c,c++ --enable-shared --with-gxx-include-dir=/usr/include/c++ --disable-__cxa_atexit --enable-target-optspace --with-gnu-ld --disable-nls --enable-threads --enable-multilib --with-float=soft
Thread model: posix
gcc version 3.4.2
configure:6088: $? = 0
configure:6090: g++ -V </dev/null >&5
g++: `-V' option must have argument
configure:6093: $? = 1
configure:6096: checking whether we are using the GNU C++ compiler
configure:6120: g++ -c -DLINUX=2 -D_REENTRANT -D_GNU_SOURCE conftest.cc >&5
configure:6126: $? = 0
configure:6130: test -z
|| test ! -s conftest.err
configure:6133: $? = 0
configure:6136: test -s conftest.o
configure:6139: $? = 0
configure:6152: result: yes
configure:6158: checking whether g++ accepts -g
configure:6179: g++ -c -g -DLINUX=2 -D_REENTRANT -D_GNU_SOURCE conftest.cc >&5
configure:6185: $? = 0
configure:6189: test -z
|| test ! -s conftest.err
configure:6192: $? = 0
configure:6195: test -s conftest.o
configure:6198: $? = 0
configure:6209: result: yes
configure:6251: g++ -c -g -O2 -DLINUX=2 -D_REENTRANT -D_GNU_SOURCE conftest.cc >&5
configure:6257: $? = 0
configure:6261: test -z
|| test ! -s conftest.err
configure:6264: $? = 0
configure:6267: test -s conftest.o
configure:6270: $? = 0
configure:6296: g++ -c -g -O2 -DLINUX=2 -D_REENTRANT -D_GNU_SOURCE conftest.cc >&5
conftest.cc: In function `int main()':
conftest.cc:27: error: `exit' undeclared (first use this function)
conftest.cc:27: error: (Each undeclared identifier is reported only once for each function it appears in.)
configure:6302: $? = 1
configure: failed program was:
| /* confdefs.h. */
|
| #define PACKAGE_NAME "subversion"
| #define PACKAGE_TARNAME "subversion"
| #define PACKAGE_VERSION "1.4.5"
| #define PACKAGE_STRING "subversion 1.4.5"
| #define PACKAGE_BUGREPORT "http://subversion.tigris.org/"
| #define SVN_NEON_0_25 1
| #define STDC_HEADERS 1
| #define HAVE_SYS_TYPES_H 1
| #define HAVE_SYS_STAT_H 1
| #define HAVE_STDLIB_H 1
| #define HAVE_STRING_H 1
| #define HAVE_MEMORY_H 1
| #define HAVE_STRINGS_H 1
| #define HAVE_INTTYPES_H 1
| #define HAVE_STDINT_H 1
| #define HAVE_UNISTD_H 1
| #define SVN_BINDIR "/usr/local/bin"
| #define SVN_LOCALE_DIR "/usr/local/share/locale"
| #define HAVE_DLFCN_H 1
| /* end confdefs.h. */
|
| int
| main ()
| {
| exit (42);
| ;
| return 0;
| }
configure:6251: g++ -c -g -O2 -DLINUX=2 -D_REENTRANT -D_GNU_SOURCE conftest.cc >&5
configure:6257: $? = 0
configure:6261: test -z
|| test ! -s conftest.err
configure:6264: $? = 0
configure:6267: test -s conftest.o
configure:6270: $? = 0
configure:6296: g++ -c -g -O2 -DLINUX=2 -D_REENTRANT -D_GNU_SOURCE conftest.cc >&5
configure:6302: $? = 0
configure:6306: test -z
|| test ! -s conftest.err
configure:6309: $? = 0
configure:6312: test -s conftest.o
configure:6315: $? = 0
configure:6348: checking how to run the C++ preprocessor
configure:6379: g++ -E -DLINUX=2 -D_REENTRANT -D_GNU_SOURCE conftest.cc
configure:6385: $? = 0
configure:6417: g++ -E -DLINUX=2 -D_REENTRANT -D_GNU_SOURCE conftest.cc
conftest.cc:26:28: ac_nonexistent.h: No such file or directory
configure:6423: $? = 1
configure: failed program was:
| /* confdefs.h. */
|
| #define PACKAGE_NAME "subversion"
| #define PACKAGE_TARNAME "subversion"
| #define PACKAGE_VERSION "1.4.5"
| #define PACKAGE_STRING "subversion 1.4.5"
| #define PACKAGE_BUGREPORT "http://subversion.tigris.org/"
| #define SVN_NEON_0_25 1
| #define STDC_HEADERS 1
| #define HAVE_SYS_TYPES_H 1
| #define HAVE_SYS_STAT_H 1
| #define HAVE_STDLIB_H 1
| #define HAVE_STRING_H 1
| #define HAVE_MEMORY_H 1
| #define HAVE_STRINGS_H 1
| #define HAVE_INTTYPES_H 1
| #define HAVE_STDINT_H 1
| #define HAVE_UNISTD_H 1
| #define SVN_BINDIR "/usr/local/bin"
| #define SVN_LOCALE_DIR "/usr/local/share/locale"
| #define HAVE_DLFCN_H 1
| #ifdef __cplusplus
| extern "C" void std::exit (int) throw (); using std::exit;
| #endif
| /* end confdefs.h. */
| #include <ac_nonexistent.h>
configure:6462: result: g++ -E
configure:6486: g++ -E -DLINUX=2 -D_REENTRANT -D_GNU_SOURCE conftest.cc
configure:6492: $? = 0
configure:6524: g++ -E -DLINUX=2 -D_REENTRANT -D_GNU_SOURCE conftest.cc
conftest.cc:26:28: ac_nonexistent.h: No such file or directory
configure:6530: $? = 1
configure: failed program was:
| /* confdefs.h. */
|
| #define PACKAGE_NAME "subversion"
| #define PACKAGE_TARNAME "subversion"
| #define PACKAGE_VERSION "1.4.5"
| #define PACKAGE_STRING "subversion 1.4.5"
| #define PACKAGE_BUGREPORT "http://subversion.tigris.org/"
| #define SVN_NEON_0_25 1
| #define STDC_HEADERS 1
| #define HAVE_SYS_TYPES_H 1
| #define HAVE_SYS_STAT_H 1
| #define HAVE_STDLIB_H 1
| #define HAVE_STRING_H 1
| #define HAVE_MEMORY_H 1
| #define HAVE_STRINGS_H 1
| #define HAVE_INTTYPES_H 1
| #define HAVE_STDINT_H 1
| #define HAVE_UNISTD_H 1
| #define SVN_BINDIR "/usr/local/bin"
| #define SVN_LOCALE_DIR "/usr/local/share/locale"
| #define HAVE_DLFCN_H 1
| #ifdef __cplusplus
| extern "C" void std::exit (int) throw (); using std::exit;
| #endif
| /* end confdefs.h. */
| #include <ac_nonexistent.h>
configure:6627: checking for g77
configure:6656: result: no
configure:6627: checking for f77
configure:6656: result: no
configure:6627: checking for xlf
configure:6656: result: no
configure:6627: checking for frt
configure:6656: result: no
configure:6627: checking for pgf77
configure:6656: result: no
configure:6627: checking for fort77
configure:6656: result: no
configure:6627: checking for fl32
configure:6656: result: no
configure:6627: checking for af77
configure:6656: result: no
configure:6627: checking for f90
configure:6656: result: no
configure:6627: checking for xlf90
configure:6656: result: no
configure:6627: checking for pgf90
configure:6656: result: no
configure:6627: checking for epcf90
configure:6656: result: no
configure:6627: checking for f95
configure:6656: result: no
configure:6627: checking for fort
configure:6656: result: no
configure:6627: checking for xlf95
configure:6656: result: no
configure:6627: checking for ifc
configure:6656: result: no
configure:6627: checking for efc
configure:6656: result: no
configure:6627: checking for pgf95
configure:6656: result: no
configure:6627: checking for lf95
configure:6656: result: no
configure:6627: checking for gfortran
configure:6656: result: no
configure:6668: checking for Fortran 77 compiler version
configure:6671: --version </dev/null >&5
./configure: line 6672: --version: command not found
configure:6674: $? = 127
configure:6676: -v </dev/null >&5
./configure: line 6677: -v: command not found
configure:6679: $? = 127
configure:6681: -V </dev/null >&5
./configure: line 6682: -V: command not found
configure:6684: $? = 127
configure:6692: checking whether we are using the GNU Fortran 77 compiler
configure:6706: -c conftest.F >&5
./configure: line 6707: -c: command not found
configure:6712: $? = 127
configure: failed program was:
| program main
| #ifndef __GNUC__
| choke me
| #endif
|
| end
configure:6738: result: no
configure:6744: checking whether accepts -g
configure:6756: -c -g conftest.f >&5
./configure: line 6757: -c: command not found
configure:6762: $? = 127
configure: failed program was:
| program main
|
| end
configure:6787: result: no
configure:6817: checking the maximum length of command line arguments
configure:6926: result: 32768
configure:6937: checking command to parse /usr/bin/nm -B output from gcc object
configure:7042: gcc -c -g -O2 -g -O2 -pthread -D_LARGEFILE64_SOURCE -DNE_LFS -DLINUX=2 -D_REENTRANT -D_GNU_SOURCE conftest.c >&5
configure:7045: $? = 0
configure:7049: /usr/bin/nm -B conftest.o \| sed -n -e 's/^.*[ ]\([ABCDGIRSTW][ABCDGIRSTW]*\)[ ][ ]*\([_A-Za-z][_A-Za-z0-9]*\)$/\1 \2 \2/p' \> conftest.nm
configure:7052: $? = 0
configure:7104: gcc -o conftest -g -O2 -g -O2 -pthread -D_LARGEFILE64_SOURCE -DNE_LFS -DLINUX=2 -D_REENTRANT -D_GNU_SOURCE -L/home/willem/subversion-1.4.5/apr-util/xml/expat/lib conftest.c conftstm.o >&5
configure:7107: $? = 0
configure:7145: result: ok
configure:7149: checking for objdir
configure:7164: result: .libs
configure:7254: checking for ar
configure:7270: found /usr/bin/ar
configure:7281: result: ar
configure:7334: checking for ranlib
configure:7350: found /usr/bin/ranlib
configure:7361: result: ranlib
configure:7414: checking for strip
configure:7430: found /usr/bin/strip
configure:7441: result: strip
configure:7717: checking if gcc supports -fno-rtti -fno-exceptions
configure:7735: gcc -c -g -O2 -g -O2 -pthread -D_LARGEFILE64_SOURCE -DNE_LFS -DLINUX=2 -D_REENTRANT -D_GNU_SOURCE -fno-rtti -fno-exceptions conftest.c >&5
cc1: warning: command line option "-fno-rtti" is valid for C++/ObjC++ but not for C
configure:7739: $? = 0
configure:7752: result: no
configure:7767: checking for gcc option to produce PIC
configure:7977: result: -fPIC
configure:7985: checking if gcc PIC flag -fPIC works
configure:8003: gcc -c -g -O2 -g -O2 -pthread -D_LARGEFILE64_SOURCE -DNE_LFS -DLINUX=2 -D_REENTRANT -D_GNU_SOURCE -fPIC -DPIC conftest.c >&5
configure:8007: $? = 0
configure:8020: result: yes
configure:8048: checking if gcc static flag -static works
configure:8076: result: yes
configure:8086: checking if gcc supports -c -o file.o
configure:8107: gcc -c -g -O2 -g -O2 -pthread -D_LARGEFILE64_SOURCE -DNE_LFS -DLINUX=2 -D_REENTRANT -D_GNU_SOURCE -o out/conftest2.o conftest.c >&5
configure:8111: $? = 0
configure:8133: result: yes
configure:8159: checking whether the gcc linker (/usr/bin/ld) supports shared libraries
configure:9117: result: yes
configure:9138: checking whether -lc should be explicitly linked in
configure:9143: gcc -c -g -O2 -g -O2 -pthread -D_LARGEFILE64_SOURCE -DNE_LFS -DLINUX=2 -D_REENTRANT -D_GNU_SOURCE conftest.c >&5
configure:9146: $? = 0
configure:9161: gcc -shared conftest.o -v -Wl,-soname -Wl,conftest -o conftest 2\>\&1 \| grep -lc \>/dev/null 2\>\&1
configure:9164: $? = 0
configure:9176: result: no
configure:9184: checking dynamic linker characteristics
configure:9772: result: GNU/Linux ld.so
configure:9781: checking how to hardcode library paths into programs
configure:9806: result: immediate
configure:9820: checking whether stripping libraries is possible
configure:9825: result: yes
configure:10659: checking if libtool supports shared libraries
configure:10661: result: yes
configure:10664: checking whether to build shared libraries
configure:10685: result: yes
configure:10688: checking whether to build static libraries
configure:10692: result: yes
configure:10784: creating libtool
configure:11372: checking for ld used by g++
configure:11439: result: /usr/bin/ld
configure:11448: checking if the linker (/usr/bin/ld) is GNU ld
configure:11463: result: yes
configure:11514: checking whether the g++ linker (/usr/bin/ld) supports shared libraries
configure:12452: result: yes
configure:12474: g++ -c -g -O2 -DLINUX=2 -D_REENTRANT -D_GNU_SOURCE conftest.cpp >&5
configure:12477: $? = 0
configure:12596: checking for g++ option to produce PIC
configure:12870: result: -fPIC
configure:12878: checking if g++ PIC flag -fPIC works
configure:12896: g++ -c -g -O2 -DLINUX=2 -D_REENTRANT -D_GNU_SOURCE -fPIC -DPIC conftest.cpp >&5
configure:12900: $? = 0
configure:12913: result: yes
configure:12941: checking if g++ static flag -static works
configure:12969: result: yes
configure:12979: checking if g++ supports -c -o file.o
configure:13000: g++ -c -g -O2 -DLINUX=2 -D_REENTRANT -D_GNU_SOURCE -o out/conftest2.o conftest.cpp >&5
configure:13004: $? = 0
configure:13026: result: yes
configure:13052: checking whether the g++ linker (/usr/bin/ld) supports shared libraries
configure:13077: result: yes
configure:13144: checking dynamic linker characteristics
configure:13732: result: GNU/Linux ld.so
configure:13741: checking how to hardcode library paths into programs
configure:13766: result: immediate
configure:19925: checking whether libtool accepts --tag=XXX
mkdir .libs
gcc -c -g -O2 -g -O2 -pthread -D_LARGEFILE64_SOURCE -DNE_LFS -DLINUX=2 -D_REENTRANT -D_GNU_SOURCE -L/home/willem/subversion-1.4.5/apr-util/xml/expat/lib conftest.c -fPIC -DPIC -o .libs/conftest.o
gcc -c -g -O2 -g -O2 -pthread -D_LARGEFILE64_SOURCE -DNE_LFS -DLINUX=2 -D_REENTRANT -D_GNU_SOURCE -L/home/willem/subversion-1.4.5/apr-util/xml/expat/lib conftest.c -o conftest.o >/dev/null 2>&1
configure:19946: result: yes
configure:19971: checking whether libtool needs -no-undefined
configure:19980: result: no
configure:19987: checking whether to avoid circular linkage at all costs
configure:20000: result: no
configure:20017: checking for trang
configure:20048: result: none
configure:20064: checking for socket in -lsocket
configure:20094: gcc -o conftest -g -O2 -g -O2 -pthread -D_LARGEFILE64_SOURCE -DNE_LFS -DLINUX=2 -D_REENTRANT -D_GNU_SOURCE -L/home/willem/subversion-1.4.5/apr-util/xml/expat/lib conftest.c -lsocket >&5
/usr/bin/ld: cannot find -lsocket
collect2: ld returned 1 exit status
configure:20100: $? = 1
configure: failed program was:
| /* confdefs.h. */
|
| #define PACKAGE_NAME "subversion"
| #define PACKAGE_TARNAME "subversion"
| #define PACKAGE_VERSION "1.4.5"
| #define PACKAGE_STRING "subversion 1.4.5"
| #define PACKAGE_BUGREPORT "http://subversion.tigris.org/"
| #define SVN_NEON_0_25 1
| #define STDC_HEADERS 1
| #define HAVE_SYS_TYPES_H 1
| #define HAVE_SYS_STAT_H 1
| #define HAVE_STDLIB_H 1
| #define HAVE_STRING_H 1
| #define HAVE_MEMORY_H 1
| #define HAVE_STRINGS_H 1
| #define HAVE_INTTYPES_H 1
| #define HAVE_STDINT_H 1
| #define HAVE_UNISTD_H 1
| #define SVN_BINDIR "/usr/local/bin"
| #define SVN_LOCALE_DIR "/usr/local/share/locale"
| #define HAVE_DLFCN_H 1
| #ifdef __cplusplus
| extern "C" void std::exit (int) throw (); using std::exit;
| #endif
| /* end confdefs.h. */
|
| /* Override any gcc2 internal prototype to avoid an error. */
| #ifdef __cplusplus
| extern "C"
| #endif
| /* We use char because int might match the return type of a gcc2
| builtin and then its argument prototype would still apply. */
| char socket ();
| int
| main ()
| {
| socket ();
| ;
| return 0;
| }
configure:20126: result: no
configure:20369: checking for Mac OS KeyChain Services
configure:20392: gcc -c -g -O2 -g -O2 -pthread -D_LARGEFILE64_SOURCE -DNE_LFS -DLINUX=2 -D_REENTRANT -D_GNU_SOURCE conftest.c >&5
conftest.c:29:32: AvailabilityMacros.h: No such file or directory
conftest.c:31:2: #error KeyChain API unavailable.
configure:20398: $? = 1
configure: failed program was:
| /* confdefs.h. */
|
| #define PACKAGE_NAME "subversion"
| #define PACKAGE_TARNAME "subversion"
| #define PACKAGE_VERSION "1.4.5"
| #define PACKAGE_STRING "subversion 1.4.5"
| #define PACKAGE_BUGREPORT "http://subversion.tigris.org/"
| #define SVN_NEON_0_25 1
| #define STDC_HEADERS 1
| #define HAVE_SYS_TYPES_H 1
| #define HAVE_SYS_STAT_H 1
| #define HAVE_STDLIB_H 1
| #define HAVE_STRING_H 1
| #define HAVE_MEMORY_H 1
| #define HAVE_STRINGS_H 1
| #define HAVE_INTTYPES_H 1
| #define HAVE_STDINT_H 1
| #define HAVE_UNISTD_H 1
| #define SVN_BINDIR "/usr/local/bin"
| #define SVN_LOCALE_DIR "/usr/local/share/locale"
| #define HAVE_DLFCN_H 1
| #ifdef __cplusplus
| extern "C" void std::exit (int) throw (); using std::exit;
| #endif
| #define SVN_FS_WANT_DB_MAJOR 4
| #define SVN_FS_WANT_DB_MINOR 0
| #define SVN_FS_WANT_DB_PATCH 14
| /* end confdefs.h. */
| #include <AvailabilityMacros.h>
| #if !DARWIN || (MAC_OS_X_VERSION_MAX_ALLOWED < MAC_OS_X_VERSION_10_2)
| #error KeyChain API unavailable.
| #endif
| int
| main ()
| {
|
| ;
| return 0;
| }
configure:20435: result: no
configure:20453: checking for msgfmt
configure:20484: result: none
configure:20493: checking for msgmerge
configure:20524: result: none
configure:20533: checking for xgettext
configure:20564: result: none
configure:20881: checking for ANSI C header files
configure:21037: result: yes
configure:21049: checking for an ANSI C-conforming const
configure:21116: gcc -c -g -O2 -g -O2 -pthread -D_LARGEFILE64_SOURCE -DNE_LFS -DLINUX=2 -D_REENTRANT -D_GNU_SOURCE conftest.c >&5
configure:21122: $? = 0
configure:21126: test -z
|| test ! -s conftest.err
configure:21129: $? = 0
configure:21132: test -s conftest.o
configure:21135: $? = 0
configure:21146: result: yes
configure:21157: checking for size_t
configure:21181: gcc -c -g -O2 -g -O2 -pthread -D_LARGEFILE64_SOURCE -DNE_LFS -DLINUX=2 -D_REENTRANT -D_GNU_SOURCE conftest.c >&5
configure:21187: $? = 0
configure:21191: test -z
|| test ! -s conftest.err
configure:21194: $? = 0
configure:21197: test -s conftest.o
configure:21200: $? = 0
configure:21211: result: yes
configure:21226: checking for working memcmp
configure:21274: gcc -o conftest -g -O2 -g -O2 -pthread -D_LARGEFILE64_SOURCE -DNE_LFS -DLINUX=2 -D_REENTRANT -D_GNU_SOURCE -L/home/willem/subversion-1.4.5/apr-util/xml/expat/lib conftest.c >&5
configure:21277: $? = 0
configure:21279: ./conftest
configure:21282: $? = 0
configure:21296: result: yes
configure:21312: checking for vprintf
configure:21369: gcc -o conftest -g -O2 -g -O2 -pthread -D_LARGEFILE64_SOURCE -DNE_LFS -DLINUX=2 -D_REENTRANT -D_GNU_SOURCE -L/home/willem/subversion-1.4.5/apr-util/xml/expat/lib conftest.c >&5
conftest.c:54: warning: conflicting types for built-in function 'vprintf'
configure:21375: $? = 0
configure:21379: test -z
|| test ! -s conftest.err
configure:21382: $? = 0
configure:21385: test -s conftest
configure:21388: $? = 0
configure:21400: result: yes
configure:21407: checking for _doprnt
configure:21464: gcc -o conftest -g -O2 -g -O2 -pthread -D_LARGEFILE64_SOURCE -DNE_LFS -DLINUX=2 -D_REENTRANT -D_GNU_SOURCE -L/home/willem/subversion-1.4.5/apr-util/xml/expat/lib conftest.c >&5
/tmp/ccew7dZL.o: In function `main':
/home/willem/subversion-1.4.5/conftest.c:74: undefined reference to `_doprnt'
/tmp/ccew7dZL.o:(.data+0x0): undefined reference to `_doprnt'
collect2: ld returned 1 exit status
configure:21470: $? = 1
configure: failed program was:
| /* confdefs.h. */
|
| #define PACKAGE_NAME "subversion"
| #define PACKAGE_TARNAME "subversion"
| #define PACKAGE_VERSION "1.4.5"
| #define PACKAGE_STRING "subversion 1.4.5"
| #define PACKAGE_BUGREPORT "http://subversion.tigris.org/"
| #define SVN_NEON_0_25 1
| #define STDC_HEADERS 1
| #define HAVE_SYS_TYPES_H 1
| #define HAVE_SYS_STAT_H 1
| #define HAVE_STDLIB_H 1
| #define HAVE_STRING_H 1
| #define HAVE_MEMORY_H 1
| #define HAVE_STRINGS_H 1
| #define HAVE_INTTYPES_H 1
| #define HAVE_STDINT_H 1
| #define HAVE_UNISTD_H 1
| #define SVN_BINDIR "/usr/local/bin"
| #define SVN_LOCALE_DIR "/usr/local/share/locale"
| #define HAVE_DLFCN_H 1
| #ifdef __cplusplus
| extern "C" void std::exit (int) throw (); using std::exit;
| #endif
| #define SVN_FS_WANT_DB_MAJOR 4
| #define SVN_FS_WANT_DB_MINOR 0
| #define SVN_FS_WANT_DB_PATCH 14
| #define STDC_HEADERS 1
| #define HAVE_VPRINTF 1
| /* end confdefs.h. */
| /* Define _doprnt to an innocuous variant, in case <limits.h> declares _doprnt.
| For example, HP-UX 11i <limits.h> declares gettimeofday. */
| #define _doprnt innocuous__doprnt
|
| /* System header to define __stub macros and hopefully few prototypes,
| which can conflict with char _doprnt (); below.
| Prefer <limits.h> to <assert.h> if __STDC__ is defined, since
| <limits.h> exists even on freestanding compilers. */
|
| #ifdef __STDC__
| # include <limits.h>
| #else
| # include <assert.h>
| #endif
|
| #undef _doprnt
|
| /* Override any gcc2 internal prototype to avoid an error. */
| #ifdef __cplusplus
| extern "C"
| {
| #endif
| /* We use char because int might match the return type of a gcc2
| builtin and then its argument prototype would still apply. */
| char _doprnt ();
| /* The GNU C library defines this for functions which it implements
| to always fail with ENOSYS. Some functions are actually named
| something starting with __ and the normal name is an alias. */
| #if defined (__stub__doprnt) || defined (__stub____doprnt)
| choke me
| #else
| char (*f) () = _doprnt;
| #endif
| #ifdef __cplusplus
| }
| #endif
|
| int
| main ()
| {
| return f != _doprnt;
| ;
| return 0;
| }
configure:21495: result: no
configure:21515: checking for symlink
configure:21572: gcc -o conftest -g -O2 -g -O2 -pthread -D_LARGEFILE64_SOURCE -DNE_LFS -DLINUX=2 -D_REENTRANT -D_GNU_SOURCE -L/home/willem/subversion-1.4.5/apr-util/xml/expat/lib conftest.c >&5
configure:21578: $? = 0
configure:21582: test -z
|| test ! -s conftest.err
configure:21585: $? = 0
configure:21588: test -s conftest
configure:21591: $? = 0
configure:21603: result: yes
configure:21515: checking for readlink
configure:21572: gcc -o conftest -g -O2 -g -O2 -pthread -D_LARGEFILE64_SOURCE -DNE_LFS -DLINUX=2 -D_REENTRANT -D_GNU_SOURCE -L/home/willem/subversion-1.4.5/apr-util/xml/expat/lib conftest.c >&5
configure:21578: $? = 0
configure:21582: test -z
|| test ! -s conftest.err
configure:21585: $? = 0
configure:21588: test -s conftest
configure:21591: $? = 0
configure:21603: result: yes
configure:21676: checking zlib.h usability
configure:21688: gcc -c -g -O2 -g -O2 -pthread -D_LARGEFILE64_SOURCE -DNE_LFS -DLINUX=2 -D_REENTRANT -D_GNU_SOURCE conftest.c >&5
configure:21694: $? = 0
configure:21698: test -z
|| test ! -s conftest.err
configure:21701: $? = 0
configure:21704: test -s conftest.o
configure:21707: $? = 0
configure:21717: result: yes
configure:21721: checking zlib.h presence
configure:21731: gcc -E -DLINUX=2 -D_REENTRANT -D_GNU_SOURCE conftest.c
configure:21737: $? = 0
configure:21757: result: yes
configure:21792: checking for zlib.h
configure:21799: result: yes
configure:21805: checking for inflate in -lz
configure:21835: gcc -o conftest -g -O2 -g -O2 -pthread -D_LARGEFILE64_SOURCE -DNE_LFS -DLINUX=2 -D_REENTRANT -D_GNU_SOURCE -L/home/willem/subversion-1.4.5/apr-util/xml/expat/lib conftest.c -lz >&5
configure:21841: $? = 0
configure:21845: test -z
|| test ! -s conftest.err
configure:21848: $? = 0
configure:21851: test -s conftest
configure:21854: $? = 0
configure:21867: result: yes
configure:21969: WARNING: Python 2.0 or later is required to run the testsuite
configure:21971: WARNING: or to use the Subversion Python bindings
configure:21973: WARNING:
configure:21975: WARNING: If you have a suitable Python installed, but not on the
configure:21977: WARNING: PATH, set the environment variable PYTHON to the full path
configure:21979: WARNING: to the Python executable, and re-run configure
configure:21986: checking for
configure:22019: result: no
configure:22302: checking for JDK
configure:22333: WARNING: no JNI header files found.
configure:22341: result: no
configure:22416: checking for perl
configure:22434: found /usr/local/bin/perl
configure:22447: result: /usr/local/bin/perl
configure:22457: checking for ruby
configure:22488: result: none
configure:23897: checking for swig
configure:23928: result: none
configure:24129: checking perl version
configure:24132: result: 5008008
configure:24972: creating ./config.status
## ---------------------- ##
## Running config.status. ##
## ---------------------- ##
This file was extended by subversion config.status 1.4.5, which was
generated by GNU Autoconf 2.59. Invocation command line was
CONFIG_FILES =
CONFIG_HEADERS =
CONFIG_LINKS =
CONFIG_COMMANDS =
$ ./config.status
on MyBookWorld
config.status:779: creating Makefile
config.status:779: creating tools/backup/hot-backup.py
config.status:779: creating contrib/client-side/svn_load_dirs.pl
config.status:779: creating contrib/client-side/svncopy.pl
config.status:779: creating contrib/client-side/testsvncopy.pl
config.status:779: creating tools/hook-scripts/commit-access-control.pl
config.status:779: creating tools/hook-scripts/commit-email.pl
config.status:779: creating subversion/bindings/swig/perl/native/Makefile.PL
config.status:779: creating packages/solaris/pkginfo
config.status:894: creating subversion/svn_private_config.h
config.status:1034: subversion/svn_private_config.h is unchanged
config.status:1192: executing mkdir-init commands
configure:26267: WARNING: we have configured without BDB filesystem support
You don't seem to have Berkeley DB version 4.0.14 or newer
installed and linked to APR-UTIL. We have created Makefiles which
will build without the Berkeley DB back-end; your repositories will
use FSFS as the default back-end. You can find the latest version of
Berkeley DB here:
http://www.sleepycat.com/download/index.shtml
## ---------------- ##
## Cache variables. ##
## ---------------- ##
ac_cv_build=armv5tejl-unknown-linux-gnu
ac_cv_build_alias=armv5tejl-unknown-linux-gnu
ac_cv_c_compiler_gnu=yes
ac_cv_c_const=yes
ac_cv_cxx_compiler_gnu=yes
ac_cv_env_CC_set=
ac_cv_env_CC_value=
ac_cv_env_CFLAGS_set=
ac_cv_env_CFLAGS_value=
ac_cv_env_CPPFLAGS_set=
ac_cv_env_CPPFLAGS_value=
ac_cv_env_CPP_set=
ac_cv_env_CPP_value=
ac_cv_env_CXXCPP_set=
ac_cv_env_CXXCPP_value=
ac_cv_env_CXXFLAGS_set=
ac_cv_env_CXXFLAGS_value=
ac_cv_env_CXX_set=
ac_cv_env_CXX_value=
ac_cv_env_F77_set=
ac_cv_env_F77_value=
ac_cv_env_FFLAGS_set=
ac_cv_env_FFLAGS_value=
ac_cv_env_LDFLAGS_set=
ac_cv_env_LDFLAGS_value=
ac_cv_env_build_alias_set=
ac_cv_env_build_alias_value=
ac_cv_env_host_alias_set=
ac_cv_env_host_alias_value=
ac_cv_env_target_alias_set=
ac_cv_env_target_alias_value=
ac_cv_exeext=
ac_cv_f77_compiler_gnu=no
ac_cv_func__doprnt=no
ac_cv_func_memcmp_working=yes
ac_cv_func_readlink=yes
ac_cv_func_symlink=yes
ac_cv_func_vprintf=yes
ac_cv_header_dlfcn_h=yes
ac_cv_header_inttypes_h=yes
ac_cv_header_memory_h=yes
ac_cv_header_stdc=yes
ac_cv_header_stdint_h=yes
ac_cv_header_stdlib_h=yes
ac_cv_header_string_h=yes
ac_cv_header_strings_h=yes
ac_cv_header_sys_stat_h=yes
ac_cv_header_sys_types_h=yes
ac_cv_header_unistd_h=yes
ac_cv_header_zlib_h=yes
ac_cv_host=armv5tejl-unknown-linux-gnu
ac_cv_host_alias=armv5tejl-unknown-linux-gnu
ac_cv_lib_socket_socket=no
ac_cv_lib_z_inflate=yes
ac_cv_objext=o
ac_cv_path_MSGFMT=none
ac_cv_path_MSGMERGE=none
ac_cv_path_PERL=/usr/local/bin/perl
ac_cv_path_RUBY=none
ac_cv_path_SWIG=none
ac_cv_path_TRANG=none
ac_cv_path_XGETTEXT=none
ac_cv_path_install='/usr/bin/install -c'
ac_cv_prog_CPP='gcc -E'
ac_cv_prog_CXXCPP='g++ -E'
ac_cv_prog_ac_ct_AR=ar
ac_cv_prog_ac_ct_CC=gcc
ac_cv_prog_ac_ct_CXX=g++
ac_cv_prog_ac_ct_RANLIB=ranlib
ac_cv_prog_ac_ct_STRIP=strip
ac_cv_prog_cc_g=yes
ac_cv_prog_cc_stdc=
ac_cv_prog_cxx_g=yes
ac_cv_prog_egrep='grep -E'
ac_cv_prog_f77_g=no
ac_cv_target=armv5tejl-unknown-linux-gnu
ac_cv_target_alias=armv5tejl-unknown-linux-gnu
ac_cv_type_size_t=yes
lt_cv_deplibs_check_method=pass_all
lt_cv_file_magic_cmd='$MAGIC_CMD'
lt_cv_file_magic_test_file=
lt_cv_ld_reload_flag=-r
lt_cv_objdir=.libs
lt_cv_path_LD=/usr/bin/ld
lt_cv_path_LDCXX=/usr/bin/ld
lt_cv_path_NM='/usr/bin/nm -B'
lt_cv_path_SED=/bin/sed
lt_cv_prog_compiler_c_o=yes
lt_cv_prog_compiler_c_o_CXX=yes
lt_cv_prog_compiler_rtti_exceptions=no
lt_cv_prog_gnu_ld=yes
lt_cv_prog_gnu_ldcxx=yes
lt_cv_sys_global_symbol_pipe='sed -n -e '\''s/^.*[ ]\([ABCDGIRSTW][ABCDGIRSTW]*\)[ ][ ]*\([_A-Za-z][_A-Za-z0-9]*\)$/\1 \2 \2/p'\'''
lt_cv_sys_global_symbol_to_c_name_address='sed -n -e '\''s/^: \([^ ]*\) $/ {\"\1\", (lt_ptr) 0},/p'\'' -e '\''s/^[BCDEGRST] \([^ ]*\) \([^ ]*\)$/ {"\2", (lt_ptr) \&\2},/p'\'''
lt_cv_sys_global_symbol_to_cdecl='sed -n -e '\''s/^. .* \(.*\)$/extern int \1;/p'\'''
lt_cv_sys_max_cmd_len=32768
lt_lt_cv_prog_compiler_c_o='"yes"'
lt_lt_cv_prog_compiler_c_o_CXX='"yes"'
lt_lt_cv_sys_global_symbol_pipe='"sed -n -e '\''s/^.*[ ]\\([ABCDGIRSTW][ABCDGIRSTW]*\\)[ ][ ]*\\([_A-Za-z][_A-Za-z0-9]*\\)\$/\\1 \\2 \\2/p'\''"'
lt_lt_cv_sys_global_symbol_to_c_name_address='"sed -n -e '\''s/^: \\([^ ]*\\) \$/ {\\\"\\1\\\", (lt_ptr) 0},/p'\'' -e '\''s/^[BCDEGRST] \\([^ ]*\\) \\([^ ]*\\)\$/ {\"\\2\", (lt_ptr) \\&\\2},/p'\''"'
lt_lt_cv_sys_global_symbol_to_cdecl='"sed -n -e '\''s/^. .* \\(.*\\)\$/extern int \\1;/p'\''"'
## ----------------- ##
## Output variables. ##
## ----------------- ##
APACHE_INCLUDES=' -I/usr/local/apache2/include'
APACHE_LDFLAGS=''
APACHE_LIBEXECDIR='/usr/local/apache2/modules'
APACHE_TARGET=''
APXS='/usr/local/apache2/bin/apxs'
AR='ar'
BDB_TEST_DEPS=''
BDB_TEST_PROGRAMS=''
BINNAME='mod_dav_svn.so'
BUILD_APACHE_RULE='apache-mod'
BUILD_RULES='fsmod-lib ramod-lib lib bin test apache-mod dav-lib'
CC='gcc'
CFLAGS='-g -O2 -g -O2 -pthread -D_LARGEFILE64_SOURCE -DNE_LFS'
CPP='gcc -E'
CPPFLAGS=' -DLINUX=2 -D_REENTRANT -D_GNU_SOURCE'
CXX='g++'
CXXCPP='g++ -E'
CXXFLAGS='-g -O2'
DEFS='-DHAVE_CONFIG_H'
ECHO='echo'
ECHO_C=''
ECHO_N='-n'
ECHO_T=''
EGREP='grep -E'
EXEEXT=''
F77=''
FFLAGS=''
FIX_JAVAHL_LIB=''
GETTEXT_CODESET='#'
INCLUDE_OUTPUTS='include $(top_srcdir)/build-outputs.mk'
INSTALL_APACHE_RULE='install-mods-shared'
INSTALL_DATA='${INSTALL} -m 644'
INSTALL_EXTRA_JAVAHL_LIB=''
INSTALL_IT='$(APXS) -i -a -n dav_svn mod_dav_svn.so'
INSTALL_PROGRAM='${INSTALL}'
INSTALL_RULES='install-fsmod-lib install-ramod-lib install-dav-lib install-lib install-include install-static install-mods-shared'
INSTALL_SCRIPT='${INSTALL}'
INSTALL_STATIC_RULES='install-bin install-docs install-dav-lib'
JAR='none'
JAVA=''
JAVAC='none'
JAVAC_FLAGS=''
JAVAH='none'
JAVAHL_OBJDIR=''
JAVAHL_TESTS_TARGET=''
JAVA_CLASSPATH=''
JDK='none'
JNI_INCLUDES='none'
LDFLAGS=' -L/home/willem/subversion-1.4.5/apr-util/xml/expat/lib'
LIBOBJS=''
LIBS=' -lz'
LIBTOOL='$(SHELL) $(top_builddir)/libtool'
LN_S='ln -s'
LTLIBOBJS=''
LT_CXX_LIBADD=''
LT_LDFLAGS=''
LT_NO_UNDEFINED=''
MKDIR='/usr/bin/install -c -d'
MOD_ACTIVATION='-a'
MSGFMT='none'
MSGFMTFLAGS=''
MSGMERGE='none'
NEON_LIBS='$(abs_builddir)/neon/src/libneon.la'
NO_GETTEXT_CODESET='#'
OBJEXT='o'
PACKAGE_BUGREPORT='http://subversion.tigris.org/'
PACKAGE_NAME='subversion'
PACKAGE_STRING='subversion 1.4.5'
PACKAGE_TARNAME='subversion'
PACKAGE_VERSION='1.4.5'
PATH_SEPARATOR=':'
PERL='/usr/local/bin/perl'
PYTHON='none'
RANLIB='ranlib'
RDOC=''
RUBY='none'
RUBY_MAJOR=''
RUBY_MINOR=''
SHELL='/bin/sh'
STRIP='strip'
SVN_APRUTIL_EXPORT_LIBS=' -L/home/willem/subversion-1.4.5/apr-util -laprutil-0 /home/willem/subversion-1.4.5/apr-util/xml/expat/lib/libexpat.la'
SVN_APRUTIL_INCLUDES=' -I/home/willem/subversion-1.4.5/apr-util/include -I/home/willem/subversion-1.4.5/apr-util/xml/expat/lib'
SVN_APRUTIL_LIBS=' /home/willem/subversion-1.4.5/apr-util/libaprutil-0.la /home/willem/subversion-1.4.5/apr-util/xml/expat/lib/libexpat.la'
SVN_APRUTIL_PREFIX=''
SVN_APR_EXPORT_LIBS=' -L/home/willem/subversion-1.4.5/apr -lapr-0 -lm -lcrypt -lnsl -lpthread -ldl'
SVN_APR_INCLUDES=' -I/home/willem/subversion-1.4.5/apr/include '
SVN_APR_LIBS=' /home/willem/subversion-1.4.5/apr/libapr-0.la -lm -lcrypt -lnsl -lpthread -ldl'
SVN_APR_PREFIX='/usr/local/apr'
SVN_APR_SHLIB_PATH_VAR='LD_LIBRARY_PATH'
SVN_BINDIR='/usr/local/bin'
SVN_CONFIG_SCRIPT_FILES=' tools/backup/hot-backup.py contrib/client-side/svn_load_dirs.pl contrib/client-side/svncopy.pl contrib/client-side/testsvncopy.pl tools/hook-scripts/commit-access-control.pl tools/hook-scripts/commit-email.pl subversion/bindings/swig/perl/native/Makefile.PL packages/solaris/pkginfo'
SVN_EXTERNAL_PROJECT_SUBDIRS=' apr-util neon'
SVN_FS_LIB_DEPS='$(FS_FS_DEPS)'
SVN_FS_LIB_INSTALL_DEPS='install-fsmod-lib'
SVN_FS_LIB_LINK='$(FS_FS_LINK)'
SVN_LIBTOOL='$(SHELL) /home/willem/subversion-1.4.5/libtool'
SVN_LT_CCTAG='--tag=CC'
SVN_LT_CXXTAG='--tag=CXX'
SVN_NEON_INCLUDES='-I$(abs_srcdir)/neon/src -I/usr/local/include/neon '
SVN_RA_LIB_DEPS='$(RA_LOCAL_DEPS) $(RA_SVN_DEPS) $(RA_DAV_DEPS)'
SVN_RA_LIB_INSTALL_DEPS='install-ramod-lib install-dav-lib'
SVN_RA_LIB_LINK='$(RA_LOCAL_LINK) $(RA_SVN_LINK) $(RA_DAV_LINK)'
SVN_SERF_EXPORT_LIBS=''
SVN_SERF_INCLUDES=''
SVN_SERF_LIBS=''
SVN_SERF_PREFIX=''
SWIG='none'
SWIG_PL_INCLUDES='$(SWIG_INCLUDES) -fno-strict-aliasing -pipe -Wdeclaration-after-statement -D_LARGEFILE_SOURCE -D_FILE_OFFSET_BITS=64 -I/usr/local/lib/perl5/5.8.8/armv5tejl-linux/CORE '
SWIG_PY_COMPILE='none'
SWIG_PY_INCLUDES=''
SWIG_PY_LIBS=''
SWIG_PY_LINK='none'
SWIG_RB_COMPILE='none'
SWIG_RB_INCLUDES=''
SWIG_RB_LINK='none'
SWIG_RB_SITE_ARCH_DIR=''
SWIG_RB_SITE_LIB_DIR=''
SWIG_RB_TEST_VERBOSE=''
TRANG='none'
XGETTEXT='none'
abs_builddir='/home/willem/subversion-1.4.5'
abs_srcdir='/home/willem/subversion-1.4.5'
ac_ct_AR='ar'
ac_ct_CC='gcc'
ac_ct_CXX='g++'
ac_ct_F77=''
ac_ct_RANLIB='ranlib'
ac_ct_STRIP='strip'
bindir='${exec_prefix}/bin'
build='armv5tejl-unknown-linux-gnu'
build_alias=''
build_cpu='armv5tejl'
build_os='linux-gnu'
build_vendor='unknown'
datadir='${prefix}/share'
exec_prefix='${prefix}'
host='armv5tejl-unknown-linux-gnu'
host_alias=''
host_cpu='armv5tejl'
host_os='linux-gnu'
host_vendor='unknown'
includedir='${prefix}/include'
infodir='${prefix}/info'
libdir='${exec_prefix}/lib'
libexecdir='${exec_prefix}/libexec'
localedir='${datadir}/locale'
localstatedir='${prefix}/var'
mandir='${prefix}/man'
neon_config=''
oldincludedir='/usr/include'
prefix='/usr/local'
program_transform_name='s,x,x,'
sbindir='${exec_prefix}/sbin'
sharedstatedir='${prefix}/com'
sysconfdir='${prefix}/etc'
target='armv5tejl-unknown-linux-gnu'
target_alias=''
target_cpu='armv5tejl'
target_os='linux-gnu'
target_vendor='unknown'
## ----------- ##
## confdefs.h. ##
## ----------- ##
#define DEFAULT_FS_TYPE "fsfs"
#define HAVE_DLFCN_H 1
#define HAVE_INTTYPES_H 1
#define HAVE_MEMORY_H 1
#define HAVE_READLINK 1
#define HAVE_STDINT_H 1
#define HAVE_STDLIB_H 1
#define HAVE_STRINGS_H 1
#define HAVE_STRING_H 1
#define HAVE_SYMLINK 1
#define HAVE_SYS_STAT_H 1
#define HAVE_SYS_TYPES_H 1
#define HAVE_UNISTD_H 1
#define HAVE_VPRINTF 1
#define PACKAGE_BUGREPORT "http://subversion.tigris.org/"
#define PACKAGE_NAME "subversion"
#define PACKAGE_STRING "subversion 1.4.5"
#define PACKAGE_TARNAME "subversion"
#define PACKAGE_VERSION "1.4.5"
#define STDC_HEADERS 1
#define STDC_HEADERS 1
#define SVN_BINDIR "/usr/local/bin"
#define SVN_FS_WANT_DB_MAJOR 4
#define SVN_FS_WANT_DB_MINOR 0
#define SVN_FS_WANT_DB_PATCH 14
#define SVN_HAVE_ZLIB 1
#define SVN_LIBSVN_CLIENT_LINKS_RA_DAV 1
#define SVN_LIBSVN_CLIENT_LINKS_RA_LOCAL 1
#define SVN_LIBSVN_CLIENT_LINKS_RA_SVN 1
#define SVN_LIBSVN_FS_LINKS_FS_FS 1
#define SVN_LOCALE_DIR "/usr/local/share/locale"
#define SVN_NEON_0_25 1
#define SVN_NULL_DEVICE_NAME "/dev/null"
#define SVN_PATH_LOCAL_SEPARATOR '/'
#endif
#ifdef __cplusplus
extern "C" void std::exit (int) throw (); using std::exit;
configure: exit 0