All pastes #675702 Raw Edit

Etwas

public text v1 · immutable
#675702 ·published 2007-08-30 12:22 UTC
rendered paste body
if /bin/sh ../libtool --tag=CC --mode=compile gcc -DHAVE_CONFIG_H -include ../include/confdefs.h -I. -I. -I../include    -fomit-frame-pointer -D_REENTRANT -Wall -Wstrict-prototypes -Wmissing-prototypes -Wmissing-declarations -I.. -I../include  -g -O2 -I/usr/include/openssl -DHAVE_SSL  -g -O2 -MT libcallweaver_la-callweaver_expr2f.lo -MD -MP -MF ".deps/libcallweaver_la-callweaver_expr2f.Tpo" -c -o libcallweaver_la-callweaver_expr2f.lo `test -f 'callweaver_expr2f.c' || echo './'`callweaver_expr2f.c; \
then mv -f ".deps/libcallweaver_la-callweaver_expr2f.Tpo" ".deps/libcallweaver_la-callweaver_expr2f.Plo"; else rm -f ".deps/libcallweaver_la-callweaver_expr2f.Tpo"; exit 1; fi
 gcc -DHAVE_CONFIG_H -include ../include/confdefs.h -I. -I. -I../include -fomit-frame-pointer -D_REENTRANT -Wall -Wstrict-prototypes -Wmissing-prototypes -Wmissing-declarations -I.. -I../include -g -O2 -I/usr/include/openssl -DHAVE_SSL -g -O2 -MT libcallweaver_la-callweaver_expr2f.lo -MD -MP -MF .deps/libcallweaver_la-callweaver_expr2f.Tpo -c callweaver_expr2f.c  -fPIC -DPIC -o .libs/libcallweaver_la-callweaver_expr2f.o
callweaver_expr2.l:60:79: error: callweaver_expr2.h: No such file or directory
callweaver_expr2f.c:1474: error: expected specifier-qualifier-list before 'YYSTYPE'
callweaver_expr2f.c:1517: error: expected '=', ',', ';', 'asm' or '__attribute__' before '*' token
callweaver_expr2f.c:1519: error: expected ')' before '*' token
callweaver_expr2f.c:1521: error: expected '=', ',', ';', 'asm' or '__attribute__' before '*' token
callweaver_expr2f.c:1523: error: expected ')' before '*' token
callweaver_expr2f.c:1616: error: expected ')' before '*' token
callweaver_expr2f.c:1640: error: expected ')' before '*' token
callweaver_expr2f.c:2931: error: expected '=', ',', ';', 'asm' or '__attribute__' before '*' token
callweaver_expr2f.c:2937: error: expected ')' before '*' token
callweaver_expr2f.c:2943: error: expected '=', ',', ';', 'asm' or '__attribute__' before '*' token
callweaver_expr2f.c:2949: error: expected ')' before '*' token
callweaver_expr2.l:213: error: expected declaration specifiers or '...' before 'YYLTYPE'
callweaver_expr2.l:368: error: expected declaration specifiers or '...' before 'yyltype'
make[3]: *** [libcallweaver_la-callweaver_expr2f.lo] Fehler 1
make[3]: Leaving directory `/usr/src/callweaver-svn/corelib'
make[2]: *** [all-recursive] Fehler 1
make[2]: Leaving directory `/usr/src/callweaver-svn/corelib'
make[1]: *** [all] Fehler 2
make[1]: Leaving directory `/usr/src/callweaver-svn/corelib'
make: *** [all-recursive] Fehler 1