# ./configure --prefix=/home/ascent/1309
# make clean
# make
nssl -MT SocketPoll.o -MD -MP -MF .deps/SocketPoll.Tpo -c -o SocketPoll.o `test -f 'Network/SocketPoll.cpp' || echo './'`Network/SocketPoll.cpp
mv -f .deps/SocketPoll.Tpo .deps/SocketPoll.Po
rm -f libnetwork.a
ar cru libnetwork.a Socket.o SocketLinux.o SocketFreeBSD.o SocketMgrLinux.o SocketMgrFreeBSD.o SocketOpsLinux.o SocketOpsFreeBSD.o SocketMgrSelect.o SocketOpsSelect.o SocketSelect.o SocketMgrPoll.o SocketOpsPoll.o SocketPoll.o
ranlib libnetwork.a
make[3]: Leaving directory `/home/ascent/SVN/1309/src/shared'
Making all in game
make[3]: Entering directory `/home/ascent/SVN/1309/src/game'
g++ -DHAVE_CONFIG_H -I. -I../.. -I/usr/include/mysql -I/usr/local/include/mysql -I/usr/include/openssl -I/usr/local/include/openssl -I. -I./../../dep/include -I./../shared -I./../../dep/src/gm -I./../logonserver -I/usr/include/mysql -I/usr/local/include/mysql -I/usr/include/openssl -I/usr/local/include/openssl -MT ScriptEngine.o -MD -MP -MF .deps/ScriptEngine.Tpo -c -o ScriptEngine.o `test -f '../scriptengine/ScriptEngine.cpp' || echo './'`../scriptengine/ScriptEngine.cpp
In file included from ./StdAfx.h:56,
from ../scriptengine/ScriptEngine.cpp:28:
./../shared/SmartPointer.h:126:7: warning: no newline at end of file
./../shared/SmartPointer.h: In member function 'const T* SharedPointer<T>::operator->() const':
./../shared/SmartPointer.h:88: error: there are no arguments to 'NulRefException' that depend on a template parameter, so a declaration of 'NulRefException' must be available
./../shared/SmartPointer.h:88: error: (if you use '-fpermissive', G++ will accept your code, but allowing the use of an undeclared name is deprecated)
make[3]: *** [ScriptEngine.o] Error 1
make[3]: Leaving directory `/home/ascent/SVN/1309/src/game'
make[2]: *** [all-recursive] Error 1
make[2]: Leaving directory `/home/ascent/SVN/1309/src'
make[1]: *** [all-recursive] Error 1
make[1]: Leaving directory `/home/ascent/SVN/1309'
make: *** [all] Error 2