All pastes #674962 Raw Edit

Last portion of 'emerge kdelibs'

public shellscript v1 · immutable
#674962 ·published 2007-08-29 18:13 UTC
rendered paste body
Making all in kdoctoolscreating kio_ghelp_la.all_cpp.cpp ...creating kio_help_la.all_cpp.cpp ...Making all in kimgiopcx.cpp: In function 'void readImage4(QImage&, QDataStream&, const PCXHEADER&)':pcx.cpp:184: warning: comparison between signed and unsigned integer expressionspcx.cpp:190: warning: comparison between signed and unsigned integer expressionspcx.cpp: In function 'void readImage24(QImage&, QDataStream&, const PCXHEADER&)':pcx.cpp:260: warning: comparison between signed and unsigned integer expressionspcx.cpp: In function 'void writeImage4(QImage&, QDataStream&, PCXHEADER&)':pcx.cpp:411: warning: comparison between signed and unsigned integer expressionspcx.cpp: In function 'void writeImage24(QImage&, QDataStream&, PCXHEADER&)':pcx.cpp:468: warning: comparison between signed and unsigned integer expressionsxcf.cpp: In member function 'bool XCFImageFormat::loadProperty(QDataStream&, PropType&, QByteArray&)':xcf.cpp:302: warning: 'data' may be used uninitialized in this function/usr/lib/gcc/x86_64-pc-linux-gnu/4.1.2/../../../../x86_64-pc-linux-gnu/bin/ld: `-retain-symbols-file' overrides `-s' and `-S'/usr/lib/gcc/x86_64-pc-linux-gnu/4.1.2/../../../../x86_64-pc-linux-gnu/bin/ld: `-retain-symbols-file' overrides `-s' and `-S'/usr/lib/gcc/x86_64-pc-linux-gnu/4.1.2/../../../../x86_64-pc-linux-gnu/bin/ld: `-retain-symbols-file' overrides `-s' and `-S'/usr/lib/gcc/x86_64-pc-linux-gnu/4.1.2/../../../../x86_64-pc-linux-gnu/bin/ld: `-retain-symbols-file' overrides `-s' and `-S'/usr/lib/gcc/x86_64-pc-linux-gnu/4.1.2/../../../../x86_64-pc-linux-gnu/bin/ld: `-retain-symbols-file' overrides `-s' and `-S'/usr/lib/gcc/x86_64-pc-linux-gnu/4.1.2/../../../../x86_64-pc-linux-gnu/bin/ld: `-retain-symbols-file' overrides `-s' and `-S'/usr/lib/gcc/x86_64-pc-linux-gnu/4.1.2/../../../../x86_64-pc-linux-gnu/bin/ld: `-retain-symbols-file' overrides `-s' and `-S'/usr/lib/gcc/x86_64-pc-linux-gnu/4.1.2/../../../../x86_64-pc-linux-gnu/bin/ld: `-retain-symbols-file' overrides `-s' and `-S'/usr/lib/gcc/x86_64-pc-linux-gnu/4.1.2/../../../../x86_64-pc-linux-gnu/bin/ld: `-retain-symbols-file' overrides `-s' and `-S'/usr/lib/gcc/x86_64-pc-linux-gnu/4.1.2/../../../../x86_64-pc-linux-gnu/bin/ld: `-retain-symbols-file' overrides `-s' and `-S'/usr/lib/gcc/x86_64-pc-linux-gnu/4.1.2/../../../../x86_64-pc-linux-gnu/bin/ld: `-retain-symbols-file' overrides `-s' and `-S'/usr/lib/gcc/x86_64-pc-linux-gnu/4.1.2/../../../../x86_64-pc-linux-gnu/bin/ld: `-retain-symbols-file' overrides `-s' and `-S'/usr/lib/gcc/x86_64-pc-linux-gnu/4.1.2/../../../../x86_64-pc-linux-gnu/bin/ld: `-retain-symbols-file' overrides `-s' and `-S'Making all in kioslaveMaking all in fileMaking all in httpMaking all in kcookiejarMaking all in testscreating kded_kcookiejar_la.all_cpp.cpp ...Making all in ftpftp.cc: In member function 'Ftp::StatusCode Ftp::ftpPut(int&, int, const KURL&, int, bool, bool)':ftp.cc:2328: warning: comparison between signed and unsigned integer expressionsMaking all in gzipMaking all in bzip2Making all in metainfometainfo.cpp: In function 'int kdemain(int, char**)':metainfo.cpp:45: warning: '__comp_ctor ' is deprecated (declared at ../../kdecore/kapplication.h:205)Making all in knewstuffcreating libknewstuff_la.all_cpp.cpp ...Making all in kpartscreating libkparts_la.all_cpp.cpp ...Making all in kresourcescreating libkresources_la.all_cpp.cpp ...Making all in kstylesMaking all in plastikMaking all in configcreating plastik_la.all_cpp.cpp ...Making all in highcolorMaking all in highcontrastMaking all in configMaking all in themesMaking all in lightcreating light_la.all_cpp.cpp ...Making all in kthemestylecreating kthemestyle_la.all_cpp.cpp ...Making all in riscosMaking all in utilsMaking all in installthemeMaking all in keramikcheckbox_off:221/272(0)checkbox_on:221/272(0)checkbox_tri:221/272(0)/bin/sh: line 1: 25488 Segmentation fault      ./genembed $pics > pixmaps.keramikmake[3]: *** [pixmaps.keramik] Error 139make[3]: *** Waiting for unfinished jobs....checkbox_off:221/272(0)checkbox_on:221/272(0)checkbox_tri:221/272(0)/bin/sh: line 1: 25487 Segmentation fault      ./genembed $pics > pixmaps.keramikmake[3]: *** [keramikrc.h] Error 139make[2]: *** [all-recursive] Error 1make[1]: *** [all-recursive] Error 1make: *** [all] Error 2 * * ERROR: kde-base/kdelibs-3.5.7-r2 failed. * Call stack: *   ebuild.sh, line 1654:   Called dyn_compile *   ebuild.sh, line 990:   Called qa_call 'src_compile' *   ebuild.sh, line 44:   Called src_compile *   kdelibs-3.5.7-r2.ebuild, line 150:   Called kde_src_compile *   kde.eclass, line 170:   Called kde_src_compile 'all' *   kde.eclass, line 340:   Called kde_src_compile 'myconf' 'configure' 'make' *   kde.eclass, line 336:   Called die * * died running emake, kde_src_compile:make * If you need support, post the topmost build error, and the call stack if relevant. * A complete build log is located at '/var/tmp/portage/kde-base/kdelibs-3.5.7-r2/temp/build.log'. * * Messages for package kde-base/kdelibs-3.5.7-r2: * On some setups, which rely on the correct update of utmp records, not using * utempter might not update them correctly. If you experience unexpected * behaviour, try to rebuild kde-base/kdelibs with utempter use-flag enabled. * * ERROR: kde-base/kdelibs-3.5.7-r2 failed. * Call stack: *   ebuild.sh, line 1654:   Called dyn_compile *   ebuild.sh, line 990:   Called qa_call 'src_compile' *   ebuild.sh, line 44:   Called src_compile *   kdelibs-3.5.7-r2.ebuild, line 150:   Called kde_src_compile *   kde.eclass, line 170:   Called kde_src_compile 'all' *   kde.eclass, line 340:   Called kde_src_compile 'myconf' 'configure' 'make' *   kde.eclass, line 336:   Called die * * died running emake, kde_src_compile:make * If you need support, post the topmost build error, and the call stack if relevant. * A complete build log is located at '/var/tmp/portage/kde-base/kdelibs-3.5.7-r2/temp/build.log'.