All pastes #674462 Raw Edit

rob

public text v1 · immutable
#674462 ·published 2007-08-29 08:37 UTC
rendered paste body
rob@linux-desktop:~/FlightGear-0.9/simgear$ make
Making all in simgear
make[1]: Entering directory `/home/rob/FlightGear-0.9/simgear/simgear'
make  all-recursive
make[2]: Entering directory `/home/rob/FlightGear-0.9/simgear/simgear'
Making all in xml
make[3]: Entering directory `/home/rob/FlightGear-0.9/simgear/simgear/xml'
g++ -DHAVE_CONFIG_H -I. -I../../simgear -I../..    -g -O2 -D_REENTRANT -MT easyxml.o -MD -MP -MF .deps/easyxml.Tpo -c -o easyxml.o easyxml.cxx
mv -f .deps/easyxml.Tpo .deps/easyxml.Po
gcc -DHAVE_CONFIG_H -I. -I../../simgear -I../..    -g -O2 -D_REENTRANT -MT hashtable.o -MD -MP -MF .deps/hashtable.Tpo -c -o hashtable.o hashtable.c
mv -f .deps/hashtable.Tpo .deps/hashtable.Po
gcc -DHAVE_CONFIG_H -I. -I../../simgear -I../..    -g -O2 -D_REENTRANT -MT xmlparse.o -MD -MP -MF .deps/xmlparse.Tpo -c -o xmlparse.o xmlparse.c
mv -f .deps/xmlparse.Tpo .deps/xmlparse.Po
gcc -DHAVE_CONFIG_H -I. -I../../simgear -I../..    -g -O2 -D_REENTRANT -MT xmlrole.o -MD -MP -MF .deps/xmlrole.Tpo -c -o xmlrole.o xmlrole.c
mv -f .deps/xmlrole.Tpo .deps/xmlrole.Po
gcc -DHAVE_CONFIG_H -I. -I../../simgear -I../..    -g -O2 -D_REENTRANT -MT xmltok.o -MD -MP -MF .deps/xmltok.Tpo -c -o xmltok.o xmltok.c
mv -f .deps/xmltok.Tpo .deps/xmltok.Po
rm -f libsgxml.a
ar cru libsgxml.a easyxml.o hashtable.o xmlparse.o xmlrole.o xmltok.o 
ranlib libsgxml.a
make[3]: Leaving directory `/home/rob/FlightGear-0.9/simgear/simgear/xml'
Making all in debug
make[3]: Entering directory `/home/rob/FlightGear-0.9/simgear/simgear/debug'
g++ -DHAVE_CONFIG_H -I. -I../../simgear -I../..    -g -O2 -D_REENTRANT -MT logstream.o -MD -MP -MF .deps/logstream.Tpo -c -o logstream.o logstream.cxx
mv -f .deps/logstream.Tpo .deps/logstream.Po
rm -f libsgdebug.a
ar cru libsgdebug.a logstream.o 
ranlib libsgdebug.a
make[3]: Leaving directory `/home/rob/FlightGear-0.9/simgear/simgear/debug'
Making all in misc
make[3]: Entering directory `/home/rob/FlightGear-0.9/simgear/simgear/misc'
g++ -DHAVE_CONFIG_H -I. -I../../simgear -I../..    -g -O2 -D_REENTRANT -MT sg_path.o -MD -MP -MF .deps/sg_path.Tpo -c -o sg_path.o sg_path.cxx
In file included from ../../simgear/math/point3d.hxx:54,
                 from ../../simgear/math/sg_types.hxx:41,
                 from sg_path.hxx:36,
                 from sg_path.cxx:35:
../../simgear/math/SGMath.hxx:25:18: error: osg/GL: No such file or directory
In file included from ../../simgear/math/SGMath.hxx:36,
                 from ../../simgear/math/point3d.hxx:54,
                 from ../../simgear/math/sg_types.hxx:41,
                 from sg_path.hxx:36,
                 from sg_path.cxx:35:
../../simgear/math/SGVec2.hxx:21:21: error: osg/Vec2f: No such file or directory
../../simgear/math/SGVec2.hxx:22:21: error: osg/Vec2d: No such file or directory
In file included from ../../simgear/math/SGMath.hxx:37,
                 from ../../simgear/math/point3d.hxx:54,
                 from ../../simgear/math/sg_types.hxx:41,
                 from sg_path.hxx:36,
                 from sg_path.cxx:35:
../../simgear/math/SGVec3.hxx:21:21: error: osg/Vec3f: No such file or directory
../../simgear/math/SGVec3.hxx:22:21: error: osg/Vec3d: No such file or directory
In file included from ../../simgear/math/SGMath.hxx:38,
                 from ../../simgear/math/point3d.hxx:54,
                 from ../../simgear/math/sg_types.hxx:41,
                 from sg_path.hxx:36,
                 from sg_path.cxx:35:
../../simgear/math/SGVec4.hxx:21:21: error: osg/Vec4f: No such file or directory
../../simgear/math/SGVec4.hxx:22:21: error: osg/Vec4d: No such file or directory
In file included from ../../simgear/math/SGMath.hxx:41,
                 from ../../simgear/math/point3d.hxx:54,
                 from ../../simgear/math/sg_types.hxx:41,
                 from sg_path.hxx:36,
                 from sg_path.cxx:35:
../../simgear/math/SGQuat.hxx:29:20: error: osg/Quat: No such file or directory
../../simgear/math/SGVec2.hxx:41: error: ‘osg’ has not been declared
../../simgear/math/SGVec2.hxx:41: error: expected `{' before ‘Vec2f’
../../simgear/math/SGVec2.hxx:41: error: invalid function declaration
../../simgear/math/SGVec2.hxx:56: error: ‘osg’ has not been declared
../../simgear/math/SGVec2.hxx:56: error: expected `{' before ‘Vec2d’
../../simgear/math/SGVec2.hxx:56: error: invalid function declaration
../../simgear/math/SGVec2.hxx:95: error: expected ‘,’ or ‘...’ before ‘::’ token
../../simgear/math/SGVec2.hxx:95: error: ISO C++ forbids declaration of ‘osg’ with no type
../../simgear/math/SGVec2.hxx:97: error: expected ‘,’ or ‘...’ before ‘::’ token
../../simgear/math/SGVec2.hxx:97: error: ISO C++ forbids declaration of ‘osg’ with no type
../../simgear/math/SGVec2.hxx: In constructor ‘SGVec2<T>::SGVec2(int)’:
../../simgear/math/SGVec2.hxx:96: error: ‘d’ was not declared in this scope
../../simgear/math/SGVec2.hxx: In constructor ‘SGVec2<T>::SGVec2(int)’:
../../simgear/math/SGVec2.hxx:98: error: ‘d’ was not declared in this scope
../../simgear/math/SGMathFwd.hxx: At global scope:
../../simgear/math/SGMathFwd.hxx: In instantiation of ‘SGVec2<float>’:
../../simgear/math/SGVec2.hxx:397:   instantiated from here
../../simgear/math/SGMathFwd.hxx:35: error: invalid use of undefined type ‘struct SGVec2Storage<float>’
../../simgear/math/SGVec2.hxx:25: error: declaration of ‘struct SGVec2Storage<float>’
../../simgear/math/SGVec2.hxx:97: error: ‘SGVec2<T>::SGVec2(int) [with T = float]’ cannot be overloaded
../../simgear/math/SGVec2.hxx:95: error: with ‘SGVec2<T>::SGVec2(int) [with T = float]’
../../simgear/math/SGVec2.hxx:128: error: type ‘SGVec2Storage<float>’ is not a base type for type ‘SGVec2<float>’
../../simgear/math/SGVec2.hxx:138: error: type ‘SGVec2Storage<float>’ is not a base type for type ‘SGVec2<float>’
../../simgear/math/SGMathFwd.hxx: In instantiation of ‘SGVec2<double>’:
../../simgear/math/SGVec2.hxx:398:   instantiated from here
../../simgear/math/SGMathFwd.hxx:35: error: invalid use of undefined type ‘struct SGVec2Storage<double>’
../../simgear/math/SGVec2.hxx:25: error: declaration of ‘struct SGVec2Storage<double>’
../../simgear/math/SGVec2.hxx:97: error: ‘SGVec2<T>::SGVec2(int) [with T = double]’ cannot be overloaded
../../simgear/math/SGVec2.hxx:95: error: with ‘SGVec2<T>::SGVec2(int) [with T = double]’
../../simgear/math/SGVec2.hxx:128: error: type ‘SGVec2Storage<double>’ is not a base type for type ‘SGVec2<double>’
../../simgear/math/SGVec2.hxx:138: error: type ‘SGVec2Storage<double>’ is not a base type for type ‘SGVec2<double>’
../../simgear/math/SGVec3.hxx:41: error: ‘osg’ has not been declared
../../simgear/math/SGVec3.hxx:41: error: expected `{' before ‘Vec3f’
../../simgear/math/SGVec3.hxx:41: error: invalid function declaration
../../simgear/math/SGVec3.hxx:56: error: ‘osg’ has not been declared
../../simgear/math/SGVec3.hxx:56: error: expected `{' before ‘Vec3d’
../../simgear/math/SGVec3.hxx:56: error: invalid function declaration
../../simgear/math/SGVec3.hxx:95: error: expected ‘,’ or ‘...’ before ‘::’ token
../../simgear/math/SGVec3.hxx:95: error: ISO C++ forbids declaration of ‘osg’ with no type
../../simgear/math/SGVec3.hxx:97: error: expected ‘,’ or ‘...’ before ‘::’ token
../../simgear/math/SGVec3.hxx:97: error: ISO C++ forbids declaration of ‘osg’ with no type
../../simgear/math/SGVec3.hxx: In constructor ‘SGVec3<T>::SGVec3(int)’:
../../simgear/math/SGVec3.hxx:96: error: ‘d’ was not declared in this scope
../../simgear/math/SGVec3.hxx: In constructor ‘SGVec3<T>::SGVec3(int)’:
../../simgear/math/SGVec3.hxx:98: error: ‘d’ was not declared in this scope
../../simgear/math/SGMathFwd.hxx: At global scope:
../../simgear/math/SGMathFwd.hxx: In instantiation of ‘SGVec3<double>’:
../../simgear/math/SGVec3.hxx:185:   instantiated from here
../../simgear/math/SGMathFwd.hxx:37: error: invalid use of undefined type ‘struct SGVec3Storage<double>’
../../simgear/math/SGVec3.hxx:25: error: declaration of ‘struct SGVec3Storage<double>’
../../simgear/math/SGVec3.hxx:97: error: ‘SGVec3<T>::SGVec3(int) [with T = double]’ cannot be overloaded
../../simgear/math/SGVec3.hxx:95: error: with ‘SGVec3<T>::SGVec3(int) [with T = double]’
../../simgear/math/SGVec3.hxx:136: error: type ‘SGVec3Storage<double>’ is not a base type for type ‘SGVec3<double>’
../../simgear/math/SGVec3.hxx:146: error: type ‘SGVec3Storage<double>’ is not a base type for type ‘SGVec3<double>’
../../simgear/math/SGMathFwd.hxx: In instantiation of ‘SGVec3<float>’:
../../simgear/math/SGVec3.hxx:195:   instantiated from here
../../simgear/math/SGMathFwd.hxx:37: error: invalid use of undefined type ‘struct SGVec3Storage<float>’
../../simgear/math/SGVec3.hxx:25: error: declaration of ‘struct SGVec3Storage<float>’
../../simgear/math/SGVec3.hxx:97: error: ‘SGVec3<T>::SGVec3(int) [with T = float]’ cannot be overloaded
../../simgear/math/SGVec3.hxx:95: error: with ‘SGVec3<T>::SGVec3(int) [with T = float]’
../../simgear/math/SGVec3.hxx:136: error: type ‘SGVec3Storage<float>’ is not a base type for type ‘SGVec3<float>’
../../simgear/math/SGVec3.hxx:146: error: type ‘SGVec3Storage<float>’ is not a base type for type ‘SGVec3<float>’
../../simgear/math/SGVec4.hxx:41: error: ‘osg’ has not been declared
../../simgear/math/SGVec4.hxx:41: error: expected `{' before ‘Vec4f’
../../simgear/math/SGVec4.hxx:41: error: invalid function declaration
../../simgear/math/SGVec4.hxx:56: error: ‘osg’ has not been declared
../../simgear/math/SGVec4.hxx:56: error: expected `{' before ‘Vec4d’
../../simgear/math/SGVec4.hxx:56: error: invalid function declaration
../../simgear/math/SGVec4.hxx:95: error: expected ‘,’ or ‘...’ before ‘::’ token
../../simgear/math/SGVec4.hxx:95: error: ISO C++ forbids declaration of ‘osg’ with no type
../../simgear/math/SGVec4.hxx:97: error: expected ‘,’ or ‘...’ before ‘::’ token
../../simgear/math/SGVec4.hxx:97: error: ISO C++ forbids declaration of ‘osg’ with no type
../../simgear/math/SGVec4.hxx: In constructor ‘SGVec4<T>::SGVec4(int)’:
../../simgear/math/SGVec4.hxx:96: error: ‘d’ was not declared in this scope
../../simgear/math/SGVec4.hxx: In constructor ‘SGVec4<T>::SGVec4(int)’:
../../simgear/math/SGVec4.hxx:98: error: ‘d’ was not declared in this scope
../../simgear/math/SGMathFwd.hxx: At global scope:
../../simgear/math/SGMathFwd.hxx: In instantiation of ‘SGVec4<float>’:
../../simgear/math/SGVec4.hxx:455:   instantiated from here
../../simgear/math/SGMathFwd.hxx:39: error: invalid use of undefined type ‘struct SGVec4Storage<float>’
../../simgear/math/SGVec4.hxx:25: error: declaration of ‘struct SGVec4Storage<float>’
../../simgear/math/SGVec4.hxx:97: error: ‘SGVec4<T>::SGVec4(int) [with T = float]’ cannot be overloaded
../../simgear/math/SGVec4.hxx:95: error: with ‘SGVec4<T>::SGVec4(int) [with T = float]’
../../simgear/math/SGVec4.hxx:143: error: type ‘SGVec4Storage<float>’ is not a base type for type ‘SGVec4<float>’
../../simgear/math/SGVec4.hxx:153: error: type ‘SGVec4Storage<float>’ is not a base type for type ‘SGVec4<float>’
../../simgear/math/SGMathFwd.hxx: In instantiation of ‘SGVec4<double>’:
../../simgear/math/SGVec4.hxx:456:   instantiated from here
../../simgear/math/SGMathFwd.hxx:39: error: invalid use of undefined type ‘struct SGVec4Storage<double>’
../../simgear/math/SGVec4.hxx:25: error: declaration of ‘struct SGVec4Storage<double>’
../../simgear/math/SGVec4.hxx:97: error: ‘SGVec4<T>::SGVec4(int) [with T = double]’ cannot be overloaded
../../simgear/math/SGVec4.hxx:95: error: with ‘SGVec4<T>::SGVec4(int) [with T = double]’
../../simgear/math/SGVec4.hxx:143: error: type ‘SGVec4Storage<double>’ is not a base type for type ‘SGVec4<double>’
../../simgear/math/SGVec4.hxx:153: error: type ‘SGVec4Storage<double>’ is not a base type for type ‘SGVec4<double>’
../../simgear/math/SGQuat.hxx:48: error: ‘osg’ has not been declared
../../simgear/math/SGQuat.hxx:48: error: expected `{' before ‘Quat’
../../simgear/math/SGQuat.hxx:48: error: invalid function declaration
../../simgear/math/SGQuat.hxx:87: error: expected ‘,’ or ‘...’ before ‘::’ token
../../simgear/math/SGQuat.hxx:87: error: ISO C++ forbids declaration of ‘osg’ with no type
../../simgear/math/SGQuat.hxx: In constructor ‘SGQuat<T>::SGQuat(int)’:
../../simgear/math/SGQuat.hxx:88: error: ‘d’ was not declared in this scope
../../simgear/math/SGMathFwd.hxx: At global scope:
../../simgear/math/SGMathFwd.hxx: In instantiation of ‘SGQuat<double>’:
../../simgear/math/SGQuat.hxx:786:   instantiated from here
../../simgear/math/SGMathFwd.hxx:33: error: invalid use of undefined type ‘struct SGQuatStorage<double>’
../../simgear/math/SGQuat.hxx:32: error: declaration of ‘struct SGQuatStorage<double>’
../../simgear/math/SGQuat.hxx:435: error: type ‘SGQuatStorage<double>’ is not a base type for type ‘SGQuat<double>’
../../simgear/math/SGQuat.hxx:445: error: type ‘SGQuatStorage<double>’ is not a base type for type ‘SGQuat<double>’
../../simgear/math/SGVec2.hxx: In member function ‘const T& SGVec2<T>::operator()(unsigned int) const [with T = double]’:
../../simgear/math/SGVec2.hxx:398:   instantiated from here
../../simgear/math/SGVec2.hxx:102: error: ‘data’ was not declared in this scope
../../simgear/math/SGVec2.hxx: In constructor ‘SGVec2<T>::SGVec2(T, T) [with T = float]’:
../../simgear/math/SGVec2.hxx:398:   instantiated from here
../../simgear/math/SGVec2.hxx:90: error: ‘data’ was not declared in this scope
../../simgear/math/SGVec2.hxx: In member function ‘const T& SGVec2<T>::operator()(unsigned int) const [with T = float]’:
../../simgear/math/SGVec2.hxx:403:   instantiated from here
../../simgear/math/SGVec2.hxx:102: error: ‘data’ was not declared in this scope
../../simgear/math/SGVec2.hxx: In constructor ‘SGVec2<T>::SGVec2(T, T) [with T = double]’:
../../simgear/math/SGVec2.hxx:403:   instantiated from here
../../simgear/math/SGVec2.hxx:90: error: ‘data’ was not declared in this scope
../../simgear/math/SGVec3.hxx: In constructor ‘SGVec3<T>::SGVec3() [with T = double]’:
../../simgear/math/SGVec3.hxx:187:   instantiated from here
../../simgear/math/SGVec3.hxx:85: error: ‘data’ was not declared in this scope
../../simgear/math/SGVec3.hxx: In member function ‘T& SGVec3<T>::operator()(unsigned int) [with T = double]’:
../../simgear/math/SGVec3.hxx:199:   instantiated from here
../../simgear/math/SGVec3.hxx:107: error: ‘data’ was not declared in this scope
../../simgear/math/SGVec3.hxx: In constructor ‘SGVec3<T>::SGVec3(T, T, T) [with T = float]’:
../../simgear/math/SGVec3.hxx:199:   instantiated from here
../../simgear/math/SGVec3.hxx:90: error: ‘data’ was not declared in this scope
../../simgear/math/SGVec3.hxx: In member function ‘const T& SGVec3<T>::operator()(unsigned int) const [with T = double]’:
../../simgear/math/SGVec3.hxx:520:   instantiated from here
../../simgear/math/SGVec3.hxx:104: error: ‘data’ was not declared in this scope
../../simgear/math/SGVec3.hxx: In member function ‘const T& SGVec3<T>::operator()(unsigned int) const [with T = float]’:
../../simgear/math/SGVec3.hxx:525:   instantiated from here
../../simgear/math/SGVec3.hxx:104: error: ‘data’ was not declared in this scope
../../simgear/math/SGVec3.hxx: In constructor ‘SGVec3<T>::SGVec3(T, T, T) [with T = double]’:
../../simgear/math/SGVec3.hxx:525:   instantiated from here
../../simgear/math/SGVec3.hxx:90: error: ‘data’ was not declared in this scope
../../simgear/math/SGVec4.hxx: In member function ‘const T& SGVec4<T>::operator()(unsigned int) const [with T = double]’:
../../simgear/math/SGVec4.hxx:456:   instantiated from here
../../simgear/math/SGVec4.hxx:105: error: ‘data’ was not declared in this scope
../../simgear/math/SGVec4.hxx: In constructor ‘SGVec4<T>::SGVec4(T, T, T, T) [with T = float]’:
../../simgear/math/SGVec4.hxx:456:   instantiated from here
../../simgear/math/SGVec4.hxx:90: error: ‘data’ was not declared in this scope
../../simgear/math/SGVec4.hxx: In member function ‘const T& SGVec4<T>::operator()(unsigned int) const [with T = float]’:
../../simgear/math/SGVec4.hxx:461:   instantiated from here
../../simgear/math/SGVec4.hxx:105: error: ‘data’ was not declared in this scope
../../simgear/math/SGVec4.hxx: In constructor ‘SGVec4<T>::SGVec4(T, T, T, T) [with T = double]’:
../../simgear/math/SGVec4.hxx:461:   instantiated from here
../../simgear/math/SGVec4.hxx:90: error: ‘data’ was not declared in this scope
../../simgear/math/SGQuat.hxx: In member function ‘const T& SGQuat<T>::operator()(unsigned int) const [with T = double]’:
../../simgear/math/SGQuat.hxx:786:   instantiated from here
../../simgear/math/SGQuat.hxx:397: error: ‘data’ was not declared in this scope
../../simgear/math/SGVec3.hxx: In member function ‘const T& SGVec3<T>::x() const [with T = double]’:
../../simgear/math/point3d.hxx:242:   instantiated from here
../../simgear/math/SGVec3.hxx:118: error: ‘data’ was not declared in this scope
../../simgear/math/SGVec3.hxx: In member function ‘const T& SGVec3<T>::y() const [with T = double]’:
../../simgear/math/point3d.hxx:243:   instantiated from here
../../simgear/math/SGVec3.hxx:124: error: ‘data’ was not declared in this scope
../../simgear/math/SGVec3.hxx: In member function ‘const T& SGVec3<T>::z() const [with T = double]’:
../../simgear/math/point3d.hxx:244:   instantiated from here
../../simgear/math/SGVec3.hxx:130: error: ‘data’ was not declared in this scope
../../simgear/math/SGVec3.hxx: In member function ‘const T& SGVec3<T>::x() const [with T = float]’:
../../simgear/math/point3d.hxx:251:   instantiated from here
../../simgear/math/SGVec3.hxx:118: error: ‘data’ was not declared in this scope
../../simgear/math/SGVec3.hxx: In member function ‘const T& SGVec3<T>::y() const [with T = float]’:
../../simgear/math/point3d.hxx:252:   instantiated from here
../../simgear/math/SGVec3.hxx:124: error: ‘data’ was not declared in this scope
../../simgear/math/SGVec3.hxx: In member function ‘const T& SGVec3<T>::z() const [with T = float]’:
../../simgear/math/point3d.hxx:253:   instantiated from here
../../simgear/math/SGVec3.hxx:130: error: ‘data’ was not declared in this scope
../../simgear/math/SGVec2.hxx: In member function ‘const T& SGVec2<T>::x() const [with T = double]’:
../../simgear/math/point3d.hxx:260:   instantiated from here
../../simgear/math/SGVec2.hxx:116: error: ‘data’ was not declared in this scope
../../simgear/math/SGVec2.hxx: In member function ‘const T& SGVec2<T>::y() const [with T = double]’:
../../simgear/math/point3d.hxx:261:   instantiated from here
../../simgear/math/SGVec2.hxx:122: error: ‘data’ was not declared in this scope
../../simgear/math/SGQuat.hxx: In member function ‘T& SGQuat<T>::x() [with T = double]’:
../../simgear/math/SGQuat.hxx:82:   instantiated from ‘SGQuat<T>::SGQuat(T, T, T, T) [with T = double]’
../../simgear/math/SGQuat.hxx:791:   instantiated from here
../../simgear/math/SGQuat.hxx:414: error: ‘data’ was not declared in this scope
../../simgear/math/SGQuat.hxx: In member function ‘T& SGQuat<T>::y() [with T = double]’:
../../simgear/math/SGQuat.hxx:82:   instantiated from ‘SGQuat<T>::SGQuat(T, T, T, T) [with T = double]’
../../simgear/math/SGQuat.hxx:791:   instantiated from here
../../simgear/math/SGQuat.hxx:420: error: ‘data’ was not declared in this scope
../../simgear/math/SGQuat.hxx: In member function ‘T& SGQuat<T>::z() [with T = double]’:
../../simgear/math/SGQuat.hxx:82:   instantiated from ‘SGQuat<T>::SGQuat(T, T, T, T) [with T = double]’
../../simgear/math/SGQuat.hxx:791:   instantiated from here
../../simgear/math/SGQuat.hxx:426: error: ‘data’ was not declared in this scope
../../simgear/math/SGQuat.hxx: In member function ‘T& SGQuat<T>::w() [with T = double]’:
../../simgear/math/SGQuat.hxx:82:   instantiated from ‘SGQuat<T>::SGQuat(T, T, T, T) [with T = double]’
../../simgear/math/SGQuat.hxx:791:   instantiated from here
../../simgear/math/SGQuat.hxx:432: error: ‘data’ was not declared in this scope
make[3]: *** [sg_path.o] Error 1
make[3]: Leaving directory `/home/rob/FlightGear-0.9/simgear/simgear/misc'
make[2]: *** [all-recursive] Error 1
make[2]: Leaving directory `/home/rob/FlightGear-0.9/simgear/simgear'
make[1]: *** [all] Error 2
make[1]: Leaving directory `/home/rob/FlightGear-0.9/simgear/simgear'
make: *** [all-recursive] Error 1
rob@linux-desktop:~/FlightGear-0.9/simgear$