All pastes #674149 Raw Edit

Vermischtes

public text v1 · immutable
#674149 ·published 2007-08-28 23:18 UTC
rendered paste body
if /bin/sh ../libtool --tag=CC --mode=compile gcc -DHAVE_CONFIG_H -include ../include/confdefs.h -I. -I. -I../include    -fomit-frame-pointer -D_REENTRANT -Wall -Wstrict-prototypes -Wmissing-prototypes -Wmissing-declarations -I.. -I../include  -g -O2 -I/usr/include/openssl -DHAVE_SSL  -g -O2 -MT libcallweaver_la-db.lo -MD -MP -MF ".deps/libcallweaver_la-db.Tpo" -c -o libcallweaver_la-db.lo `test -f 'db.c' || echo './'`db.c; \
then mv -f ".deps/libcallweaver_la-db.Tpo" ".deps/libcallweaver_la-db.Plo"; else rm -f ".deps/libcallweaver_la-db.Tpo"; exit 1; fi
 gcc -DHAVE_CONFIG_H -include ../include/confdefs.h -I. -I. -I../include -fomit-frame-pointer -D_REENTRANT -Wall -Wstrict-prototypes -Wmissing-prototypes -Wmissing-declarations -I.. -I../include -g -O2 -I/usr/include/openssl -DHAVE_SSL -g -O2 -MT libcallweaver_la-db.lo -MD -MP -MF .deps/libcallweaver_la-db.Tpo -c db.c  -fPIC -DPIC -o .libs/libcallweaver_la-db.o
db.c:58:21: error: sqlite3.h: No such file or directory
db.c:92: error: expected '=', ',', ';', 'asm' or '__attribute__' before '*' token
db.c: In function 'dbinit':
db.c:123: warning: implicit declaration of function 'sqlite3_mprintf'
db.c:123: warning: assignment makes pointer from integer without a cast
db.c:125: warning: implicit declaration of function 'sqlite3_free'
db.c: At top level:
db.c:146: error: expected '=', ',', ';', 'asm' or '__attribute__' before '*' token
db.c: In function 'sqlite_check_table_exists':
db.c:163: error: 'sqlite3' undeclared (first use in this function)
db.c:163: error: (Each undeclared identifier is reported only once
db.c:163: error: for each function it appears in.)
db.c:163: error: 'db' undeclared (first use in this function)
db.c:167: warning: implicit declaration of function 'sqlite_open_db'
db.c:169: warning: implicit declaration of function 'sqlite3_exec'
db.c:194: warning: implicit declaration of function 'sqlite3_close'
db.c: In function 'opbx_db_put':
db.c:205: error: 'sqlite3' undeclared (first use in this function)
db.c:205: error: 'db' undeclared (first use in this function)
db.c:218: warning: assignment makes pointer from integer without a cast
db.c: In function 'opbx_db_get':
db.c:264: error: 'sqlite3' undeclared (first use in this function)
db.c:264: error: 'db' undeclared (first use in this function)
db.c:281: warning: assignment makes pointer from integer without a cast
db.c: In function 'opbx_db_del_main':
db.c:325: error: 'sqlite3' undeclared (first use in this function)
db.c:325: error: 'db' undeclared (first use in this function)
db.c:346: warning: assignment makes pointer from integer without a cast
db.c:348: warning: assignment makes pointer from integer without a cast
db.c:350: warning: assignment makes pointer from integer without a cast
db.c:352: warning: assignment makes pointer from integer without a cast
db.c:379: warning: implicit declaration of function 'sqlite3_changes'
db.c: In function 'opbx_db_gettree':
db.c:448: error: 'sqlite3' undeclared (first use in this function)
db.c:448: error: 'db' undeclared (first use in this function)
db.c:461: warning: assignment makes pointer from integer without a cast
db.c:463: warning: assignment makes pointer from integer without a cast
db.c: In function 'database_show':
db.c:538: error: 'sqlite3' undeclared (first use in this function)
db.c:538: error: 'db' undeclared (first use in this function)
db.c:561: warning: assignment makes pointer from integer without a cast
db.c:563: warning: assignment makes pointer from integer without a cast
db.c:565: warning: assignment makes pointer from integer without a cast
make[3]: *** [libcallweaver_la-db.lo] Fehler 1
make[3]: Leaving directory `/usr/src/callweaver-svn/corelib'
make[2]: *** [all-recursive] Fehler 1
make[2]: Leaving directory `/usr/src/callweaver-svn/corelib'
make[1]: *** [all] Fehler 2
make[1]: Leaving directory `/usr/src/callweaver-svn/corelib'
make: *** [all-recursive] Fehler 1