All pastes #67405 Raw Edit

Anonymous

public text v1 · immutable
#67405 ·published 2006-06-19 22:00 UTC
rendered paste body
In file included from /usr/include/bits/string2.h:8,
                 from /usr/include/gentoo-multilib/amd64/string.h:417,
                 from /usr/include/string.h:8,
                 from example.c:12:
/usr/include/gentoo-multilib/amd64/bits/string2.h:394: error: storage class specified for parameter `__rawmemchr'
/usr/include/gentoo-multilib/amd64/bits/string2.h:969: error: storage class specified for parameter `__strcspn_c1'
/usr/include/gentoo-multilib/amd64/bits/string2.h:972: error: storage class specified for parameter `__strcspn_c1'
/usr/include/gentoo-multilib/amd64/bits/string2.h:972: error: redefinition of parameter '__strcspn_c1'
/usr/include/gentoo-multilib/amd64/bits/string2.h:969: error: previous definition of '__strcspn_c1' was here
/usr/include/gentoo-multilib/amd64/bits/string2.h:972: error: syntax error before '{' token
/usr/include/gentoo-multilib/amd64/bits/string2.h:983: error: storage class specified for parameter `__strcspn_c2'
/usr/include/gentoo-multilib/amd64/bits/string2.h:983: error: syntax error before '{' token
/usr/include/gentoo-multilib/amd64/bits/string2.h:996: error: storage class specified for parameter `__strcspn_c3'
/usr/include/gentoo-multilib/amd64/bits/string2.h:996: error: syntax error before '{' token
/usr/include/gentoo-multilib/amd64/bits/string2.h:1048: error: storage class specified for parameter `__strspn_c1'
/usr/include/gentoo-multilib/amd64/bits/string2.h:1048: error: syntax error before '{' token
/usr/include/gentoo-multilib/amd64/bits/string2.h:1060: error: storage class specified for parameter `__strspn_c2'
/usr/include/gentoo-multilib/amd64/bits/string2.h:1060: error: syntax error before '{' token
/usr/include/gentoo-multilib/amd64/bits/string2.h:1072: error: storage class specified for parameter `__strspn_c3'
/usr/include/gentoo-multilib/amd64/bits/string2.h:1072: error: syntax error before '{' token
/usr/include/gentoo-multilib/amd64/bits/string2.h:1125: error: storage class specified for parameter `__strpbrk_c2'
/usr/include/gentoo-multilib/amd64/bits/string2.h:1125: error: syntax error before '{' token
/usr/include/gentoo-multilib/amd64/bits/string2.h:1137: error: storage class specified for parameter `__strpbrk_c3'
/usr/include/gentoo-multilib/amd64/bits/string2.h:1137: error: syntax error before '{' token
/usr/include/gentoo-multilib/amd64/bits/string2.h:1176: error: storage class specified for parameter `__strtok_r_1c'
/usr/include/gentoo-multilib/amd64/bits/string2.h:1176: error: syntax error before '{' token
/usr/include/gentoo-multilib/amd64/bits/string2.h:1223: error: storage class specified for parameter `__strsep_1c'
/usr/include/gentoo-multilib/amd64/bits/string2.h:1226: error: storage class specified for parameter `__strsep_1c'
/usr/include/gentoo-multilib/amd64/bits/string2.h:1226: error: redefinition of parameter '__strsep_1c'
/usr/include/gentoo-multilib/amd64/bits/string2.h:1223: error: previous definition of '__strsep_1c' was here
/usr/include/gentoo-multilib/amd64/bits/string2.h:1226: error: syntax error before '{' token
/usr/include/gentoo-multilib/amd64/bits/string2.h:1236: error: storage class specified for parameter `__strsep_2c'
/usr/include/gentoo-multilib/amd64/bits/string2.h:1236: error: syntax error before '{' token
/usr/include/gentoo-multilib/amd64/bits/string2.h:1264: error: storage class specified for parameter `__strsep_3c'
/usr/include/gentoo-multilib/amd64/bits/string2.h:1264: error: syntax error before '{' token
In file included from /usr/include/stdlib.h:8,
                 from /usr/include/gentoo-multilib/amd64/bits/string2.h:1299,
                 from /usr/include/bits/string2.h:8,
                 from /usr/include/gentoo-multilib/amd64/string.h:417,
                 from /usr/include/string.h:8,
                 from example.c:12:
/usr/include/gentoo-multilib/amd64/stdlib.h:592: error: storage class specified for parameter `calloc'
/usr/include/gentoo-multilib/amd64/stdlib.h:592: error: syntax error before "__THROW"
In file included from /usr/include/bits/string2.h:8,
                 from /usr/include/gentoo-multilib/amd64/string.h:417,
                 from /usr/include/string.h:8,
                 from example.c:12:
/usr/include/gentoo-multilib/amd64/bits/string2.h:1324: error: storage class specified for parameter `__strndup'
/usr/include/gentoo-multilib/amd64/bits/string2.h:1324: error: syntax error before "__THROW"
In file included from /usr/include/stdlib.h:8,
                 from example.c:13:
/usr/include/gentoo-multilib/amd64/stdlib.h:102: error: syntax error before '}' token
/usr/include/gentoo-multilib/amd64/stdlib.h:110: error: storage class specified for parameter `ldiv_t'
/usr/include/gentoo-multilib/amd64/stdlib.h:113: error: syntax error before "__END_NAMESPACE_STD"
/usr/include/gentoo-multilib/amd64/stdlib.h:149: error: storage class specified for parameter `atoi'
/usr/include/gentoo-multilib/amd64/stdlib.h:149: error: syntax error before "__THROW"
/usr/include/gentoo-multilib/amd64/stdlib.h:152: error: storage class specified for parameter `atol'
/usr/include/gentoo-multilib/amd64/stdlib.h:152: error: syntax error before "__THROW"
/usr/include/gentoo-multilib/amd64/stdlib.h:190: error: storage class specified for parameter `strtoul'
/usr/include/gentoo-multilib/amd64/stdlib.h:190: error: syntax error before "__THROW"
/usr/include/gentoo-multilib/amd64/stdlib.h:284: error: storage class specified for parameter `__strtof_internal'
/usr/include/gentoo-multilib/amd64/stdlib.h:284: error: syntax error before "__THROW"
/usr/include/gentoo-multilib/amd64/stdlib.h:288: error: storage class specified for parameter `__strtold_internal'
/usr/include/gentoo-multilib/amd64/stdlib.h:288: error: syntax error before "__THROW"
/usr/include/gentoo-multilib/amd64/stdlib.h:293: error: storage class specified for parameter `__strtol_internal'
/usr/include/gentoo-multilib/amd64/stdlib.h:293: error: syntax error before "__THROW"
/usr/include/gentoo-multilib/amd64/stdlib.h:300: error: storage class specified for parameter `__strtoul_internal'
/usr/include/gentoo-multilib/amd64/stdlib.h:300: error: syntax error before "__THROW"
/usr/include/gentoo-multilib/amd64/stdlib.h:433: error: storage class specified for parameter `a64l'
/usr/include/gentoo-multilib/amd64/stdlib.h:433: error: syntax error before "__THROW"
In file included from /usr/include/stdlib.h:8,
                 from example.c:13:
/usr/include/gentoo-multilib/amd64/stdlib.h:438:49: sys/types.h: No such file or directory
/usr/include/gentoo-multilib/amd64/stdlib.h:445: error: storage class specified for parameter `random'
/usr/include/gentoo-multilib/amd64/stdlib.h:445: error: syntax error before "__THROW"
/usr/include/gentoo-multilib/amd64/stdlib.h:448: error: storage class specified for parameter `srandom'
/usr/include/gentoo-multilib/amd64/stdlib.h:448: error: syntax error before "__THROW"
/usr/include/gentoo-multilib/amd64/stdlib.h:455: error: storage class specified for parameter `initstate'
/usr/include/gentoo-multilib/amd64/stdlib.h:455: error: syntax error before "__THROW"
/usr/include/gentoo-multilib/amd64/stdlib.h:459: error: storage class specified for parameter `setstate'
/usr/include/gentoo-multilib/amd64/stdlib.h:459: error: syntax error before "__THROW"
/usr/include/gentoo-multilib/amd64/stdlib.h:469: error: syntax error before "int32_t"
/usr/include/gentoo-multilib/amd64/stdlib.h:475: error: syntax error before "int32_t"
/usr/include/gentoo-multilib/amd64/stdlib.h:479: error: syntax error before "int32_t"
/usr/include/gentoo-multilib/amd64/stdlib.h:479: error: storage class specified for parameter `random_r'
/usr/include/gentoo-multilib/amd64/stdlib.h:482: error: storage class specified for parameter `srandom_r'
/usr/include/gentoo-multilib/amd64/stdlib.h:482: error: syntax error before "__THROW"
/usr/include/gentoo-multilib/amd64/stdlib.h:487: error: storage class specified for parameter `initstate_r'
/usr/include/gentoo-multilib/amd64/stdlib.h:487: error: syntax error before "__THROW"
/usr/include/gentoo-multilib/amd64/stdlib.h:491: error: storage class specified for parameter `setstate_r'
/usr/include/gentoo-multilib/amd64/stdlib.h:491: error: syntax error before "__THROW"
/usr/include/gentoo-multilib/amd64/stdlib.h:500: error: storage class specified for parameter `srand'
/usr/include/gentoo-multilib/amd64/stdlib.h:500: error: syntax error before "__THROW"
/usr/include/gentoo-multilib/amd64/stdlib.h:513: error: storage class specified for parameter `drand48'
/usr/include/gentoo-multilib/amd64/stdlib.h:513: error: syntax error before "__THROW"
/usr/include/gentoo-multilib/amd64/stdlib.h:514: error: storage class specified for parameter `erand48'
/usr/include/gentoo-multilib/amd64/stdlib.h:514: error: syntax error before "__THROW"
/usr/include/gentoo-multilib/amd64/stdlib.h:517: error: storage class specified for parameter `lrand48'
/usr/include/gentoo-multilib/amd64/stdlib.h:517: error: syntax error before "__THROW"
/usr/include/gentoo-multilib/amd64/stdlib.h:519: error: storage class specified for parameter `nrand48'
/usr/include/gentoo-multilib/amd64/stdlib.h:519: error: syntax error before "__THROW"
/usr/include/gentoo-multilib/amd64/stdlib.h:522: error: storage class specified for parameter `mrand48'
/usr/include/gentoo-multilib/amd64/stdlib.h:522: error: syntax error before "__THROW"
/usr/include/gentoo-multilib/amd64/stdlib.h:524: error: storage class specified for parameter `jrand48'
/usr/include/gentoo-multilib/amd64/stdlib.h:524: error: syntax error before "__THROW"
/usr/include/gentoo-multilib/amd64/stdlib.h:527: error: storage class specified for parameter `srand48'
/usr/include/gentoo-multilib/amd64/stdlib.h:527: error: syntax error before "__THROW"
/usr/include/gentoo-multilib/amd64/stdlib.h:529: error: storage class specified for parameter `seed48'
/usr/include/gentoo-multilib/amd64/stdlib.h:529: error: syntax error before "__THROW"
/usr/include/gentoo-multilib/amd64/stdlib.h:530: error: storage class specified for parameter `lcong48'
/usr/include/gentoo-multilib/amd64/stdlib.h:530: error: syntax error before "__THROW"
/usr/include/gentoo-multilib/amd64/stdlib.h:547: error: storage class specified for parameter `drand48_r'
/usr/include/gentoo-multilib/amd64/stdlib.h:547: error: syntax error before "__THROW"
/usr/include/gentoo-multilib/amd64/stdlib.h:550: error: storage class specified for parameter `erand48_r'
/usr/include/gentoo-multilib/amd64/stdlib.h:550: error: syntax error before "__THROW"
/usr/include/gentoo-multilib/amd64/stdlib.h:555: error: storage class specified for parameter `lrand48_r'
/usr/include/gentoo-multilib/amd64/stdlib.h:555: error: syntax error before "__THROW"
/usr/include/gentoo-multilib/amd64/stdlib.h:559: error: storage class specified for parameter `nrand48_r'
/usr/include/gentoo-multilib/amd64/stdlib.h:559: error: syntax error before "__THROW"
/usr/include/gentoo-multilib/amd64/stdlib.h:564: error: storage class specified for parameter `mrand48_r'
/usr/include/gentoo-multilib/amd64/stdlib.h:564: error: syntax error before "__THROW"
/usr/include/gentoo-multilib/amd64/stdlib.h:568: error: storage class specified for parameter `jrand48_r'
/usr/include/gentoo-multilib/amd64/stdlib.h:568: error: syntax error before "__THROW"
/usr/include/gentoo-multilib/amd64/stdlib.h:572: error: storage class specified for parameter `srand48_r'
/usr/include/gentoo-multilib/amd64/stdlib.h:572: error: syntax error before "__THROW"
/usr/include/gentoo-multilib/amd64/stdlib.h:575: error: storage class specified for parameter `seed48_r'
/usr/include/gentoo-multilib/amd64/stdlib.h:575: error: syntax error before "__THROW"
/usr/include/gentoo-multilib/amd64/stdlib.h:579: error: storage class specified for parameter `lcong48_r'
/usr/include/gentoo-multilib/amd64/stdlib.h:579: error: syntax error before "__THROW"
/usr/include/gentoo-multilib/amd64/stdlib.h:603: error: storage class specified for parameter `free'
/usr/include/gentoo-multilib/amd64/stdlib.h:603: error: syntax error before "__THROW"
In file included from /usr/include/stdlib.h:8,
                 from example.c:13:
/usr/include/gentoo-multilib/amd64/stdlib.h:623: error: storage class specified for parameter `posix_memalign'
/usr/include/gentoo-multilib/amd64/stdlib.h:623: error: syntax error before "__THROW"
/usr/include/gentoo-multilib/amd64/stdlib.h:632: error: storage class specified for parameter `atexit'
/usr/include/gentoo-multilib/amd64/stdlib.h:632: error: syntax error before "__THROW"
/usr/include/gentoo-multilib/amd64/stdlib.h:672: error: storage class specified for parameter `putenv'
/usr/include/gentoo-multilib/amd64/stdlib.h:672: error: syntax error before "__THROW"
/usr/include/gentoo-multilib/amd64/stdlib.h:679: error: storage class specified for parameter `setenv'
/usr/include/gentoo-multilib/amd64/stdlib.h:679: error: syntax error before "__THROW"
/usr/include/gentoo-multilib/amd64/stdlib.h:682: error: storage class specified for parameter `unsetenv'
/usr/include/gentoo-multilib/amd64/stdlib.h:682: error: syntax error before "__THROW"
/usr/include/gentoo-multilib/amd64/stdlib.h:689: error: storage class specified for parameter `clearenv'
/usr/include/gentoo-multilib/amd64/stdlib.h:689: error: syntax error before "__THROW"
/usr/include/gentoo-multilib/amd64/stdlib.h:698: error: storage class specified for parameter `mktemp'
/usr/include/gentoo-multilib/amd64/stdlib.h:698: error: syntax error before "__THROW"
/usr/include/gentoo-multilib/amd64/stdlib.h:709: error: storage class specified for parameter `mkstemp'
/usr/include/gentoo-multilib/amd64/stdlib.h:709: error: syntax error before "__nonnull"
/usr/include/gentoo-multilib/amd64/stdlib.h:729: error: storage class specified for parameter `mkdtemp'
/usr/include/gentoo-multilib/amd64/stdlib.h:729: error: syntax error before "__THROW"
/usr/include/gentoo-multilib/amd64/stdlib.h:765: error: storage class specified for parameter `__compar_fn_t'
/usr/include/gentoo-multilib/amd64/stdlib.h:772: error: syntax error before "__BEGIN_NAMESPACE_STD"
/usr/include/gentoo-multilib/amd64/stdlib.h:782: error: syntax error before "__compar_fn_t"
/usr/include/gentoo-multilib/amd64/stdlib.h:782: error: storage class specified for parameter `qsort'
/usr/include/gentoo-multilib/amd64/stdlib.h:786: error: storage class specified for parameter `abs'
/usr/include/gentoo-multilib/amd64/stdlib.h:786: error: syntax error before "__THROW"
/usr/include/gentoo-multilib/amd64/stdlib.h:787: error: storage class specified for parameter `labs'
/usr/include/gentoo-multilib/amd64/stdlib.h:787: error: syntax error before "__THROW"
/usr/include/gentoo-multilib/amd64/stdlib.h:802: error: storage class specified for parameter `ldiv_t'
/usr/include/gentoo-multilib/amd64/stdlib.h:802: error: conflicting types for 'ldiv_t'
/usr/include/gentoo-multilib/amd64/stdlib.h:110: error: previous definition of 'ldiv_t' was here
/usr/include/gentoo-multilib/amd64/stdlib.h:802: error: syntax error before "ldiv"
/usr/include/gentoo-multilib/amd64/stdlib.h:829: error: storage class specified for parameter `fcvt'
/usr/include/gentoo-multilib/amd64/stdlib.h:829: error: syntax error before "__THROW"
/usr/include/gentoo-multilib/amd64/stdlib.h:835: error: storage class specified for parameter `gcvt'
/usr/include/gentoo-multilib/amd64/stdlib.h:835: error: syntax error before "__THROW"
/usr/include/gentoo-multilib/amd64/stdlib.h:842: error: storage class specified for parameter `qecvt'
/usr/include/gentoo-multilib/amd64/stdlib.h:842: error: syntax error before "__THROW"
/usr/include/gentoo-multilib/amd64/stdlib.h:845: error: storage class specified for parameter `qfcvt'
/usr/include/gentoo-multilib/amd64/stdlib.h:845: error: syntax error before "__THROW"
/usr/include/gentoo-multilib/amd64/stdlib.h:847: error: storage class specified for parameter `qgcvt'
/usr/include/gentoo-multilib/amd64/stdlib.h:847: error: syntax error before "__THROW"
/usr/include/gentoo-multilib/amd64/stdlib.h:854: error: storage class specified for parameter `ecvt_r'
/usr/include/gentoo-multilib/amd64/stdlib.h:854: error: syntax error before "__THROW"
/usr/include/gentoo-multilib/amd64/stdlib.h:857: error: storage class specified for parameter `fcvt_r'
/usr/include/gentoo-multilib/amd64/stdlib.h:857: error: syntax error before "__THROW"
/usr/include/gentoo-multilib/amd64/stdlib.h:862: error: storage class specified for parameter `qecvt_r'
/usr/include/gentoo-multilib/amd64/stdlib.h:862: error: syntax error before "__THROW"
/usr/include/gentoo-multilib/amd64/stdlib.h:866: error: storage class specified for parameter `qfcvt_r'
/usr/include/gentoo-multilib/amd64/stdlib.h:866: error: syntax error before "__THROW"
/usr/include/gentoo-multilib/amd64/stdlib.h:877: error: syntax error before '*' token
/usr/include/gentoo-multilib/amd64/stdlib.h:878: error: storage class specified for parameter `mbtowc'
/usr/include/gentoo-multilib/amd64/stdlib.h:881: error: syntax error before "wchar_t"
/usr/include/gentoo-multilib/amd64/stdlib.h:881: error: storage class specified for parameter `wctomb'
/usr/include/gentoo-multilib/amd64/stdlib.h:885: error: syntax error before '*' token
/usr/include/gentoo-multilib/amd64/stdlib.h:886: error: storage class specified for parameter `mbstowcs'
/usr/include/gentoo-multilib/amd64/stdlib.h:889: error: syntax error before '*' token
/usr/include/gentoo-multilib/amd64/stdlib.h:890: error: storage class specified for parameter `wcstombs'
/usr/include/gentoo-multilib/amd64/stdlib.h:927: error: storage class specified for parameter `posix_openpt'
/usr/include/gentoo-multilib/amd64/stdlib.h:927: error: syntax error before "__wur"
/usr/include/gentoo-multilib/amd64/stdlib.h:963: error: storage class specified for parameter `getloadavg'
/usr/include/gentoo-multilib/amd64/stdlib.h:963: error: syntax error before "__THROW"
example.c:34: error: parameter `dictionary' is initialized
example.c:35: error: syntax error before "uLong"
example.c:37: error: syntax error before '*' token
example.c:39: error: syntax error before "Byte"
example.c:41: error: syntax error before '*' token
example.c:42: error: syntax error before '*' token
example.c:44: error: syntax error before '*' token
example.c:46: error: syntax error before '*' token
example.c:48: error: syntax error before '*' token
example.c:49: error: syntax error before '*' token
example.c:51: error: syntax error before '*' token
example.c:52: error: syntax error before '*' token
example.c:60: warning: parameter names (without types) in function declaration
example.c:60: error: redefinition of parameter 'test_compress'
example.c:37: error: previous definition of 'test_compress' was here
example.c:60: error: syntax error before "Byte"
example.c:62: error: old-style parameter declarations in prototyped function definition
/usr/include/gentoo-multilib/amd64/stdio.h:51: error: parameter name omitted
example.c:64: error: `uLong' undeclared (first use in this function)
example.c:64: error: (Each undeclared identifier is reported only once
example.c:64: error: for each function it appears in.)
example.c:64: error: syntax error before "len"
example.c:66: error: `compr' undeclared (first use in this function)
example.c:66: error: `comprLen' undeclared (first use in this function)
example.c:66: error: syntax error before "Bytef"
example.c:67: error: `stderr' undeclared (first use in this function)
example.c:69: error: `uncompr' undeclared (first use in this function)
example.c:71: error: `uncomprLen' undeclared (first use in this function)
example.c:74: error: `hello' undeclared (first use in this function)
example.c: In function `test_gzio':
example.c:87: error: syntax error before "Byte"
example.c:94: error: `hello' undeclared (first use in this function)
example.c:95: error: `gzFile' undeclared (first use in this function)
example.c:95: error: syntax error before "file"
example.c:98: error: `file' undeclared (first use in this function)
example.c:100: error: `stderr' undeclared (first use in this function)
example.c:120: warning: cast to pointer from integer of different size
example.c:126: warning: cast to pointer from integer of different size
example.c:126: warning: cast to pointer from integer of different size
example.c:126: warning: cast to pointer from integer of different size
example.c:126: warning: cast to pointer from integer of different size
example.c:126: warning: cast to pointer from integer of different size
example.c:126: warning: cast to pointer from integer of different size
example.c:126: warning: cast to pointer from integer of different size
example.c:126: warning: cast to pointer from integer of different size
example.c:126: warning: cast to pointer from integer of different size
example.c:126: warning: cast to pointer from integer of different size
example.c:126: warning: cast to pointer from integer of different size
example.c:126: warning: cast to pointer from integer of different size
example.c:126: warning: cast to pointer from integer of different size
example.c:126: warning: cast to pointer from integer of different size
example.c:126: warning: cast to pointer from integer of different size
example.c:126: warning: cast to pointer from integer of different size
example.c:126: warning: cast to pointer from integer of different size
example.c:126: warning: cast to pointer from integer of different size
example.c:126: warning: cast to pointer from integer of different size
example.c:126: warning: cast to pointer from integer of different size
example.c:127: warning: cast to pointer from integer of different size
example.c:130: warning: cast to pointer from integer of different size
example.c:150: warning: cast to pointer from integer of different size
example.c:151: warning: cast to pointer from integer of different size
example.c:155: warning: cast to pointer from integer of different size
example.c:155: warning: cast to pointer from integer of different size
example.c:155: warning: cast to pointer from integer of different size
example.c:155: warning: cast to pointer from integer of different size
example.c:155: warning: cast to pointer from integer of different size
example.c:155: warning: cast to pointer from integer of different size
example.c:155: warning: cast to pointer from integer of different size
example.c:155: warning: cast to pointer from integer of different size
example.c:155: warning: cast to pointer from integer of different size
example.c:155: warning: cast to pointer from integer of different size
example.c:155: warning: cast to pointer from integer of different size
example.c:155: warning: cast to pointer from integer of different size
example.c:155: warning: cast to pointer from integer of different size
example.c:155: warning: cast to pointer from integer of different size
example.c:155: warning: cast to pointer from integer of different size
example.c:155: warning: cast to pointer from integer of different size
example.c:155: warning: cast to pointer from integer of different size
example.c:155: warning: cast to pointer from integer of different size
example.c:155: warning: cast to pointer from integer of different size
example.c:155: warning: cast to pointer from integer of different size
example.c:159: warning: cast to pointer from integer of different size
example.c: At top level:
example.c:170: error: syntax error before "Byte"
example.c:170: warning: data definition has no type or storage class
example.c:171: error: syntax error before "comprLen"
example.c:171: warning: data definition has no type or storage class
example.c:175: error: syntax error before "len"
example.c:175: error: `uLong' undeclared here (not in a function)
example.c:175: error: syntax error before "strlen"
example.c:181: error: `c_stream' undeclared here (not in a function)
example.c:181: error: `z_stream' undeclared here (not in a function)
example.c:181: error: initializer element is not constant
example.c:181: warning: data definition has no type or storage class
example.c:182: error: syntax error before '{' token
example.c:182: error: syntax error before numeric constant
example.c:182: warning: conflicting types for built-in function 'exit'
example.c:182: warning: data definition has no type or storage class
example.c:184: error: syntax error before '.' token
example.c:189: error: redefinition of 'err'
example.c:181: error: previous definition of 'err' was here
example.c:189: error: initializer element is not constant
example.c:189: warning: data definition has no type or storage class
example.c:190: error: syntax error before '{' token
example.c:190: error: syntax error before numeric constant
example.c:190: warning: data definition has no type or storage class
example.c:195: error: redefinition of 'err'
example.c:189: error: previous definition of 'err' was here
example.c:195: error: redefinition of 'err'
example.c:189: error: previous definition of 'err' was here
example.c:195: error: initializer element is not constant
example.c:195: warning: data definition has no type or storage class
example.c:196: error: syntax error before "if"
example.c:197: error: syntax error before numeric constant
example.c:197: warning: data definition has no type or storage class
example.c:200: error: redefinition of 'err'
example.c:195: error: previous definition of 'err' was here
example.c:200: error: redefinition of 'err'
example.c:189: error: previous definition of 'err' was here
example.c:200: error: initializer element is not constant
example.c:200: warning: data definition has no type or storage class
example.c:201: error: syntax error before '{' token
example.c:201: error: syntax error before numeric constant
example.c:201: warning: data definition has no type or storage class
example.c:208: error: syntax error before "Byte"
example.c:208: warning: data definition has no type or storage class
example.c:209: error: syntax error before "comprLen"
example.c:209: warning: data definition has no type or storage class
example.c:210: error: syntax error before '{' token
example.c:212: warning: data definition has no type or storage class
example.c:214: error: syntax error before '(' token
example.c:214: error: conflicting types for 'uncompr'
example.c:208: error: previous declaration of 'uncompr' was here
example.c:224: error: redefinition of 'err'
example.c:200: error: previous definition of 'err' was here
example.c:224: error: redefinition of 'err'
example.c:189: error: previous definition of 'err' was here
example.c:224: error: initializer element is not constant
example.c:224: warning: data definition has no type or storage class
example.c:225: error: syntax error before '{' token
example.c:225: error: syntax error before numeric constant
example.c:225: warning: data definition has no type or storage class
example.c:229: error: redefinition of 'err'
example.c:224: error: previous definition of 'err' was here
example.c:229: error: redefinition of 'err'
example.c:189: error: previous definition of 'err' was here
example.c:229: error: initializer element is not constant
example.c:229: warning: data definition has no type or storage class
example.c:230: error: syntax error before "if"
example.c:231: error: syntax error before numeric constant
example.c:231: warning: data definition has no type or storage class
example.c:234: error: redefinition of 'err'
example.c:229: error: previous definition of 'err' was here
example.c:234: error: redefinition of 'err'
example.c:189: error: previous definition of 'err' was here
example.c:234: error: initializer element is not constant
example.c:234: warning: data definition has no type or storage class
example.c:235: error: syntax error before '{' token
example.c:235: error: syntax error before numeric constant
example.c:235: warning: data definition has no type or storage class
example.c:237: error: syntax error before '(' token
example.c:237: warning: cast to pointer from integer of different size
example.c:237: error: `__s2' undeclared here (not in a function)
example.c:237: error: syntax error before "if"
example.c:237: error: non-static declaration of '__result' follows static declaration
example.c:237: error: previous definition of '__result' was here
example.c:237: warning: data definition has no type or storage class
example.c:237: error: syntax error before '}' token
example.c:237: error: static declaration of '__result' follows non-static declaration
example.c:237: error: previous declaration of '__result' was here
example.c:237: error: static declaration of '__result' follows non-static declaration
example.c:237: error: previous declaration of '__result' was here
example.c:237: error: `__s1' undeclared here (not in a function)
example.c:237: error: `hello' undeclared here (not in a function)
example.c:237: error: syntax error before "if"
example.c:237: error: non-static declaration of '__result' follows static declaration
example.c:237: error: previous definition of '__result' was here
example.c:237: warning: data definition has no type or storage class
example.c:237: error: syntax error before '}' token
example.c:239: error: syntax error before numeric constant
example.c:239: warning: data definition has no type or storage class
example.c:249: error: syntax error before "Byte"
example.c:249: error: conflicting types for 'uncompr'
example.c:214: error: previous declaration of 'uncompr' was here
example.c:249: error: conflicting types for 'uncompr'
example.c:214: error: previous declaration of 'uncompr' was here
example.c:249: warning: data definition has no type or storage class
example.c:250: error: syntax error before "comprLen"
example.c:250: warning: data definition has no type or storage class
example.c:251: error: syntax error before '{' token
example.c:255: error: syntax error before '.' token
example.c:259: error: redefinition of 'err'
example.c:234: error: previous definition of 'err' was here
example.c:259: error: redefinition of 'err'
example.c:189: error: previous definition of 'err' was here
example.c:259: error: initializer element is not constant
example.c:259: warning: data definition has no type or storage class
example.c:260: error: syntax error before '{' token
example.c:260: error: syntax error before numeric constant
example.c:260: warning: data definition has no type or storage class
example.c:262: error: syntax error before '.' token
example.c:270: error: redefinition of 'err'
example.c:259: error: previous definition of 'err' was here
example.c:270: error: redefinition of 'err'
example.c:189: error: previous definition of 'err' was here
example.c:270: error: initializer element is not constant
example.c:270: warning: data definition has no type or storage class
example.c:271: error: syntax error before '{' token
example.c:271: error: syntax error before numeric constant
example.c:271: warning: data definition has no type or storage class
example.c:274: error: syntax error before numeric constant
example.c:274: warning: data definition has no type or storage class
example.c:278: error: syntax error before '&' token
example.c:278: warning: data definition has no type or storage class
example.c:279: error: syntax error before '.' token
example.c:281: error: redefinition of 'err'
example.c:270: error: previous definition of 'err' was here
example.c:281: error: redefinition of 'err'
example.c:189: error: previous definition of 'err' was here
example.c:281: error: initializer element is not constant
example.c:281: warning: data definition has no type or storage class
example.c:282: error: syntax error before '{' token
example.c:282: error: syntax error before numeric constant
example.c:282: warning: data definition has no type or storage class
example.c:285: error: syntax error before '&' token
example.c:285: warning: data definition has no type or storage class
example.c:286: error: syntax error before '.' token
example.c:288: error: redefinition of 'err'
example.c:281: error: previous definition of 'err' was here
example.c:288: error: redefinition of 'err'
example.c:189: error: previous definition of 'err' was here
example.c:288: error: initializer element is not constant
example.c:288: warning: data definition has no type or storage class
example.c:289: error: syntax error before '{' token
example.c:289: error: syntax error before numeric constant
example.c:289: warning: data definition has no type or storage class
example.c:291: error: redefinition of 'err'
example.c:288: error: previous definition of 'err' was here
example.c:291: error: redefinition of 'err'
example.c:189: error: previous definition of 'err' was here
example.c:291: error: initializer element is not constant
example.c:291: warning: data definition has no type or storage class
example.c:292: error: syntax error before "if"
example.c:294: error: syntax error before numeric constant
example.c:294: warning: data definition has no type or storage class
example.c:296: error: redefinition of 'err'
example.c:291: error: previous definition of 'err' was here
example.c:296: error: redefinition of 'err'
example.c:189: error: previous definition of 'err' was here
example.c:296: error: initializer element is not constant
example.c:296: warning: data definition has no type or storage class
example.c:297: error: syntax error before '{' token
example.c:297: error: syntax error before numeric constant
example.c:297: warning: data definition has no type or storage class
example.c:304: error: syntax error before "Byte"
example.c:304: warning: data definition has no type or storage class
example.c:305: error: syntax error before "comprLen"
example.c:305: warning: data definition has no type or storage class
example.c:306: error: syntax error before '{' token
example.c:308: warning: data definition has no type or storage class
example.c:310: error: syntax error before '(' token
example.c:310: error: conflicting types for 'uncompr'
example.c:304: error: previous declaration of 'uncompr' was here
example.c:319: error: redefinition of 'err'
example.c:296: error: previous definition of 'err' was here
example.c:319: error: redefinition of 'err'
example.c:189: error: previous definition of 'err' was here
example.c:319: error: initializer element is not constant
example.c:319: warning: data definition has no type or storage class
example.c:320: error: syntax error before '{' token
example.c:320: error: syntax error before numeric constant
example.c:320: warning: data definition has no type or storage class
example.c:325: error: redefinition of 'err'
example.c:319: error: previous definition of 'err' was here
example.c:325: error: redefinition of 'err'
example.c:189: error: previous definition of 'err' was here
example.c:325: error: initializer element is not constant
example.c:325: warning: data definition has no type or storage class
example.c:326: error: syntax error before "if"
example.c:327: error: syntax error before numeric constant
example.c:327: warning: data definition has no type or storage class
example.c:330: error: redefinition of 'err'
example.c:325: error: previous definition of 'err' was here
example.c:330: error: redefinition of 'err'
example.c:189: error: previous definition of 'err' was here
example.c:330: error: initializer element is not constant
example.c:330: warning: data definition has no type or storage class
example.c:331: error: syntax error before '{' token
example.c:331: error: syntax error before numeric constant
example.c:331: warning: data definition has no type or storage class
example.c:335: error: syntax error before numeric constant
example.c:335: warning: data definition has no type or storage class
example.c:345: error: syntax error before "Byte"
example.c:345: warning: data definition has no type or storage class
example.c:346: error: syntax error before '*' token
example.c:346: error: conflicting types for 'comprLen'
example.c:305: error: previous declaration of 'comprLen' was here
example.c:346: warning: data definition has no type or storage class
example.c:347: error: syntax error before '{' token
example.c:350: error: syntax error before "len"
example.c:350: error: redefinition of 'len'
example.c:175: error: previous definition of 'len' was here
example.c:350: error: `uInt' undeclared here (not in a function)
example.c:350: error: syntax error before "strlen"
example.c:356: error: redefinition of 'err'
example.c:330: error: previous definition of 'err' was here
example.c:356: error: redefinition of 'err'
example.c:189: error: previous definition of 'err' was here
example.c:356: error: initializer element is not constant
example.c:356: warning: data definition has no type or storage class
example.c:357: error: syntax error before '{' token
example.c:357: error: syntax error before numeric constant
example.c:357: warning: data definition has no type or storage class
example.c:359: error: syntax error before '.' token
example.c:363: error: redefinition of 'err'
example.c:356: error: previous definition of 'err' was here
example.c:363: error: redefinition of 'err'
example.c:189: error: previous definition of 'err' was here
example.c:363: error: initializer element is not constant
example.c:363: warning: data definition has no type or storage class
example.c:364: error: syntax error before '{' token
example.c:364: error: syntax error before numeric constant
example.c:364: warning: data definition has no type or storage class
example.c:366: error: syntax error before '++' token
example.c:369: error: redefinition of 'err'
example.c:363: error: previous definition of 'err' was here
example.c:369: error: redefinition of 'err'
example.c:189: error: previous definition of 'err' was here
example.c:369: error: initializer element is not constant
example.c:369: warning: data definition has no type or storage class
example.c:370: error: syntax error before "if"
example.c:371: error: syntax error before numeric constant
example.c:371: warning: data definition has no type or storage class
example.c:373: error: redefinition of 'err'
example.c:369: error: previous definition of 'err' was here
example.c:373: error: redefinition of 'err'
example.c:189: error: previous definition of 'err' was here
example.c:373: error: initializer element is not constant
example.c:373: warning: data definition has no type or storage class
example.c:374: error: syntax error before '{' token
example.c:374: error: syntax error before numeric constant
example.c:374: warning: data definition has no type or storage class
example.c:376: warning: data definition has no type or storage class
example.c:377: error: syntax error before '}' token
example.c:383: error: syntax error before "Byte"
example.c:383: error: conflicting types for 'uncompr'
example.c:310: error: previous declaration of 'uncompr' was here
example.c:383: error: conflicting types for 'uncompr'
example.c:310: error: previous declaration of 'uncompr' was here
example.c:383: warning: data definition has no type or storage class
example.c:384: error: syntax error before "comprLen"
example.c:384: error: conflicting types for 'comprLen'
example.c:376: error: previous definition of 'comprLen' was here
example.c:384: error: conflicting types for 'comprLen'
example.c:376: error: previous definition of 'comprLen' was here
example.c:384: warning: data definition has no type or storage class
example.c:385: error: syntax error before '{' token
example.c:387: warning: data definition has no type or storage class
example.c:389: error: syntax error before '(' token
example.c:389: error: conflicting types for 'uncompr'
example.c:383: error: previous declaration of 'uncompr' was here
example.c:398: error: redefinition of 'err'
example.c:373: error: previous definition of 'err' was here
example.c:398: error: redefinition of 'err'
example.c:189: error: previous definition of 'err' was here
example.c:398: error: initializer element is not constant
example.c:398: warning: data definition has no type or storage class
example.c:399: error: syntax error before '{' token
example.c:399: error: syntax error before numeric constant
example.c:399: warning: data definition has no type or storage class
example.c:401: error: syntax error before '.' token
example.c:404: error: syntax error before '&' token
example.c:404: warning: data definition has no type or storage class
example.c:405: error: syntax error before numeric constant
example.c:405: warning: data definition has no type or storage class
example.c:407: error: syntax error before '.' token
example.c:408: error: redefinition of 'err'
example.c:398: error: previous definition of 'err' was here
example.c:408: error: redefinition of 'err'
example.c:189: error: previous definition of 'err' was here
example.c:408: error: initializer element is not constant
example.c:408: warning: data definition has no type or storage class
example.c:409: error: syntax error before '{' token
example.c:409: error: syntax error before numeric constant
example.c:409: warning: data definition has no type or storage class
example.c:411: error: redefinition of 'err'
example.c:408: error: previous definition of 'err' was here
example.c:411: error: redefinition of 'err'
example.c:189: error: previous definition of 'err' was here
example.c:411: error: initializer element is not constant
example.c:411: warning: data definition has no type or storage class
example.c:412: error: syntax error before "if"
example.c:415: error: syntax error before numeric constant
example.c:415: warning: data definition has no type or storage class
example.c:417: error: redefinition of 'err'
example.c:411: error: previous definition of 'err' was here
example.c:417: error: redefinition of 'err'
example.c:189: error: previous definition of 'err' was here
example.c:417: error: initializer element is not constant
example.c:417: warning: data definition has no type or storage class
example.c:418: error: syntax error before '{' token
example.c:418: error: syntax error before numeric constant
example.c:418: warning: data definition has no type or storage class
example.c:420: error: syntax error before string constant
example.c:427: error: syntax error before "Byte"
example.c:427: warning: data definition has no type or storage class
example.c:428: error: syntax error before "comprLen"
example.c:428: warning: data definition has no type or storage class
example.c:433: error: syntax error before '.' token
example.c:437: error: redefinition of 'err'
example.c:417: error: previous definition of 'err' was here
example.c:437: error: redefinition of 'err'
example.c:189: error: previous definition of 'err' was here
example.c:437: error: initializer element is not constant
example.c:437: warning: data definition has no type or storage class
example.c:438: error: syntax error before '{' token
example.c:438: error: syntax error before numeric constant
example.c:438: warning: data definition has no type or storage class
example.c:440: error: redefinition of 'err'
example.c:437: error: previous definition of 'err' was here
example.c:440: error: redefinition of 'err'
example.c:189: error: previous definition of 'err' was here
example.c:441: error: syntax error before "Bytef"
example.c:442: error: syntax error before numeric constant
example.c:442: warning: data definition has no type or storage class
example.c:444: warning: data definition has no type or storage class
example.c:445: error: syntax error before '.' token
example.c:451: error: redefinition of 'err'
example.c:440: error: previous definition of 'err' was here
example.c:451: error: redefinition of 'err'
example.c:189: error: previous definition of 'err' was here
example.c:451: error: initializer element is not constant
example.c:451: warning: data definition has no type or storage class
example.c:452: error: syntax error before "if"
example.c:454: error: syntax error before numeric constant
example.c:454: warning: data definition has no type or storage class
example.c:456: error: redefinition of 'err'
example.c:451: error: previous definition of 'err' was here
example.c:456: error: redefinition of 'err'
example.c:189: error: previous definition of 'err' was here
example.c:456: error: initializer element is not constant
example.c:456: warning: data definition has no type or storage class
example.c:457: error: syntax error before '{' token
example.c:457: error: syntax error before numeric constant
example.c:457: warning: data definition has no type or storage class
example.c:464: error: syntax error before "Byte"
example.c:464: error: conflicting types for 'uncompr'
example.c:389: error: previous declaration of 'uncompr' was here
example.c:464: error: conflicting types for 'uncompr'
example.c:389: error: previous declaration of 'uncompr' was here
example.c:464: warning: data definition has no type or storage class
example.c:465: error: syntax error before "comprLen"
example.c:465: warning: data definition has no type or storage class
example.c:466: error: syntax error before '{' token
example.c:468: warning: data definition has no type or storage class
example.c:470: error: syntax error before '(' token
example.c:470: error: conflicting types for 'uncompr'
example.c:464: error: previous declaration of 'uncompr' was here
example.c:479: error: redefinition of 'err'
example.c:456: error: previous definition of 'err' was here
example.c:479: error: redefinition of 'err'
example.c:189: error: previous definition of 'err' was here
example.c:479: error: initializer element is not constant
example.c:479: warning: data definition has no type or storage class
example.c:480: error: syntax error before '{' token
example.c:480: error: syntax error before numeric constant
example.c:480: warning: data definition has no type or storage class
example.c:482: error: syntax error before '.' token
example.c:491: error: syntax error before numeric constant
example.c:491: warning: data definition has no type or storage class
example.c:493: error: redefinition of 'err'
example.c:479: error: previous definition of 'err' was here
example.c:493: error: redefinition of 'err'
example.c:189: error: previous definition of 'err' was here
example.c:493: error: syntax error before "Bytef"
example.c:496: error: syntax error before numeric constant
example.c:496: warning: data definition has no type or storage class
example.c:499: error: redefinition of 'err'
example.c:493: error: previous definition of 'err' was here
example.c:499: error: redefinition of 'err'
example.c:189: error: previous definition of 'err' was here
example.c:499: error: initializer element is not constant
example.c:499: warning: data definition has no type or storage class
example.c:500: error: syntax error before '{' token
example.c:500: error: syntax error before numeric constant
example.c:500: warning: data definition has no type or storage class
example.c:502: error: syntax error before '(' token
example.c:502: error: static declaration of '__result' follows non-static declaration
example.c:237: error: previous declaration of '__result' was here
example.c:502: error: static declaration of '__result' follows non-static declaration
example.c:237: error: previous declaration of '__result' was here
example.c:502: warning: cast to pointer from integer of different size
example.c:502: error: syntax error before "if"
example.c:502: error: non-static declaration of '__result' follows static declaration
example.c:502: error: previous definition of '__result' was here
example.c:502: warning: data definition has no type or storage class
example.c:502: error: syntax error before '}' token
example.c:502: error: static declaration of '__result' follows non-static declaration
example.c:502: error: previous declaration of '__result' was here
example.c:502: error: static declaration of '__result' follows non-static declaration
example.c:502: error: previous declaration of '__result' was here
example.c:502: error: syntax error before "if"
example.c:502: error: non-static declaration of '__result' follows static declaration
example.c:502: error: previous definition of '__result' was here
example.c:502: warning: data definition has no type or storage class
example.c:502: error: syntax error before '}' token
example.c:504: error: syntax error before numeric constant
example.c:504: warning: data definition has no type or storage class
example.c: In function `main':
example.c:518: error: `Byte' undeclared (first use in this function)
example.c:518: error: invalid type argument of `unary *'
example.c:519: error: syntax error before "comprLen"
example.c:523: error: subscripted value is neither array nor pointer
example.c:524: error: `stderr' undeclared (first use in this function)
example.c:527: warning: passing arg 1 of `strlen' makes pointer from integer without a cast
example.c:527: warning: cast to pointer from integer of different size
example.c:527: warning: cast to pointer from integer of different size
example.c:527: warning: passing arg 1 of `__builtin_strcmp' makes pointer from integer without a cast
example.c:527: warning: cast to pointer from integer of different size
example.c:527: warning: cast to pointer from integer of different size
example.c:527: warning: passing arg 1 of `strlen' makes pointer from integer without a cast
example.c:527: warning: passing arg 1 of `__builtin_strcmp' makes pointer from integer without a cast
example.c:527: warning: cast to pointer from integer of different size
example.c:527: warning: cast to pointer from integer of different size
example.c:527: warning: cast to pointer from integer of different size
example.c:527: warning: cast to pointer from integer of different size
example.c:527: warning: cast to pointer from integer of different size
example.c:527: warning: cast to pointer from integer of different size
example.c:527: warning: passing arg 1 of `__builtin_strcmp' makes pointer from integer without a cast
example.c:527: warning: cast to pointer from integer of different size
example.c:527: warning: passing arg 1 of `__builtin_strcmp' makes pointer from integer without a cast
example.c:534: error: syntax error before ')' token
example.c:535: error: syntax error before ')' token
{standard input}: Assembler messages:
{standard input}:40: Warning: size of "uncompr" is already 8; not changing to 4
{standard input}:42: Warning: size of "uncompr" is already 8; not changing to 4
{standard input}:44: Warning: size of "uncompr" is already 8; not changing to 4
{standard input}:46: Warning: size of "uncompr" is already 8; not changing to 4
make: *** [example.o] Error 1

!!! ERROR: sys-libs/zlib-1.2.3 failed.
Call stack:
  ebuild.sh, line 1540:   Called dyn_compile
  ebuild.sh, line 940:   Called src_compile
  zlib-1.2.3.ebuild, line 43:   Called die