All pastes #673811 Raw Edit

Unbenannt

public text v1 · immutable
#673811 ·published 2007-08-28 18:20 UTC
rendered paste body
/bin/sh ../libtool --mode=compile ccache mipsel-linux-uclibc-gcc -DHAVE_CONFIG_H -I. -I. -I.. -I/home/ubuntu/openwrt/kamikaze_7.07_brcm/staging_dir_mipsel/usr/include/python1.5 -I/home/ubuntu/openwrt/kamikaze_7.07_brcm/staging_dir_mipsel/usr/include/python1.5  -I/home/ubuntu/openwrt/kamikaze_7.07_brcm/staging_dir_mipsel/usr/include -I/home/ubuntu/openwrt/kamikaze_7.07_brcm/staging_dir_mipsel/include -I/home/ubuntu/openwrt/kamikaze_7.07_brcm/staging_dir_mipsel/usr/include -I/home/ubuntu/openwrt/kamikaze_7.07_brcm/staging_dir_mipsel/include  -Os -pipe -mips32 -mtune=mips32 -funit-at-a-time -I/home/ubuntu/openwrt/kamikaze_7.07_brcm/staging_dir_mipsel/usr/include -I/home/ubuntu/openwrt/kamikaze_7.07_brcm/staging_dir_mipsel/include -c -o net-snmp_wrap.lo `test -f 'net-snmp_wrap.c' || echo './'`net-snmp_wrap.c
mkdir .libs
ccache mipsel-linux-uclibc-gcc -DHAVE_CONFIG_H -I. -I. -I.. -I/home/ubuntu/openwrt/kamikaze_7.07_brcm/staging_dir_mipsel/usr/include/python1.5 -I/home/ubuntu/openwrt/kamikaze_7.07_brcm/staging_dir_mipsel/usr/include/python1.5 -I/home/ubuntu/openwrt/kamikaze_7.07_brcm/staging_dir_mipsel/usr/include -I/home/ubuntu/openwrt/kamikaze_7.07_brcm/staging_dir_mipsel/include -I/home/ubuntu/openwrt/kamikaze_7.07_brcm/staging_dir_mipsel/usr/include -I/home/ubuntu/openwrt/kamikaze_7.07_brcm/staging_dir_mipsel/include -Os -pipe -mips32 -mtune=mips32 -funit-at-a-time -I/home/ubuntu/openwrt/kamikaze_7.07_brcm/staging_dir_mipsel/usr/include -I/home/ubuntu/openwrt/kamikaze_7.07_brcm/staging_dir_mipsel/include -c net-snmp_wrap.c  -fPIC -DPIC -o .libs/net-snmp_wrap.lo
net-snmp_wrap.c:41:20: error: Python.h: No such file or directory
net-snmp_wrap.c:75: error: expected specifier-qualifier-list before 'PyObject'
net-snmp_wrap.c:80: error: expected specifier-qualifier-list before 'PyObject_HEAD'
net-snmp_wrap.c:92: error: expected '=', ',', ';', 'asm' or '__attribute__' before '*' token
net-snmp_wrap.c:106: error: expected declaration specifiers or '...' before 'FILE'
net-snmp_wrap.c: In function 'swig_varlink_print':
net-snmp_wrap.c:111: warning: incompatible implicit declaration of built-in function 'fprintf'
net-snmp_wrap.c:111: error: 'fp' undeclared (first use in this function)
net-snmp_wrap.c:111: error: (Each undeclared identifier is reported only once
net-snmp_wrap.c:111: error: for each function it appears in.)
net-snmp_wrap.c:112: error: 'swig_varlinkobject' has no member named 'vars'
net-snmp_wrap.c:113: error: 'swig_varlinkobject' has no member named 'vars'
net-snmp_wrap.c:115: error: 'swig_varlinkobject' has no member named 'vars'
net-snmp_wrap.c: At top level:
net-snmp_wrap.c:129: error: expected '=', ',', ';', 'asm' or '__attribute__' before '*' token
net-snmp_wrap.c:153: error: expected declaration specifiers or '...' before 'PyObject'
net-snmp_wrap.c: In function 'swig_varlink_setattr':
net-snmp_wrap.c:157: error: 'swig_varlinkobject' has no member named 'vars'
net-snmp_wrap.c:158: error: 'swig_varlinkobject' has no member named 'vars'
net-snmp_wrap.c:159: error: 'swig_varlinkobject' has no member named 'vars'
net-snmp_wrap.c:159: error: 'p' undeclared (first use in this function)
net-snmp_wrap.c:163: warning: incompatible implicit declaration of built-in function 'sprintf'
net-snmp_wrap.c:164: error: 'PyExc_NameError' undeclared (first use in this function)
net-snmp_wrap.c: At top level:
net-snmp_wrap.c:168: error: expected '=', ',', ';', 'asm' or '__attribute__' before 'PyTypeObject'
net-snmp_wrap.c:188: error: expected '=', ',', ';', 'asm' or '__attribute__' before '*' token
net-snmp_wrap.c:206: error: expected ')' before '*' token
net-snmp_wrap.c: In function 'py_get_node':
net-snmp_wrap.c:592: error: 'Py_BEGIN_ALLOW_THREADS' undeclared (first use in this function)
net-snmp_wrap.c:593: error: expected ';' before 'status'
net-snmp_wrap.c:594: error: 'Py_END_ALLOW_THREADS' undeclared (first use in this function)
net-snmp_wrap.c:596: error: expected ';' before 'if'
net-snmp_wrap.c:598: error: expected expression before 'else'
net-snmp_wrap.c: In function 'py_read_objid':
net-snmp_wrap.c:608: error: 'Py_BEGIN_ALLOW_THREADS' undeclared (first use in this function)
net-snmp_wrap.c:609: error: expected ';' before 'status'
net-snmp_wrap.c:610: error: 'Py_END_ALLOW_THREADS' undeclared (first use in this function)
net-snmp_wrap.c:612: error: expected ';' before 'if'
net-snmp_wrap.c:614: error: expected expression before 'else'
net-snmp_wrap.c: In function 'py_snmp_sess_synch_response':
net-snmp_wrap.c:622: error: 'Py_BEGIN_ALLOW_THREADS' undeclared (first use in this function)
net-snmp_wrap.c:623: error: expected ';' before 'rc'
net-snmp_wrap.c:624: error: 'Py_END_ALLOW_THREADS' undeclared (first use in this function)
net-snmp_wrap.c:626: error: expected ';' before 'if'
net-snmp_wrap.c:628: error: expected expression before 'else'
net-snmp_wrap.c: In function 'py_snmp_sess_error':
net-snmp_wrap.c:633: error: 'Py_BEGIN_ALLOW_THREADS' undeclared (first use in this function)
net-snmp_wrap.c:634: error: expected ';' before 'snmp_sess_error'
net-snmp_wrap.c:635: error: 'Py_END_ALLOW_THREADS' undeclared (first use in this function)
net-snmp_wrap.c:636: error: expected ';' before '}' token
net-snmp_wrap.c: In function 'py_sprint_value':
net-snmp_wrap.c:639: error: 'Py_BEGIN_ALLOW_THREADS' undeclared (first use in this function)
net-snmp_wrap.c:640: error: expected ';' before 'snprint_value'
net-snmp_wrap.c:641: error: 'Py_END_ALLOW_THREADS' undeclared (first use in this function)
net-snmp_wrap.c:642: error: expected ';' before '}' token
net-snmp_wrap.c: In function 'py_sprint_variable':
net-snmp_wrap.c:645: error: 'Py_BEGIN_ALLOW_THREADS' undeclared (first use in this function)
net-snmp_wrap.c:646: error: expected ';' before 'snprint_variable'
net-snmp_wrap.c:647: error: 'Py_END_ALLOW_THREADS' undeclared (first use in this function)
net-snmp_wrap.c:648: error: expected ';' before '}' token
net-snmp_wrap.c: In function 'py_sprint_objid':
net-snmp_wrap.c:651: error: 'Py_BEGIN_ALLOW_THREADS' undeclared (first use in this function)
net-snmp_wrap.c:652: error: expected ';' before 'snprint_objid'
net-snmp_wrap.c:653: error: 'Py_END_ALLOW_THREADS' undeclared (first use in this function)
net-snmp_wrap.c:654: error: expected ';' before '}' token
net-snmp_wrap.c: At top level:
net-snmp_wrap.c:655: error: expected '=', ',', ';', 'asm' or '__attribute__' before '*' token
net-snmp_wrap.c:669: error: expected '=', ',', ';', 'asm' or '__attribute__' before '*' token
net-snmp_wrap.c:700: error: expected '=', ',', ';', 'asm' or '__attribute__' before '*' token
net-snmp_wrap.c:731: error: expected '=', ',', ';', 'asm' or '__attribute__' before '*' token
net-snmp_wrap.c:762: error: expected '=', ',', ';', 'asm' or '__attribute__' before '*' token
net-snmp_wrap.c:793: error: expected '=', ',', ';', 'asm' or '__attribute__' before '*' token
net-snmp_wrap.c:824: error: expected '=', ',', ';', 'asm' or '__attribute__' before '*' token
net-snmp_wrap.c:848: error: expected '=', ',', ';', 'asm' or '__attribute__' before '*' token
net-snmp_wrap.c:870: error: expected '=', ',', ';', 'asm' or '__attribute__' before '*' token
net-snmp_wrap.c:894: error: expected '=', ',', ';', 'asm' or '__attribute__' before '*' token
net-snmp_wrap.c:917: error: expected '=', ',', ';', 'asm' or '__attribute__' before '*' token
net-snmp_wrap.c:940: error: expected '=', ',', ';', 'asm' or '__attribute__' before '*' token
net-snmp_wrap.c:961: error: expected '=', ',', ';', 'asm' or '__attribute__' before '*' token
net-snmp_wrap.c:983: error: expected '=', ',', ';', 'asm' or '__attribute__' before '*' token
net-snmp_wrap.c:1021: error: expected '=', ',', ';', 'asm' or '__attribute__' before '*' token
net-snmp_wrap.c:1052: error: expected '=', ',', ';', 'asm' or '__attribute__' before '*' token
net-snmp_wrap.c:1074: error: expected '=', ',', ';', 'asm' or '__attribute__' before '*' token
net-snmp_wrap.c:1096: error: expected '=', ',', ';', 'asm' or '__attribute__' before '*' token
net-snmp_wrap.c:1127: error: expected '=', ',', ';', 'asm' or '__attribute__' before '*' token
net-snmp_wrap.c:1151: error: expected '=', ',', ';', 'asm' or '__attribute__' before '*' token
net-snmp_wrap.c:1182: error: expected '=', ',', ';', 'asm' or '__attribute__' before '*' token
net-snmp_wrap.c:1213: error: expected '=', ',', ';', 'asm' or '__attribute__' before '*' token
net-snmp_wrap.c:1244: error: expected '=', ',', ';', 'asm' or '__attribute__' before '*' token
net-snmp_wrap.c:1275: error: expected '=', ',', ';', 'asm' or '__attribute__' before '*' token
net-snmp_wrap.c:1306: error: expected '=', ',', ';', 'asm' or '__attribute__' before '*' token
net-snmp_wrap.c:1337: error: expected '=', ',', ';', 'asm' or '__attribute__' before '*' token
net-snmp_wrap.c:1368: error: expected '=', ',', ';', 'asm' or '__attribute__' before '*' token
net-snmp_wrap.c:1399: error: expected '=', ',', ';', 'asm' or '__attribute__' before '*' token
net-snmp_wrap.c:1412: error: expected '=', ',', ';', 'asm' or '__attribute__' before '*' token
net-snmp_wrap.c:1425: error: expected '=', ',', ';', 'asm' or '__attribute__' before '*' token
net-snmp_wrap.c:1438: error: expected '=', ',', ';', 'asm' or '__attribute__' before '*' token
net-snmp_wrap.c:1460: error: expected '=', ',', ';', 'asm' or '__attribute__' before '*' token
net-snmp_wrap.c:1480: error: expected '=', ',', ';', 'asm' or '__attribute__' before '*' token
net-snmp_wrap.c:1492: error: expected '=', ',', ';', 'asm' or '__attribute__' before '*' token
net-snmp_wrap.c:1520: error: expected '=', ',', ';', 'asm' or '__attribute__' before '*' token
net-snmp_wrap.c:1564: error: expected '=', ',', ';', 'asm' or '__attribute__' before '*' token
net-snmp_wrap.c:1584: error: expected '=', ',', ';', 'asm' or '__attribute__' before '*' token
net-snmp_wrap.c:1604: error: expected '=', ',', ';', 'asm' or '__attribute__' before '*' token
net-snmp_wrap.c:1624: error: expected '=', ',', ';', 'asm' or '__attribute__' before '*' token
net-snmp_wrap.c:1644: error: expected '=', ',', ';', 'asm' or '__attribute__' before '*' token
net-snmp_wrap.c:1688: error: expected '=', ',', ';', 'asm' or '__attribute__' before '*' token
net-snmp_wrap.c:1700: error: expected '=', ',', ';', 'asm' or '__attribute__' before '*' token
net-snmp_wrap.c:1712: error: expected '=', ',', ';', 'asm' or '__attribute__' before '*' token
net-snmp_wrap.c:1724: error: expected '=', ',', ';', 'asm' or '__attribute__' before '*' token
net-snmp_wrap.c:1736: error: expected '=', ',', ';', 'asm' or '__attribute__' before '*' token
net-snmp_wrap.c:1748: error: expected '=', ',', ';', 'asm' or '__attribute__' before '*' token
net-snmp_wrap.c:1778: error: expected '=', ',', ';', 'asm' or '__attribute__' before '*' token
net-snmp_wrap.c:1809: error: expected '=', ',', ';', 'asm' or '__attribute__' before '*' token
net-snmp_wrap.c:1839: error: expected '=', ',', ';', 'asm' or '__attribute__' before '*' token
net-snmp_wrap.c:1869: error: expected '=', ',', ';', 'asm' or '__attribute__' before '*' token
net-snmp_wrap.c:1899: error: expected '=', ',', ';', 'asm' or '__attribute__' before '*' token
net-snmp_wrap.c:1929: error: expected '=', ',', ';', 'asm' or '__attribute__' before '*' token
net-snmp_wrap.c:1942: error: expected '=', ',', ';', 'asm' or '__attribute__' before '*' token
net-snmp_wrap.c:1971: error: expected '=', ',', ';', 'asm' or '__attribute__' before '*' token
net-snmp_wrap.c:2016: error: expected '=', ',', ';', 'asm' or '__attribute__' before '*' token
net-snmp_wrap.c:2055: error: expected '=', ',', ';', 'asm' or '__attribute__' before '*' token
net-snmp_wrap.c:2076: error: expected '=', ',', ';', 'asm' or '__attribute__' before '*' token
net-snmp_wrap.c:2096: error: expected '=', ',', ';', 'asm' or '__attribute__' before '*' token
net-snmp_wrap.c:2125: error: expected '=', ',', ';', 'asm' or '__attribute__' before '*' token
net-snmp_wrap.c:2154: error: expected '=', ',', ';', 'asm' or '__attribute__' before '*' token
net-snmp_wrap.c:2167: error: expected '=', ',', ';', 'asm' or '__attribute__' before '*' token
net-snmp_wrap.c:2180: error: expected '=', ',', ';', 'asm' or '__attribute__' before '*' token
net-snmp_wrap.c:2214: error: expected '=', ',', ';', 'asm' or '__attribute__' before '*' token
net-snmp_wrap.c:2248: error: expected '=', ',', ';', 'asm' or '__attribute__' before '*' token
net-snmp_wrap.c:2279: error: expected '=', ',', ';', 'asm' or '__attribute__' before '*' token
net-snmp_wrap.c:2302: error: expected '=', ',', ';', 'asm' or '__attribute__' before '*' token
net-snmp_wrap.c:2318: error: expected '=', ',', ';', 'asm' or '__attribute__' before '*' token
net-snmp_wrap.c:2335: error: expected '=', ',', ';', 'asm' or '__attribute__' before '*' token
net-snmp_wrap.c:2351: error: expected '=', ',', ';', 'asm' or '__attribute__' before '*' token
net-snmp_wrap.c:2363: error: expected '=', ',', ';', 'asm' or '__attribute__' before '*' token
net-snmp_wrap.c:2383: error: expected '=', ',', ';', 'asm' or '__attribute__' before '*' token
net-snmp_wrap.c:2396: error: expected '=', ',', ';', 'asm' or '__attribute__' before '*' token
net-snmp_wrap.c:2408: error: expected '=', ',', ';', 'asm' or '__attribute__' before '*' token
net-snmp_wrap.c:2452: error: expected '=', ',', ';', 'asm' or '__attribute__' before '*' token
net-snmp_wrap.c:2472: error: expected '=', ',', ';', 'asm' or '__attribute__' before '*' token
net-snmp_wrap.c:2494: error: expected '=', ',', ';', 'asm' or '__attribute__' before '*' token
net-snmp_wrap.c:2516: error: expected '=', ',', ';', 'asm' or '__attribute__' before '*' token
net-snmp_wrap.c:2538: error: expected '=', ',', ';', 'asm' or '__attribute__' before '*' token
net-snmp_wrap.c:2560: error: expected '=', ',', ';', 'asm' or '__attribute__' before '*' token
net-snmp_wrap.c:2588: error: expected '=', ',', ';', 'asm' or '__attribute__' before '*' token
net-snmp_wrap.c:2616: error: expected '=', ',', ';', 'asm' or '__attribute__' before '*' token
net-snmp_wrap.c:2660: error: expected '=', ',', ';', 'asm' or '__attribute__' before '*' token
net-snmp_wrap.c:2712: error: expected '=', ',', ';', 'asm' or '__attribute__' before '*' token
net-snmp_wrap.c:2740: error: expected '=', ',', ';', 'asm' or '__attribute__' before '*' token
net-snmp_wrap.c:2760: error: expected '=', ',', ';', 'asm' or '__attribute__' before '*' token
net-snmp_wrap.c:2780: error: expected '=', ',', ';', 'asm' or '__attribute__' before '*' token
net-snmp_wrap.c:2824: error: expected '=', ',', ';', 'asm' or '__attribute__' before '*' token
net-snmp_wrap.c:2846: error: expected '=', ',', ';', 'asm' or '__attribute__' before '*' token
net-snmp_wrap.c:2867: error: expected '=', ',', ';', 'asm' or '__attribute__' before '*' token
net-snmp_wrap.c:2881: error: expected '=', ',', ';', 'asm' or '__attribute__' before '*' token
net-snmp_wrap.c:2896: error: expected '=', ',', ';', 'asm' or '__attribute__' before '*' token
net-snmp_wrap.c:2950: error: expected '=', ',', ';', 'asm' or '__attribute__' before '*' token
net-snmp_wrap.c:2990: error: expected '=', ',', ';', 'asm' or '__attribute__' before '*' token
net-snmp_wrap.c:3012: error: expected '=', ',', ';', 'asm' or '__attribute__' before '*' token
net-snmp_wrap.c:3041: error: expected '=', ',', ';', 'asm' or '__attribute__' before '*' token
net-snmp_wrap.c:3064: error: expected '=', ',', ';', 'asm' or '__attribute__' before '*' token
net-snmp_wrap.c:3086: error: expected '=', ',', ';', 'asm' or '__attribute__' before '*' token
net-snmp_wrap.c:3106: error: expected '=', ',', ';', 'asm' or '__attribute__' before '*' token
net-snmp_wrap.c:3127: error: expected '=', ',', ';', 'asm' or '__attribute__' before '*' token
net-snmp_wrap.c:3147: error: expected '=', ',', ';', 'asm' or '__attribute__' before '*' token
net-snmp_wrap.c:3168: error: expected '=', ',', ';', 'asm' or '__attribute__' before '*' token
net-snmp_wrap.c:3191: error: expected '=', ',', ';', 'asm' or '__attribute__' before '*' token
net-snmp_wrap.c:3222: error: expected '=', ',', ';', 'asm' or '__attribute__' before '*' token
net-snmp_wrap.c:3237: error: expected '=', ',', ';', 'asm' or '__attribute__' before '*' token
net-snmp_wrap.c:3260: error: expected '=', ',', ';', 'asm' or '__attribute__' before '*' token
net-snmp_wrap.c:3282: error: expected '=', ',', ';', 'asm' or '__attribute__' before '*' token
net-snmp_wrap.c:3306: error: expected '=', ',', ';', 'asm' or '__attribute__' before '*' token
net-snmp_wrap.c:3326: error: expected '=', ',', ';', 'asm' or '__attribute__' before '*' token
net-snmp_wrap.c:3354: error: expected '=', ',', ';', 'asm' or '__attribute__' before '*' token
net-snmp_wrap.c:3376: error: expected '=', ',', ';', 'asm' or '__attribute__' before '*' token
net-snmp_wrap.c:3389: error: expected '=', ',', ';', 'asm' or '__attribute__' before '*' token
net-snmp_wrap.c:3425: error: expected '=', ',', ';', 'asm' or '__attribute__' before '*' token
net-snmp_wrap.c:3469: error: expected '=', ',', ';', 'asm' or '__attribute__' before '*' token
net-snmp_wrap.c:3498: error: expected '=', ',', ';', 'asm' or '__attribute__' before '*' token
net-snmp_wrap.c:3534: error: expected '=', ',', ';', 'asm' or '__attribute__' before '*' token
net-snmp_wrap.c:3554: error: expected '=', ',', ';', 'asm' or '__attribute__' before '*' token
net-snmp_wrap.c:3574: error: expected '=', ',', ';', 'asm' or '__attribute__' before '*' token
net-snmp_wrap.c:3603: error: expected '=', ',', ';', 'asm' or '__attribute__' before '*' token
net-snmp_wrap.c:3615: error: expected '=', ',', ';', 'asm' or '__attribute__' before '*' token
net-snmp_wrap.c:3628: error: expected '=', ',', ';', 'asm' or '__attribute__' before '*' token
net-snmp_wrap.c:3640: error: expected '=', ',', ';', 'asm' or '__attribute__' before '*' token
net-snmp_wrap.c:3652: error: expected '=', ',', ';', 'asm' or '__attribute__' before '*' token
net-snmp_wrap.c:3664: error: expected '=', ',', ';', 'asm' or '__attribute__' before '*' token
net-snmp_wrap.c:3676: error: expected '=', ',', ';', 'asm' or '__attribute__' before '*' token
net-snmp_wrap.c:3698: error: expected '=', ',', ';', 'asm' or '__attribute__' before '*' token
net-snmp_wrap.c:3728: error: expected '=', ',', ';', 'asm' or '__attribute__' before '*' token
net-snmp_wrap.c:3758: error: expected '=', ',', ';', 'asm' or '__attribute__' before '*' token
net-snmp_wrap.c:3787: error: expected '=', ',', ';', 'asm' or '__attribute__' before '*' token
net-snmp_wrap.c:3816: error: expected '=', ',', ';', 'asm' or '__attribute__' before '*' token
net-snmp_wrap.c:3847: error: expected '=', ',', ';', 'asm' or '__attribute__' before '*' token
net-snmp_wrap.c:3878: error: expected '=', ',', ';', 'asm' or '__attribute__' before '*' token
net-snmp_wrap.c:3892: error: expected '=', ',', ';', 'asm' or '__attribute__' before '*' token
net-snmp_wrap.c:3912: error: expected '=', ',', ';', 'asm' or '__attribute__' before '*' token
net-snmp_wrap.c:3949: error: expected '=', ',', ';', 'asm' or '__attribute__' before '*' token
net-snmp_wrap.c:3978: error: expected '=', ',', ';', 'asm' or '__attribute__' before '*' token
net-snmp_wrap.c:4024: error: expected '=', ',', ';', 'asm' or '__attribute__' before '*' token
net-snmp_wrap.c:4069: error: expected '=', ',', ';', 'asm' or '__attribute__' before '*' token
net-snmp_wrap.c:4089: error: expected '=', ',', ';', 'asm' or '__attribute__' before '*' token
net-snmp_wrap.c:4118: error: expected '=', ',', ';', 'asm' or '__attribute__' before '*' token
net-snmp_wrap.c:4155: error: expected '=', ',', ';', 'asm' or '__attribute__' before '*' token
net-snmp_wrap.c:4186: error: expected '=', ',', ';', 'asm' or '__attribute__' before '*' token
net-snmp_wrap.c:4240: error: expected '=', ',', ';', 'asm' or '__attribute__' before '*' token
net-snmp_wrap.c:4296: error: expected '=', ',', ';', 'asm' or '__attribute__' before '*' token
net-snmp_wrap.c:4325: error: expected '=', ',', ';', 'asm' or '__attribute__' before '*' token
net-snmp_wrap.c:4362: error: expected '=', ',', ';', 'asm' or '__attribute__' before '*' token
net-snmp_wrap.c:4393: error: expected '=', ',', ';', 'asm' or '__attribute__' before '*' token
net-snmp_wrap.c:4447: error: expected '=', ',', ';', 'asm' or '__attribute__' before '*' token
net-snmp_wrap.c:4468: error: expected '=', ',', ';', 'asm' or '__attribute__' before '*' token
net-snmp_wrap.c:4497: error: expected '=', ',', ';', 'asm' or '__attribute__' before '*' token
net-snmp_wrap.c:4520: error: expected '=', ',', ';', 'asm' or '__attribute__' before '*' token
net-snmp_wrap.c:4566: error: expected '=', ',', ';', 'asm' or '__attribute__' before '*' token
net-snmp_wrap.c:4621: error: expected '=', ',', ';', 'asm' or '__attribute__' before '*' token
net-snmp_wrap.c:4660: error: expected '=', ',', ';', 'asm' or '__attribute__' before '*' token
net-snmp_wrap.c:4699: error: expected '=', ',', ';', 'asm' or '__attribute__' before '*' token
net-snmp_wrap.c:4754: error: expected '=', ',', ';', 'asm' or '__attribute__' before '*' token
net-snmp_wrap.c:4809: error: expected '=', ',', ';', 'asm' or '__attribute__' before '*' token
net-snmp_wrap.c:4864: error: expected '=', ',', ';', 'asm' or '__attribute__' before '*' token
net-snmp_wrap.c:4919: error: expected '=', ',', ';', 'asm' or '__attribute__' before '*' token
net-snmp_wrap.c:4960: error: expected '=', ',', ';', 'asm' or '__attribute__' before '*' token
net-snmp_wrap.c:5015: error: expected '=', ',', ';', 'asm' or '__attribute__' before '*' token
net-snmp_wrap.c:5070: error: expected '=', ',', ';', 'asm' or '__attribute__' before '*' token
net-snmp_wrap.c:5125: error: expected '=', ',', ';', 'asm' or '__attribute__' before '*' token
net-snmp_wrap.c:5180: error: expected '=', ',', ';', 'asm' or '__attribute__' before '*' token
net-snmp_wrap.c:5235: error: expected '=', ',', ';', 'asm' or '__attribute__' before '*' token
net-snmp_wrap.c:5290: error: expected '=', ',', ';', 'asm' or '__attribute__' before '*' token
net-snmp_wrap.c:5345: error: expected '=', ',', ';', 'asm' or '__attribute__' before '*' token
net-snmp_wrap.c:5400: error: expected '=', ',', ';', 'asm' or '__attribute__' before '*' token
net-snmp_wrap.c:5455: error: expected '=', ',', ';', 'asm' or '__attribute__' before '*' token
net-snmp_wrap.c:5510: error: expected '=', ',', ';', 'asm' or '__attribute__' before '*' token
net-snmp_wrap.c:5565: error: expected '=', ',', ';', 'asm' or '__attribute__' before '*' token
net-snmp_wrap.c:5597: error: expected '=', ',', ';', 'asm' or '__attribute__' before '*' token
net-snmp_wrap.c:5613: error: expected '=', ',', ';', 'asm' or '__attribute__' before '*' token
net-snmp_wrap.c:5629: error: expected '=', ',', ';', 'asm' or '__attribute__' before '*' token
net-snmp_wrap.c:5661: error: expected '=', ',', ';', 'asm' or '__attribute__' before '*' token
net-snmp_wrap.c:5693: error: expected '=', ',', ';', 'asm' or '__attribute__' before '*' token
net-snmp_wrap.c:5725: error: expected '=', ',', ';', 'asm' or '__attribute__' before '*' token
net-snmp_wrap.c:5757: error: expected '=', ',', ';', 'asm' or '__attribute__' before '*' token
net-snmp_wrap.c:5774: error: expected '=', ',', ';', 'asm' or '__attribute__' before '*' token
net-snmp_wrap.c:5806: error: expected '=', ',', ';', 'asm' or '__attribute__' before '*' token
net-snmp_wrap.c:5838: error: expected '=', ',', ';', 'asm' or '__attribute__' before '*' token
net-snmp_wrap.c:5870: error: expected '=', ',', ';', 'asm' or '__attribute__' before '*' token
net-snmp_wrap.c:5902: error: expected '=', ',', ';', 'asm' or '__attribute__' before '*' token
net-snmp_wrap.c:5934: error: expected '=', ',', ';', 'asm' or '__attribute__' before '*' token
net-snmp_wrap.c:5966: error: expected '=', ',', ';', 'asm' or '__attribute__' before '*' token
net-snmp_wrap.c:5998: error: expected '=', ',', ';', 'asm' or '__attribute__' before '*' token
net-snmp_wrap.c:6030: error: expected '=', ',', ';', 'asm' or '__attribute__' before '*' token
net-snmp_wrap.c:6062: error: expected '=', ',', ';', 'asm' or '__attribute__' before '*' token
net-snmp_wrap.c:6094: error: expected '=', ',', ';', 'asm' or '__attribute__' before '*' token
net-snmp_wrap.c:6126: error: expected '=', ',', ';', 'asm' or '__attribute__' before '*' token
net-snmp_wrap.c:6146: error: expected '=', ',', ';', 'asm' or '__attribute__' before '*' token
net-snmp_wrap.c:6158: error: expected '=', ',', ';', 'asm' or '__attribute__' before '*' token
net-snmp_wrap.c:6170: error: expected '=', ',', ';', 'asm' or '__attribute__' before '*' token
net-snmp_wrap.c:6182: error: expected '=', ',', ';', 'asm' or '__attribute__' before '*' token
net-snmp_wrap.c:6194: error: expected '=', ',', ';', 'asm' or '__attribute__' before '*' token
net-snmp_wrap.c:6224: error: expected '=', ',', ';', 'asm' or '__attribute__' before '*' token
net-snmp_wrap.c:6237: error: expected '=', ',', ';', 'asm' or '__attribute__' before '*' token
net-snmp_wrap.c:6258: error: expected '=', ',', ';', 'asm' or '__attribute__' before '*' token
net-snmp_wrap.c:6271: error: expected '=', ',', ';', 'asm' or '__attribute__' before '*' token
net-snmp_wrap.c:6292: error: expected '=', ',', ';', 'asm' or '__attribute__' before '*' token
net-snmp_wrap.c:6305: error: expected '=', ',', ';', 'asm' or '__attribute__' before '*' token
net-snmp_wrap.c:6327: error: expected '=', ',', ';', 'asm' or '__attribute__' before '*' token
net-snmp_wrap.c:6342: error: expected '=', ',', ';', 'asm' or '__attribute__' before '*' token
net-snmp_wrap.c:6356: error: expected '=', ',', ';', 'asm' or '__attribute__' before '*' token
net-snmp_wrap.c:6370: error: expected '=', ',', ';', 'asm' or '__attribute__' before '*' token
net-snmp_wrap.c:6385: error: expected '=', ',', ';', 'asm' or '__attribute__' before '*' token
net-snmp_wrap.c:6399: error: expected '=', ',', ';', 'asm' or '__attribute__' before '*' token
net-snmp_wrap.c:6414: error: expected '=', ',', ';', 'asm' or '__attribute__' before '*' token
net-snmp_wrap.c:6428: error: expected '=', ',', ';', 'asm' or '__attribute__' before '*' token
net-snmp_wrap.c:6450: error: expected '=', ',', ';', 'asm' or '__attribute__' before '*' token
net-snmp_wrap.c:6466: error: expected '=', ',', ';', 'asm' or '__attribute__' before '*' token
net-snmp_wrap.c:6483: error: expected '=', ',', ';', 'asm' or '__attribute__' before '*' token
net-snmp_wrap.c:6500: error: expected '=', ',', ';', 'asm' or '__attribute__' before '*' token
net-snmp_wrap.c:6512: error: expected '=', ',', ';', 'asm' or '__attribute__' before '*' token
net-snmp_wrap.c:6527: error: expected '=', ',', ';', 'asm' or '__attribute__' before '*' token
net-snmp_wrap.c:6542: error: expected '=', ',', ';', 'asm' or '__attribute__' before '*' token
net-snmp_wrap.c:6572: error: expected '=', ',', ';', 'asm' or '__attribute__' before '*' token
net-snmp_wrap.c:6600: error: expected '=', ',', ';', 'asm' or '__attribute__' before '*' token
net-snmp_wrap.c:6631: error: expected '=', ',', ';', 'asm' or '__attribute__' before '*' token
net-snmp_wrap.c:6662: error: expected '=', ',', ';', 'asm' or '__attribute__' before '*' token
net-snmp_wrap.c:6694: error: expected '=', ',', ';', 'asm' or '__attribute__' before '*' token
net-snmp_wrap.c:6716: error: expected '=', ',', ';', 'asm' or '__attribute__' before '*' token
net-snmp_wrap.c:6737: error: expected '=', ',', ';', 'asm' or '__attribute__' before '*' token
net-snmp_wrap.c:6759: error: expected '=', ',', ';', 'asm' or '__attribute__' before '*' token
net-snmp_wrap.c:6780: error: expected '=', ',', ';', 'asm' or '__attribute__' before '*' token
net-snmp_wrap.c:6802: error: expected '=', ',', ';', 'asm' or '__attribute__' before '*' token
net-snmp_wrap.c:6823: error: expected '=', ',', ';', 'asm' or '__attribute__' before '*' token
net-snmp_wrap.c:6845: error: expected '=', ',', ';', 'asm' or '__attribute__' before '*' token
net-snmp_wrap.c:6866: error: expected '=', ',', ';', 'asm' or '__attribute__' before '*' token
net-snmp_wrap.c:6888: error: expected '=', ',', ';', 'asm' or '__attribute__' before '*' token
net-snmp_wrap.c:6909: error: expected '=', ',', ';', 'asm' or '__attribute__' before '*' token
net-snmp_wrap.c:6931: error: expected '=', ',', ';', 'asm' or '__attribute__' before '*' token
net-snmp_wrap.c:6952: error: expected '=', ',', ';', 'asm' or '__attribute__' before '*' token
net-snmp_wrap.c:6974: error: expected '=', ',', ';', 'asm' or '__attribute__' before '*' token
net-snmp_wrap.c:6995: error: expected '=', ',', ';', 'asm' or '__attribute__' before '*' token
net-snmp_wrap.c:7017: error: expected '=', ',', ';', 'asm' or '__attribute__' before '*' token
net-snmp_wrap.c:7038: error: expected '=', ',', ';', 'asm' or '__attribute__' before '*' token
net-snmp_wrap.c:7060: error: expected '=', ',', ';', 'asm' or '__attribute__' before '*' token
net-snmp_wrap.c:7081: error: expected '=', ',', ';', 'asm' or '__attribute__' before '*' token
net-snmp_wrap.c:7103: error: expected '=', ',', ';', 'asm' or '__attribute__' before '*' token
net-snmp_wrap.c:7124: error: expected '=', ',', ';', 'asm' or '__attribute__' before '*' token
net-snmp_wrap.c:7146: error: expected '=', ',', ';', 'asm' or '__attribute__' before '*' token
net-snmp_wrap.c:7167: error: expected '=', ',', ';', 'asm' or '__attribute__' before '*' token
net-snmp_wrap.c:7189: error: expected '=', ',', ';', 'asm' or '__attribute__' before '*' token
net-snmp_wrap.c:7210: error: expected '=', ',', ';', 'asm' or '__attribute__' before '*' token
net-snmp_wrap.c:7232: error: expected '=', ',', ';', 'asm' or '__attribute__' before '*' token
net-snmp_wrap.c:7253: error: expected '=', ',', ';', 'asm' or '__attribute__' before '*' token
net-snmp_wrap.c:7275: error: expected '=', ',', ';', 'asm' or '__attribute__' before '*' token
net-snmp_wrap.c:7296: error: expected '=', ',', ';', 'asm' or '__attribute__' before '*' token
net-snmp_wrap.c:7318: error: expected '=', ',', ';', 'asm' or '__attribute__' before '*' token
net-snmp_wrap.c:7339: error: expected '=', ',', ';', 'asm' or '__attribute__' before '*' token
net-snmp_wrap.c:7370: error: expected '=', ',', ';', 'asm' or '__attribute__' before '*' token
net-snmp_wrap.c:7393: error: expected '=', ',', ';', 'asm' or '__attribute__' before '*' token
net-snmp_wrap.c:7415: error: expected '=', ',', ';', 'asm' or '__attribute__' before '*' token
net-snmp_wrap.c:7436: error: expected '=', ',', ';', 'asm' or '__attribute__' before '*' token
net-snmp_wrap.c:7467: error: expected '=', ',', ';', 'asm' or '__attribute__' before '*' token
net-snmp_wrap.c:7495: error: expected '=', ',', ';', 'asm' or '__attribute__' before '*' token
net-snmp_wrap.c:7517: error: expected '=', ',', ';', 'asm' or '__attribute__' before '*' token
net-snmp_wrap.c:7538: error: expected '=', ',', ';', 'asm' or '__attribute__' before '*' token
net-snmp_wrap.c:7560: error: expected '=', ',', ';', 'asm' or '__attribute__' before '*' token
net-snmp_wrap.c:7581: error: expected '=', ',', ';', 'asm' or '__attribute__' before '*' token
net-snmp_wrap.c:7612: error: expected '=', ',', ';', 'asm' or '__attribute__' before '*' token
net-snmp_wrap.c:7635: error: expected '=', ',', ';', 'asm' or '__attribute__' before '*' token
net-snmp_wrap.c:7657: error: expected '=', ',', ';', 'asm' or '__attribute__' before '*' token
net-snmp_wrap.c:7678: error: expected '=', ',', ';', 'asm' or '__attribute__' before '*' token
net-snmp_wrap.c:7700: error: expected '=', ',', ';', 'asm' or '__attribute__' before '*' token
net-snmp_wrap.c:7721: error: expected '=', ',', ';', 'asm' or '__attribute__' before '*' token
net-snmp_wrap.c:7743: error: expected '=', ',', ';', 'asm' or '__attribute__' before '*' token
net-snmp_wrap.c:7764: error: expected '=', ',', ';', 'asm' or '__attribute__' before '*' token
net-snmp_wrap.c:7792: error: expected '=', ',', ';', 'asm' or '__attribute__' before '*' token
net-snmp_wrap.c:7814: error: expected '=', ',', ';', 'asm' or '__attribute__' before '*' token
net-snmp_wrap.c:7835: error: expected '=', ',', ';', 'asm' or '__attribute__' before '*' token
net-snmp_wrap.c:7857: error: expected '=', ',', ';', 'asm' or '__attribute__' before '*' token
net-snmp_wrap.c:7883: error: expected '=', ',', ';', 'asm' or '__attribute__' before '*' token
net-snmp_wrap.c:7905: error: expected '=', ',', ';', 'asm' or '__attribute__' before '*' token
net-snmp_wrap.c:7926: error: expected '=', ',', ';', 'asm' or '__attribute__' before '*' token
net-snmp_wrap.c:7948: error: expected '=', ',', ';', 'asm' or '__attribute__' before '*' token
net-snmp_wrap.c:7974: error: expected '=', ',', ';', 'asm' or '__attribute__' before '*' token
net-snmp_wrap.c:7996: error: expected '=', ',', ';', 'asm' or '__attribute__' before '*' token
net-snmp_wrap.c:8017: error: expected '=', ',', ';', 'asm' or '__attribute__' before '*' token
net-snmp_wrap.c:8039: error: expected '=', ',', ';', 'asm' or '__attribute__' before '*' token
net-snmp_wrap.c:8065: error: expected '=', ',', ';', 'asm' or '__attribute__' before '*' token
net-snmp_wrap.c:8087: error: expected '=', ',', ';', 'asm' or '__attribute__' before '*' token
net-snmp_wrap.c:8108: error: expected '=', ',', ';', 'asm' or '__attribute__' before '*' token
net-snmp_wrap.c:8130: error: expected '=', ',', ';', 'asm' or '__attribute__' before '*' token
net-snmp_wrap.c:8151: error: expected '=', ',', ';', 'asm' or '__attribute__' before '*' token
net-snmp_wrap.c:8173: error: expected '=', ',', ';', 'asm' or '__attribute__' before '*' token
net-snmp_wrap.c:8194: error: expected '=', ',', ';', 'asm' or '__attribute__' before '*' token
net-snmp_wrap.c:8216: error: expected '=', ',', ';', 'asm' or '__attribute__' before '*' token
net-snmp_wrap.c:8237: error: expected '=', ',', ';', 'asm' or '__attribute__' before '*' token
net-snmp_wrap.c:8268: error: expected '=', ',', ';', 'asm' or '__attribute__' before '*' token
net-snmp_wrap.c:8291: error: expected '=', ',', ';', 'asm' or '__attribute__' before '*' token
net-snmp_wrap.c:8313: error: expected '=', ',', ';', 'asm' or '__attribute__' before '*' token
net-snmp_wrap.c:8334: error: expected '=', ',', ';', 'asm' or '__attribute__' before '*' token
net-snmp_wrap.c:8356: error: expected '=', ',', ';', 'asm' or '__attribute__' before '*' token
net-snmp_wrap.c:8377: error: expected '=', ',', ';', 'asm' or '__attribute__' before '*' token
net-snmp_wrap.c:8399: error: expected '=', ',', ';', 'asm' or '__attribute__' before '*' token
net-snmp_wrap.c:8420: error: expected '=', ',', ';', 'asm' or '__attribute__' before '*' token
net-snmp_wrap.c:8442: error: expected '=', ',', ';', 'asm' or '__attribute__' before '*' token
net-snmp_wrap.c:8463: error: expected '=', ',', ';', 'asm' or '__attribute__' before '*' token
net-snmp_wrap.c:8494: error: expected '=', ',', ';', 'asm' or '__attribute__' before '*' token
net-snmp_wrap.c:8517: error: expected '=', ',', ';', 'asm' or '__attribute__' before '*' token
net-snmp_wrap.c:8548: error: expected '=', ',', ';', 'asm' or '__attribute__' before '*' token
net-snmp_wrap.c:8576: error: expected '=', ',', ';', 'asm' or '__attribute__' before '*' token
net-snmp_wrap.c:8598: error: expected '=', ',', ';', 'asm' or '__attribute__' before '*' token
net-snmp_wrap.c:8619: error: expected '=', ',', ';', 'asm' or '__attribute__' before '*' token
net-snmp_wrap.c:8641: error: expected '=', ',', ';', 'asm' or '__attribute__' before '*' token
net-snmp_wrap.c:8662: error: expected '=', ',', ';', 'asm' or '__attribute__' before '*' token
net-snmp_wrap.c:8684: error: expected '=', ',', ';', 'asm' or '__attribute__' before '*' token
net-snmp_wrap.c:8705: error: expected '=', ',', ';', 'asm' or '__attribute__' before '*' token
net-snmp_wrap.c:8736: error: expected '=', ',', ';', 'asm' or '__attribute__' before '*' token
net-snmp_wrap.c:8759: error: expected '=', ',', ';', 'asm' or '__attribute__' before '*' token
net-snmp_wrap.c:8790: error: expected '=', ',', ';', 'asm' or '__attribute__' before '*' token
net-snmp_wrap.c:8813: error: expected '=', ',', ';', 'asm' or '__attribute__' before '*' token
net-snmp_wrap.c:8835: error: expected '=', ',', ';', 'asm' or '__attribute__' before '*' token
net-snmp_wrap.c:8856: error: expected '=', ',', ';', 'asm' or '__attribute__' before '*' token
net-snmp_wrap.c:8878: error: expected '=', ',', ';', 'asm' or '__attribute__' before '*' token
net-snmp_wrap.c:8899: error: expected '=', ',', ';', 'asm' or '__attribute__' before '*' token
net-snmp_wrap.c:8921: error: expected '=', ',', ';', 'asm' or '__attribute__' before '*' token
net-snmp_wrap.c:8947: error: expected '=', ',', ';', 'asm' or '__attribute__' before '*' token
net-snmp_wrap.c:8969: error: expected '=', ',', ';', 'asm' or '__attribute__' before '*' token
net-snmp_wrap.c:8990: error: expected '=', ',', ';', 'asm' or '__attribute__' before '*' token
net-snmp_wrap.c:9012: error: expected '=', ',', ';', 'asm' or '__attribute__' before '*' token
net-snmp_wrap.c:9033: error: expected '=', ',', ';', 'asm' or '__attribute__' before '*' token
net-snmp_wrap.c:9055: error: expected '=', ',', ';', 'asm' or '__attribute__' before '*' token
net-snmp_wrap.c:9076: error: expected '=', ',', ';', 'asm' or '__attribute__' before '*' token
net-snmp_wrap.c:9098: error: expected '=', ',', ';', 'asm' or '__attribute__' before '*' token
net-snmp_wrap.c:9119: error: expected '=', ',', ';', 'asm' or '__attribute__' before '*' token
net-snmp_wrap.c:9141: error: expected '=', ',', ';', 'asm' or '__attribute__' before '*' token
net-snmp_wrap.c:9167: error: expected '=', ',', ';', 'asm' or '__attribute__' before '*' token
net-snmp_wrap.c:9189: error: expected '=', ',', ';', 'asm' or '__attribute__' before '*' token
net-snmp_wrap.c:9210: error: expected '=', ',', ';', 'asm' or '__attribute__' before '*' token
net-snmp_wrap.c:9232: error: expected '=', ',', ';', 'asm' or '__attribute__' before '*' token
net-snmp_wrap.c:9253: error: expected '=', ',', ';', 'asm' or '__attribute__' before '*' token
net-snmp_wrap.c:9284: error: expected '=', ',', ';', 'asm' or '__attribute__' before '*' token
net-snmp_wrap.c:9307: error: expected '=', ',', ';', 'asm' or '__attribute__' before '*' token
net-snmp_wrap.c:9338: error: expected '=', ',', ';', 'asm' or '__attribute__' before '*' token
net-snmp_wrap.c:9366: error: expected '=', ',', ';', 'asm' or '__attribute__' before '*' token
net-snmp_wrap.c:9388: error: expected '=', ',', ';', 'asm' or '__attribute__' before '*' token
net-snmp_wrap.c:9409: error: expected '=', ',', ';', 'asm' or '__attribute__' before '*' token
net-snmp_wrap.c:9431: error: expected '=', ',', ';', 'asm' or '__attribute__' before '*' token
net-snmp_wrap.c:9457: error: expected '=', ',', ';', 'asm' or '__attribute__' before '*' token
net-snmp_wrap.c:9479: error: expected '=', ',', ';', 'asm' or '__attribute__' before '*' token
net-snmp_wrap.c:9500: error: expected '=', ',', ';', 'asm' or '__attribute__' before '*' token
net-snmp_wrap.c:9522: error: expected '=', ',', ';', 'asm' or '__attribute__' before '*' token
net-snmp_wrap.c:9548: error: expected '=', ',', ';', 'asm' or '__attribute__' before '*' token
net-snmp_wrap.c:9570: error: expected '=', ',', ';', 'asm' or '__attribute__' before '*' token
net-snmp_wrap.c:9591: error: expected '=', ',', ';', 'asm' or '__attribute__' before '*' token
net-snmp_wrap.c:9613: error: expected '=', ',', ';', 'asm' or '__attribute__' before '*' token
net-snmp_wrap.c:9634: error: expected '=', ',', ';', 'asm' or '__attribute__' before '*' token
net-snmp_wrap.c:9665: error: expected '=', ',', ';', 'asm' or '__attribute__' before '*' token
net-snmp_wrap.c:9688: error: expected '=', ',', ';', 'asm' or '__attribute__' before '*' token
net-snmp_wrap.c:9710: error: expected '=', ',', ';', 'asm' or '__attribute__' before '*' token
net-snmp_wrap.c:9731: error: expected '=', ',', ';', 'asm' or '__attribute__' before '*' token
net-snmp_wrap.c:9752: error: expected '=', ',', ';', 'asm' or '__attribute__' before '*' token
net-snmp_wrap.c:9774: error: expected '=', ',', ';', 'asm' or '__attribute__' before '*' token
net-snmp_wrap.c:9795: error: expected '=', ',', ';', 'asm' or '__attribute__' before '*' token
net-snmp_wrap.c:9826: error: expected '=', ',', ';', 'asm' or '__attribute__' before '*' token
net-snmp_wrap.c:9849: error: expected '=', ',', ';', 'asm' or '__attribute__' before '*' token
net-snmp_wrap.c:9871: error: expected '=', ',', ';', 'asm' or '__attribute__' before '*' token
net-snmp_wrap.c:9892: error: expected '=', ',', ';', 'asm' or '__attribute__' before '*' token
net-snmp_wrap.c:9913: error: expected '=', ',', ';', 'asm' or '__attribute__' before '*' token
net-snmp_wrap.c:9935: error: expected '=', ',', ';', 'asm' or '__attribute__' before '*' token
net-snmp_wrap.c:9956: error: expected '=', ',', ';', 'asm' or '__attribute__' before '*' token
net-snmp_wrap.c:9978: error: expected '=', ',', ';', 'asm' or '__attribute__' before '*' token
net-snmp_wrap.c:9999: error: expected '=', ',', ';', 'asm' or '__attribute__' before '*' token
net-snmp_wrap.c:10021: error: expected '=', ',', ';', 'asm' or '__attribute__' before '*' token
net-snmp_wrap.c:10042: error: expected '=', ',', ';', 'asm' or '__attribute__' before '*' token
net-snmp_wrap.c:10073: error: expected '=', ',', ';', 'asm' or '__attribute__' before '*' token
net-snmp_wrap.c:10096: error: expected '=', ',', ';', 'asm' or '__attribute__' before '*' token
net-snmp_wrap.c:10127: error: expected '=', ',', ';', 'asm' or '__attribute__' before '*' token
net-snmp_wrap.c:10153: error: expected '=', ',', ';', 'asm' or '__attribute__' before '*' token
net-snmp_wrap.c:10170: error: expected '=', ',', ';', 'asm' or '__attribute__' before '*' token
net-snmp_wrap.c:10191: error: expected '=', ',', ';', 'asm' or '__attribute__' before '*' token
net-snmp_wrap.c:10222: error: expected '=', ',', ';', 'asm' or '__attribute__' before '*' token
net-snmp_wrap.c:10245: error: expected '=', ',', ';', 'asm' or '__attribute__' before '*' token
net-snmp_wrap.c:10276: error: expected '=', ',', ';', 'asm' or '__attribute__' before '*' token
net-snmp_wrap.c:10299: error: expected '=', ',', ';', 'asm' or '__attribute__' before '*' token
net-snmp_wrap.c:10321: error: expected '=', ',', ';', 'asm' or '__attribute__' before '*' token
net-snmp_wrap.c:10342: error: expected '=', ',', ';', 'asm' or '__attribute__' before '*' token
net-snmp_wrap.c:10364: error: expected '=', ',', ';', 'asm' or '__attribute__' before '*' token
net-snmp_wrap.c:10385: error: expected '=', ',', ';', 'asm' or '__attribute__' before '*' token
net-snmp_wrap.c:10407: error: expected '=', ',', ';', 'asm' or '__attribute__' before '*' token
net-snmp_wrap.c:10428: error: expected '=', ',', ';', 'asm' or '__attribute__' before '*' token
net-snmp_wrap.c:10451: error: expected '=', ',', ';', 'asm' or '__attribute__' before '*' token
net-snmp_wrap.c:10472: error: expected '=', ',', ';', 'asm' or '__attribute__' before '*' token
net-snmp_wrap.c:10503: error: expected '=', ',', ';', 'asm' or '__attribute__' before '*' token
net-snmp_wrap.c:10526: error: expected '=', ',', ';', 'asm' or '__attribute__' before '*' token
net-snmp_wrap.c:10548: error: expected '=', ',', ';', 'asm' or '__attribute__' before '*' token
net-snmp_wrap.c:10569: error: expected '=', ',', ';', 'asm' or '__attribute__' before '*' token
net-snmp_wrap.c:10592: error: expected '=', ',', ';', 'asm' or '__attribute__' before '*' token
net-snmp_wrap.c:10623: error: expected '=', ',', ';', 'asm' or '__attribute__' before '*' token
net-snmp_wrap.c:10651: error: expected '=', ',', ';', 'asm' or '__attribute__' before '*' token
net-snmp_wrap.c:10673: error: expected '=', ',', ';', 'asm' or '__attribute__' before '*' token
net-snmp_wrap.c:10694: error: expected '=', ',', ';', 'asm' or '__attribute__' before '*' token
net-snmp_wrap.c:10725: error: expected '=', ',', ';', 'asm' or '__attribute__' before '*' token
net-snmp_wrap.c:10753: error: expected '=', ',', ';', 'asm' or '__attribute__' before '*' token
net-snmp_wrap.c:10775: error: expected '=', ',', ';', 'asm' or '__attribute__' before '*' token
net-snmp_wrap.c:10796: error: expected '=', ',', ';', 'asm' or '__attribute__' before '*' token
net-snmp_wrap.c:10827: error: expected '=', ',', ';', 'asm' or '__attribute__' before '*' token
net-snmp_wrap.c:10850: error: expected '=', ',', ';', 'asm' or '__attribute__' before '*' token
net-snmp_wrap.c:10873: error: expected '=', ',', ';', 'asm' or '__attribute__' before '*' token
net-snmp_wrap.c:10895: error: expected '=', ',', ';', 'asm' or '__attribute__' before '*' token
net-snmp_wrap.c:10918: error: expected '=', ',', ';', 'asm' or '__attribute__' before '*' token
net-snmp_wrap.c:10938: error: expected '=', ',', ';', 'asm' or '__attribute__' before 'netsnmpcMethods'
net-snmp_wrap.c:11344: error: expected '=', ',', ';', 'asm' or '__attribute__' before '*' token
net-snmp_wrap.c: In function 'initnetsnmpc':
net-snmp_wrap.c:11349: error: 'PyObject' undeclared (first use in this function)
net-snmp_wrap.c:11349: error: 'm' undeclared (first use in this function)
net-snmp_wrap.c:11349: error: 'd' undeclared (first use in this function)
net-snmp_wrap.c:11350: error: 'SWIG_globals' undeclared (first use in this function)
net-snmp_wrap.c:11351: error: 'netsnmpcMethods' undeclared (first use in this function)
make[5]: *** [net-snmp_wrap.lo] Error 1
make[5]: Leaving directory `/home/ubuntu/openwrt/kamikaze_7.07_brcm/build_mipsel/yapsnmp-0.7.8/src'
make[4]: *** [all-recursive] Error 1
make[4]: Leaving directory `/home/ubuntu/openwrt/kamikaze_7.07_brcm/build_mipsel/yapsnmp-0.7.8'
make[3]: *** [all] Error 2
make[3]: Leaving directory `/home/ubuntu/openwrt/kamikaze_7.07_brcm/build_mipsel/yapsnmp-0.7.8'
make[2]: *** [/home/ubuntu/openwrt/kamikaze_7.07_brcm/build_mipsel/yapsnmp-0.7.8/.built] Error 2
make[2]: Leaving directory `/home/ubuntu/openwrt/kamikaze_7.07_brcm/feeds/packages/libs/yapsnmp'
  *** yapsnmp compile failed 
make[1]: *** [yapsnmp-compile] Error 1
make[1]: Leaving directory `/home/ubuntu/openwrt/kamikaze_7.07_brcm/package'
Build failed. Please re-run make with V=99 to see what's going on
make: *** [package/yapsnmp-compile] Fehler 1