hecking Pango flags... -I/usr/include/pango-1.0 -I/usr/include/glib-2.0 -I/usr/lib64/glib-2.0/include -I/usr/include/cairo -lpangocairo-1.0 -lpango-1.0 -lcairo -lgobject-2.0 -lgmodule-2.0 -ldl -lglib-2.0
configure: error:
*** Can't link to Pango. Pango is required to build
*** GTK+. For more information see http://www.pango.org
!!! Please attach the following file when filing a report to bugs.gentoo.org:
!!! /var/tmp/portage/gtk+-2.8.19/work/gtk+-2.8.19/config.log
!!! ERROR: x11-libs/gtk+-2.8.19 failed.
Call stack:
ebuild.sh, line 1540: Called dyn_compile
ebuild.sh, line 940: Called src_compile
gtk+-2.8.19.ebuild, line 114: Called econf '--disable-gtk-doc' '--with-libjpeg' '--with-libtiff' '--disable-xinerama' '--with-libpng' '--with-gdktarget=x11' '--with-xinput'
ebuild.sh, line 541: Called die
!!! econf failed
!!! If you need support, post the topmost build error, and the call stack if relevant.
checking for sensors_init in -lsensors... no
configure: error: --with-sensors was given, but test for lm_sensors failed
!!! Please attach the following file when filing a report to bugs.gentoo.org:
!!! /var/tmp/portage/ksysguard-3.5.3-r1/work/ksysguard-3.5.3/config.log
!!! ERROR: kde-base/ksysguard-3.5.3-r1 failed.
Call stack:
ebuild.sh, line 1540: Called dyn_compile
ebuild.sh, line 940: Called src_compile
ksysguard-3.5.3-r1.ebuild, line 23: Called kde-meta_src_compile
kde-meta.eclass, line 408: Called kde_src_compile
kde.eclass, line 164: Called kde_src_compile 'all'
kde.eclass, line 299: Called kde_src_compile 'myconf' 'configure' 'make'
kde.eclass, line 281: Called econf '--with-sensors' '--disable-dnssd' '--without-java' '--with-x' '--enable-mitshm' '--without-xinerama' '--with-qt-dir=/usr/qt/3' '--enable-mt' '--with-qt-libraries=/usr/qt/3/lib64' '--disable-dependency-tracking' '--disable-debug' '--without-debug' '--enable-final' '--with-arts' '--prefix=/usr/kde/3.5' '--mandir=/usr/kde/3.5/share/man' '--infodir=/usr/kde/3.5/share/info' '--datadir=/usr/kde/3.5/share' '--sysconfdir=/usr/kde/3.5/etc' '--enable-libsuffix=64'
ebuild.sh, line 541: Called die
!!! econf failed
!!! If you need support, post the topmost build error, and the call stack if relevant.
so /usr/lib64/libgmodule-2.0.so -ldl /usr/lib64/libglib-2.0.so /usr/lib64/libfontconfig.so /usr/lib64/libexpat.so /usr/lib64/libfreetype.so -lz
/usr/lib64/libpangocairo-1.0.so: undefined reference to `cairo_scaled_font_text_extents'
/usr/lib64/libpangocairo-1.0.so: undefined reference to `cairo_scaled_font_get_ctm'
collect2: ld returned 1 exit status
make[4]: *** [test-poppler-glib] Error 1
make[4]: Leaving directory `/var/tmp/portage/poppler-bindings-0.5.3/work/poppler-0.5.3/glib'
make[3]: *** [all-recursive] Error 1
make[3]: Leaving directory `/var/tmp/portage/poppler-bindings-0.5.3/work/poppler-0.5.3/glib'
make[2]: *** [all] Error 2
make[2]: Leaving directory `/var/tmp/portage/poppler-bindings-0.5.3/work/poppler-0.5.3/glib'
make[1]: *** [all-recursive] Error 1
make[1]: Leaving directory `/var/tmp/portage/poppler-bindings-0.5.3/work/poppler-0.5.3'
make: *** [all] Error 2
!!! ERROR: app-text/poppler-bindings-0.5.3 failed.
Call stack:
ebuild.sh, line 1540: Called dyn_compile
ebuild.sh, line 940: Called src_compile
poppler-bindings-0.5.3.ebuild, line 61: Called die
checking for avcodec.h... no
configure: error: External ffmpeg library not found.
*********************************************************************
You can try to specify prefix of ffmpeg library by the option
--with-external-ffmpeg=prefix, or to specify custom FFMPEG_CPPFLAGS,
FFMPEG_LIBS and FFMPEG_POSTPROC_LIBS.
If you would like to use the internal ffmpeg, please remove the
configure option --with-external-ffmpeg.
*********************************************************************
!!! Please attach the following file when filing a report to bugs.gentoo.org:
!!! /var/tmp/portage/xine-lib-1.1.2_pre20060606-r3/work/xine-lib-1.1.2cvs20060606/config.log
!!! ERROR: media-libs/xine-lib-1.1.2_pre20060606-r3 failed.
Call stack:
ebuild.sh, line 1540: Called dyn_compile
ebuild.sh, line 940: Called src_compile
xine-lib-1.1.2_pre20060606-r3.ebuild, line 199: Called econf '--enable-gnome' '--enable-nls' '--enable-ipv6' '--disable-samba' '--disable-altivec' '--disable-v4l' '--disable-mng' '--enable-imagemagick' '--enable-faad' '--enable-flac' '--with-ogg' '--with-vorbis' '--disable-speex' '--enable-a52' '--with-external-a52dec' '--enable-mad' '--with-external-libmad' '--disable-dts' '--with-external-libdts' '--with-x' '--disable-xinerama' '--disable-vidix' '--disable-dxr3' '--disable-directfb' '--disable-fb' '--enable-opengl' '--disable-aalib' '--disable-caca' '--enable-sdl' '--disable-oss' '--enable-alsa' '--enable-arts' '--disable-esd' '--enable-vcd' '--without-internal-vcdlibs' '--enable-asf' '--disable-w32dll' '--disable-modplug' '--with-external-ffmpeg' '--disable-polypaudio' '--disable-optimizations' '--with-xvmc-lib=XvMCNVIDIA' '--with-xxmc-lib=XvMCNVIDIA' '--with-xvmc-path=//usr/lib64' '--with-xxmc-path=//usr/lib64' '--with-xv-path=//usr/lib64' '--with-w32-path=/usr/lib/win32' '--enable-fast-install' '--disable-dependency-tracking'
ebuild.sh, line 541: Called die
ib64/libICE.so /usr/lib64/libXmu.so /usr/lib64/libXt.so /usr/lib64/libXi.so -lpthread /usr/lib64/opengl/nvidia/lib/libGL.so -L/usr/lib64 -lm /usr/lib64/libX11.so /usr/lib64/libXext.so -ldl -Wl,--rpath -Wl,/usr/lib64/opengl/nvidia/lib -Wl,--rpath -Wl,/usr/lib64/opengl/nvidia/lib
make[2]: Leaving directory `/var/tmp/portage/vte-0.12.2/work/vte-0.12.2/src'
make[1]: *** [all-recursive] Error 1
make[1]: Leaving directory `/var/tmp/portage/vte-0.12.2/work/vte-0.12.2'
make: *** [all] Error 2
!!! ERROR: x11-libs/vte-0.12.2 failed.
Call stack:
ebuild.sh, line 1540: Called dyn_compile
ebuild.sh, line 940: Called src_compile
ebuild.sh, line 1249: Called gnome2_src_compile
gnome2.eclass, line 64: Called die
!!! compile failure
!!! If you need support, post the topmost build error, and the call stack if relevant.
checking for GTK+ - version >= 2.4.4... no
*** Could not run GTK+ test program, checking why...
*** The test program failed to compile or link. See the file config.log for the
*** exact error that occured. This usually means GTK+ is incorrectly installed.
configure: error: Test for GTK+ failed. See the file 'INSTALL' for help.
!!! Please attach the following file when filing a report to bugs.gentoo.org:
!!! /var/tmp/portage/gimp-2.2.11-r1/work/gimp-2.2.11/config.log
!!! ERROR: media-gfx/gimp-2.2.11-r1 failed.
Call stack:
ebuild.sh, line 1540: Called dyn_compile
ebuild.sh, line 940: Called src_compile
gimp-2.2.11-r1.ebuild, line 114: Called econf '--disable-default-binary' '--with-x' '--enable-mmx' '--enable-sse' '--disable-altivec' '--disable-gtk-doc' '--enable-python' '--enable-print' '--with-libpng' '--with-libjpeg' '--with-libexif' '--enable-mp' '--with-libtiff' '--without-libmng' '--without-aa' '--without-lcms' '--without-gtkhtml2' '--with-librsvg' '--disable-debug'
ebuild.sh, line 541: Called die
!!! econf failed
!!! If you need support, post the topmost build error, and the call stack if relevant.
DLINUX=1 -DPCAP_TIMEOUT_IGNORED=1 -DVERSION=\"4.10\" -DHAVE_CONFIG_H=1 -I. -c nmapfe.c
nmapfe.c:114:2: #error "Your system does not appear to have GTK (www.gtk.org) installed. Thus the Nmap X Front End will not compile. You should still be able to use Nmap the normal way (via text console). GUIs are for wimps anyway :)"
make[1]: *** [nmapfe.o] Error 1
make[1]: Leaving directory `/var/tmp/portage/nmap-4.10/work/nmap-4.10/nmapfe'
make: *** [nmapfe/nmapfe] Error 2
!!! ERROR: net-analyzer/nmap-4.10 failed.
Call stack:
ebuild.sh, line 1540: Called dyn_compile
ebuild.sh, line 940: Called src_compile
nmap-4.10.ebuild, line 35: Called die
mkdir .libs
x86_64-pc-linux-gnu-gcc -DHAVE_CONFIG_H -I. -I. -I.. -I -I../src -I/usr/include -march=athlon64 -O2 -pipe -fomit-frame-pointer -msse3 -DXGLServer -I -I../src -MT vesa.lo -MD -MP -MF .deps/vesa.Tpo -c vesa.c -fPIC -DPIC -o .libs/vesa.o
In file included from vesa.c:35:
../config.h:4:25: xorg-server.h: No such file or directory
In file included from vesa.c:38:
vesa.h:36:18: xf86.h: No such file or directory
vesa.h:37:25: xf86_OSproc.h: No such file or directory
vesa.h:38:27: xf86Resources.h: No such file or directory
vesa.h:41:24: xf86_ansic.h: No such file or directory
vesa.h:43:22: compiler.h: No such file or directory
vesa.h:46:25: xf86PciInfo.h: No such file or directory
vesa.h:48:19: vgaHW.h: No such file or directory
vesa.h:51:21: xf86Pci.h: No such file or directory
vesa.h:54:17: vbe.h: No such file or directory
vesa.h:55:22: vbeModes.h: No such file or directory
vesa.h:56:21: xf86DDC.h: No such file or directory
vesa.h:62:23: xf86int10.h: No such file or directory
vesa.h:65:20: mibank.h: No such file or directory
vesa.h:68:21: dgaproc.h: No such file or directory
vesa.h:71:21: xf86RAC.h: No such file or directory
vesa.h:73:20: xf1bpp.h: No such file or directory
vesa.h:74:20: xf4bpp.h: No such file or directory
vesa.h:75:16: fb.h: No such file or directory
vesa.h:81:17: mfb.h: No such file or directory
In file included from vesa.c:38:
vesa.h:94: error: syntax error before "vbeInfoPtr"
vesa.h:94: warning: no semicolon at end of struct or union
vesa.h:95: warning: data definition has no type or storage class
vesa.h:96: error: syntax error before "major"
vesa.h:96: warning: data definition has no type or storage class
vesa.h:97: error: syntax error before '*' token
vesa.h:97: warning: data definition has no type or storage class
vesa.h:98: error: syntax error before "device"
vesa.h:98: warning: data definition has no type or storage class
vesa.h:99: error: syntax error before "pciInfo"
vesa.h:99: warning: data definition has no type or storage class
vesa.h:100: error: syntax error before "pciTag"
vesa.h:100: warning: data definition has no type or storage class
vesa.h:101: error: syntax error before "bank"
vesa.h:101: warning: data definition has no type or storage class
vesa.h:103: error: syntax error before "maxBytesPerScanline"
vesa.h:103: warning: data definition has no type or storage class
vesa.h:106: error: syntax error before '*' token
vesa.h:106: warning: data definition has no type or storage class
vesa.h:109: error: syntax error before '*' token
vesa.h:109: warning: data definition has no type or storage class
vesa.h:110: error: syntax error before '*' token
vesa.h:110: warning: data definition has no type or storage class
vesa.h:111: error: syntax error before "monitor"
vesa.h:111: warning: data definition has no type or storage class
vesa.h:112: error: syntax error before "shadowFB"
vesa.h:112: warning: data definition has no type or storage class
vesa.h:113: error: syntax error before '*' token
vesa.h:113: warning: data definition has no type or storage class
vesa.h:114: error: syntax error before "windowAoffset"
vesa.h:114: warning: data definition has no type or storage class
vesa.h:116: error: syntax error before "defaultRefresh"
vesa.h:116: warning: data definition has no type or storage class
vesa.h:118: error: syntax error before "pDGAMode"
vesa.h:118: warning: data definition has no type or storage class
vesa.h:120: error: syntax error before "CloseScreen"
vesa.h:120: warning: data definition has no type or storage class
vesa.h:121: error: syntax error before "Options"
vesa.h:121: warning: data definition has no type or storage class
vesa.h:122: error: syntax error before "ioBase"
vesa.h:122: warning: data definition has no type or storage class
vesa.h:123: error: syntax error before "ModeSetClearScreen"
vesa.h:123: warning: data definition has no type or storage class
vesa.h:124: warning: data definition has no type or storage class
vesa.c:41:23: mipointer.h: No such file or directory
vesa.c:44:22: mibstore.h: No such file or directory
vesa.c:47:20: micmap.h: No such file or directory
vesa.c:48:22: xf86cmap.h: No such file or directory
vesa.c:55: error: syntax error before '*' token
vesa.c:55: warning: data definition has no type or storage class
vesa.c:57: error: syntax error before "VESAProbe"
vesa.c:57: error: syntax error before "drv"
vesa.c:57: warning: data definition has no type or storage class
vesa.c:58: error: syntax error before "VESAPreInit"
vesa.c:58: error: syntax error before "pScrn"
vesa.c:58: warning: data definition has no type or storage class
vesa.c:59: error: syntax error before "VESAScreenInit"
vesa.c:59: error: syntax error before "ScreenPtr"
vesa.c:60: warning: data definition has no type or storage class
vesa.c:61: error: syntax error before "VESAEnterVT"
vesa.c:61: warning: data definition has no type or storage class
vesa.c:63: error: syntax error before "VESACloseScreen"
vesa.c:63: error: syntax error before "ScreenPtr"
vesa.c:63: warning: data definition has no type or storage class
vesa.c:64: error: syntax error before "VESASaveScreen"
vesa.c:64: error: syntax error before "pScreen"
vesa.c:64: warning: data definition has no type or storage class
vesa.c:66: error: syntax error before "VESASwitchMode"
vesa.c:66: error: syntax error before "DisplayModePtr"
vesa.c:66: warning: data definition has no type or storage class
vesa.c:67: error: syntax error before "VESASetMode"
vesa.c:67: error: syntax error before "pScrn"
vesa.c:67: warning: data definition has no type or storage class
vesa.c:70: error: syntax error before "pScrn"
vesa.c:73: error: syntax error before "pScrn"
vesa.c:77: error: syntax error before "dev"
vesa.c:78: error: syntax error before "VESAMapVidMem"
vesa.c:78: error: syntax error before "pScrn"
vesa.c:78: warning: data definition has no type or storage class
vesa.c:79: error: syntax error before "pScrn"
vesa.c:80: error: syntax error before "pScreen"
vesa.c:81: error: syntax error before "pScrn"
vesa.c:83: error: syntax error before "pScrn"
vesa.c:84: error: syntax error before "pScrn"
vesa.c:86: error: syntax error before "VESASaveRestore"
vesa.c:86: error: syntax error before "pScrn"
vesa.c:86: warning: data definition has no type or storage class
vesa.c:88: error: syntax error before "pScrn"
vesa.c:90: error: syntax error before "pScrn"
vesa.c:92: error: syntax error before "pScrn"
vesa.c:95: error: syntax error before "VESADGAInit"
vesa.c:95: error: syntax error before "pScrn"
vesa.c:95: warning: data definition has no type or storage class
vesa.c:104: error: syntax error before "DriverRec"
vesa.c:106: warning: excess elements in scalar initializer
vesa.c:106: warning: (near initialization for `VESA')
vesa.c:107: warning: excess elements in scalar initializer
vesa.c:107: warning: (near initialization for `VESA')
vesa.c:108: warning: excess elements in scalar initializer
vesa.c:108: warning: (near initialization for `VESA')
vesa.c:109: warning: excess elements in scalar initializer
vesa.c:109: warning: (near initialization for `VESA')
vesa.c:110: error: `NULL' undeclared here (not in a function)
vesa.c:110: warning: excess elements in scalar initializer
vesa.c:110: warning: (near initialization for `VESA')
vesa.c:112: warning: excess elements in scalar initializer
vesa.c:112: warning: (near initialization for `VESA')
vesa.c:112: warning: data definition has no type or storage class
vesa.c:120: error: syntax error before "VESAChipsets"
vesa.c:122: warning: braces around scalar initializer
vesa.c:122: warning: (near initialization for `VESAChipsets[0]')
vesa.c:122: warning: excess elements in scalar initializer
vesa.c:122: warning: (near initialization for `VESAChipsets[0]')
vesa.c:123: warning: braces around scalar initializer
vesa.c:123: warning: (near initialization for `VESAChipsets[1]')
vesa.c:123: warning: excess elements in scalar initializer
vesa.c:123: warning: (near initialization for `VESAChipsets[1]')
vesa.c:124: warning: data definition has no type or storage class
vesa.c:126: error: syntax error before "VESAPCIchipsets"
vesa.c:127: warning: braces around scalar initializer
vesa.c:127: warning: (near initialization for `VESAPCIchipsets[0]')
vesa.c:127: error: `PCI_CHIP_VGA' undeclared here (not in a function)
vesa.c:127: warning: excess elements in scalar initializer
vesa.c:127: warning: (near initialization for `VESAPCIchipsets[0]')
vesa.c:127: error: `RES_SHARED_VGA' undeclared here (not in a function)
vesa.c:127: warning: excess elements in scalar initializer
vesa.c:127: warning: (near initialization for `VESAPCIchipsets[0]')
vesa.c:128: warning: braces around scalar initializer
vesa.c:128: warning: (near initialization for `VESAPCIchipsets[1]')
vesa.c:128: warning: excess elements in scalar initializer
vesa.c:128: warning: (near initialization for `VESAPCIchipsets[1]')
vesa.c:128: error: `RES_UNDEFINED' undeclared here (not in a function)
vesa.c:128: warning: excess elements in scalar initializer
vesa.c:128: warning: (near initialization for `VESAPCIchipsets[1]')
vesa.c:129: warning: data definition has no type or storage class
vesa.c:131: error: syntax error before "VESAISAchipsets"
vesa.c:132: warning: braces around scalar initializer
vesa.c:132: warning: (near initialization for `VESAISAchipsets[0]')
vesa.c:132: error: `RES_EXCLUSIVE_VGA' undeclared here (not in a function)
vesa.c:132: warning: excess elements in scalar initializer
vesa.c:132: warning: (near initialization for `VESAISAchipsets[0]')
vesa.c:133: warning: braces around scalar initializer
vesa.c:133: warning: (near initialization for `VESAISAchipsets[1]')
vesa.c:133: warning: excess elements in scalar initializer
vesa.c:133: warning: (near initialization for `VESAISAchipsets[1]')
vesa.c:134: warning: data definition has no type or storage class
vesa.c:142: error: syntax error before "VESAOptions"
vesa.c:143: warning: braces around scalar initializer
vesa.c:143: warning: (near initialization for `VESAOptions[0]')
vesa.c:143: warning: excess elements in scalar initializer
vesa.c:143: warning: (near initialization for `VESAOptions[0]')
vesa.c:143: error: `OPTV_BOOLEAN' undeclared here (not in a function)
vesa.c:143: warning: excess elements in scalar initializer
vesa.c:143: warning: (near initialization for `VESAOptions[0]')
vesa.c:143: warning: braces around scalar initializer
vesa.c:143: warning: (near initialization for `VESAOptions[0]')
vesa.c:143: warning: excess elements in scalar initializer
vesa.c:143: warning: (near initialization for `VESAOptions[0]')
vesa.c:143: error: `FALSE' undeclared here (not in a function)
vesa.c:143: warning: excess elements in scalar initializer
vesa.c:143: warning: (near initialization for `VESAOptions[0]')
vesa.c:144: warning: braces around scalar initializer
vesa.c:144: warning: (near initialization for `VESAOptions[1]')
vesa.c:144: warning: excess elements in scalar initializer
vesa.c:144: warning: (near initialization for `VESAOptions[1]')
vesa.c:144: warning: excess elements in scalar initializer
vesa.c:144: warning: (near initialization for `VESAOptions[1]')
vesa.c:144: warning: braces around scalar initializer
vesa.c:144: warning: (near initialization for `VESAOptions[1]')
vesa.c:144: warning: excess elements in scalar initializer
vesa.c:144: warning: (near initialization for `VESAOptions[1]')
vesa.c:144: warning: excess elements in scalar initializer
vesa.c:144: warning: (near initialization for `VESAOptions[1]')
vesa.c:145: warning: braces around scalar initializer
vesa.c:145: warning: (near initialization for `VESAOptions[2]')
vesa.c:145: warning: excess elements in scalar initializer
vesa.c:145: warning: (near initialization for `VESAOptions[2]')
vesa.c:146: warning: excess elements in scalar initializer
vesa.c:146: warning: (near initialization for `VESAOptions[2]')
vesa.c:146: warning: braces around scalar initializer
vesa.c:146: warning: (near initialization for `VESAOptions[2]')
vesa.c:146: warning: excess elements in scalar initializer
vesa.c:146: warning: (near initialization for `VESAOptions[2]')
vesa.c:146: warning: excess elements in scalar initializer
vesa.c:146: warning: (near initialization for `VESAOptions[2]')
vesa.c:147: warning: braces around scalar initializer
vesa.c:147: warning: (near initialization for `VESAOptions[3]')
vesa.c:147: warning: excess elements in scalar initializer
vesa.c:147: warning: (near initialization for `VESAOptions[3]')
vesa.c:147: error: `OPTV_NONE' undeclared here (not in a function)
vesa.c:147: warning: excess elements in scalar initializer
vesa.c:147: warning: (near initialization for `VESAOptions[3]')
vesa.c:147: warning: braces around scalar initializer
vesa.c:147: warning: (near initialization for `VESAOptions[3]')
vesa.c:147: warning: excess elements in scalar initializer
vesa.c:147: warning: (near initialization for `VESAOptions[3]')
vesa.c:147: warning: excess elements in scalar initializer
vesa.c:147: warning: (near initialization for `VESAOptions[3]')
vesa.c:148: warning: data definition has no type or storage class
vesa.c:174: error: initializer element is not constant
vesa.c:174: error: (near initialization for `fbSymbols[2]')
vesa.c:183: error: initializer element is not constant
vesa.c:183: error: (near initialization for `shadowSymbols[5]')
vesa.c:205: error: initializer element is not constant
vesa.c:205: error: (near initialization for `vbeSymbols[18]')
vesa.c:263: error: syntax error before '*' token
vesa.c:281: error: syntax error before "VESAProbe"
vesa.c:281: error: syntax error before "drv"
vesa.c: In function `VESAProbe':
vesa.c:283: error: `Bool' undeclared (first use in this function)
vesa.c:283: error: (Each undeclared identifier is reported only once
vesa.c:283: error: for each function it appears in.)
vesa.c:283: error: syntax error before "foundScreen"
vesa.c:285: error: `GDevPtr' undeclared (first use in this function)
vesa.c:285: error: `devSections' undeclared (first use in this function)
vesa.c:299: error: `PCI_VENDOR_GENERIC' undeclared (first use in this function)
vesa.c:302: error: `drv' undeclared (first use in this function)
vesa.c:304: error: `flags' undeclared (first use in this function)
vesa.c:304: error: `PROBE_DETECT' undeclared (first use in this function)
vesa.c:305: error: `foundScreen' undeclared (first use in this function)
vesa.c:305: error: `TRUE' undeclared (first use in this function)
vesa.c:308: error: `ScrnInfoPtr' undeclared (first use in this function)
vesa.c:308: error: syntax error before "pScrn"
vesa.c:310: error: `pScrn' undeclared (first use in this function)
vesa.c:341: error: syntax error before "pScrn"
vesa.c: At top level:
vesa.c:369: error: syntax error before "dev"
vesa.c: In function `VESAFindIsaDevice':
vesa.c:372: error: `CARD16' undeclared (first use in this function)
vesa.c:372: error: syntax error before "GenericIOBase"
vesa.c:373: error: `CARD8' undeclared (first use in this function)
vesa.c:378: error: `GenericIOBase' undeclared (first use in this function)
vesa.c:378: error: `VGA_IN_STAT_1_OFFSET' undeclared (first use in this function)
vesa.c:379: error: `VGA_ATTR_INDEX' undeclared (first use in this function)
vesa.c:380: error: `CurrentValue' undeclared (first use in this function)
vesa.c:380: error: `VGA_ATTR_DATA_R' undeclared (first use in this function)
vesa.c:381: error: `VGA_ATTR_DATA_W' undeclared (first use in this function)
vesa.c:383: error: `TestValue' undeclared (first use in this function)
vesa.c: At top level:
vesa.c:394: error: syntax error before "VESAGetRec"
vesa.c:394: error: syntax error before "pScrn"
vesa.c: In function `VESAGetRec':
vesa.c:396: error: `pScrn' undeclared (first use in this function)
vesa.c:399: error: syntax error before "pScrn"
vesa.c: At top level:
vesa.c:403: error: syntax error before "pScrn"
vesa.c: In function `VESAFreeRec':
vesa.c:405: error: syntax error before "pVesa"
vesa.c:427: error: `pVesa' undeclared (first use in this function)
vesa.c:432: error: `pScrn' undeclared (first use in this function)
vesa.c: At top level:
vesa.c:441: error: syntax error before "VESAPreInit"
vesa.c:441: error: syntax error before "pScrn"
vesa.c: In function `VESAPreInit':
vesa.c:443: error: syntax error before "pVesa"
vesa.c:444: error: `VbeInfoBlock' undeclared (first use in this function)
vesa.c:444: error: `vbe' undeclared (first use in this function)
vesa.c:445: error: `DisplayModePtr' undeclared (first use in this function)
vesa.c:445: error: syntax error before "pMode"
vesa.c:446: error: `VbeModeInfoBlock' undeclared (first use in this function)
vesa.c:446: error: `mode' undeclared (first use in this function)
vesa.c:449: error: `Gamma' undeclared (first use in this function)
vesa.c:449: error: syntax error before "gzeros"
vesa.c: At top level:
vesa.c:450: error: syntax error before "rzeros"
vesa.c:450: warning: excess elements in scalar initializer
vesa.c:450: warning: (near initialization for `rzeros')
vesa.c:450: warning: excess elements in scalar initializer
vesa.c:450: warning: (near initialization for `rzeros')
vesa.c:450: warning: data definition has no type or storage class
vesa.c:451: error: syntax error before "pDDCModule"
vesa.c:451: warning: data definition has no type or storage class
vesa.c:457: error: syntax error before "if"
vesa.c:460: error: `pScrn' undeclared here (not in a function)
vesa.c:460: error: initializer element is not constant
vesa.c:460: warning: data definition has no type or storage class
vesa.c:461: error: syntax error before '->' token
vesa.c:477: warning: parameter names (without types) in function declaration
vesa.c:477: warning: data definition has no type or storage class
vesa.c:479: error: syntax error before "if"
vesa.c:508: error: redefinition of 'depths'
vesa.c:455: error: previous definition of 'depths' was here
vesa.c:508: error: invalid type argument of `->'
vesa.c:508: error: invalid type argument of `->'
vesa.c:509: error: `V_MODETYPE_VBE' undeclared here (not in a function)
vesa.c:509: error: initializer element is not constant
vesa.c:509: warning: data definition has no type or storage class
vesa.c:512: error: syntax error before "if"
vesa.c:540: warning: parameter names (without types) in function declaration
vesa.c:540: warning: data definition has no type or storage class
vesa.c:543: error: syntax error before "if"
vesa.c:553: warning: parameter names (without types) in function declaration
vesa.c:553: warning: data definition has no type or storage class
vesa.c:555: error: syntax error before "if"
vesa.c:566: warning: parameter names (without types) in function declaration
vesa.c:566: warning: data definition has no type or storage class
vesa.c:567: error: syntax error before '}' token
vesa.c:572: error: syntax error before '->' token
vesa.c:573: warning: data definition has no type or storage class
vesa.c:580: error: syntax error before '->' token
vesa.c:583: error: syntax error before numeric constant
vesa.c:583: warning: data definition has no type or storage class
vesa.c:584: error: syntax error before '->' token
vesa.c:591: error: syntax error before '->' token
vesa.c:591: warning: data definition has no type or storage class
vesa.c:595: error: syntax error before '->' token
vesa.c:595: warning: data definition has no type or storage class
vesa.c:601: error: invalid type argument of `->'
vesa.c:601: error: `LOOKUP_BEST_REFRESH' undeclared here (not in a function)
vesa.c:601: error: initializer element is not constant
vesa.c:601: warning: data definition has no type or storage class
vesa.c:603: error: syntax error before "if"
vesa.c:605: error: syntax error before '->' token
vesa.c:605: warning: data definition has no type or storage class
vesa.c:609: warning: parameter names (without types) in function declaration
vesa.c:609: warning: data definition has no type or storage class
vesa.c:611: warning: data definition has no type or storage class
vesa.c:612: error: syntax error before "do"
vesa.c:617: error: redefinition of 'pMode'
vesa.c:611: error: previous definition of 'pMode' was here
vesa.c:617: error: invalid type argument of `->'
vesa.c:617: warning: data definition has no type or storage class
vesa.c:618: error: syntax error before '}' token
vesa.c:623: warning: parameter names (without types) in function declaration
vesa.c:623: warning: data definition has no type or storage class
vesa.c:626: error: syntax error before numeric constant
vesa.c:626: warning: data definition has no type or storage class
vesa.c:630: error: syntax error before '->' token
vesa.c:630: warning: data definition has no type or storage class
vesa.c:635: warning: parameter names (without types) in function declaration
vesa.c:635: warning: data definition has no type or storage class
vesa.c:636: error: syntax error before "if"
vesa.c:640: error: syntax error before '->' token
vesa.c:641: error: syntax error before '->' token
vesa.c:641: warning: data definition has no type or storage class
vesa.c:657: error: `VbeModeInfoData' undeclared here (not in a function)
vesa.c:657: error: syntax error before ')' token
vesa.c:657: warning: data definition has no type or storage class
vesa.c:658: error: syntax error before "switch"
vesa.c:672: error: syntax error before string constant
vesa.c:672: warning: data definition has no type or storage class
vesa.c:678: warning: initialization makes integer from pointer without a cast
vesa.c:678: error: initializer element is not computable at load time
vesa.c:678: warning: data definition has no type or storage class
vesa.c:679: error: syntax error before "break"
vesa.c:682: error: redefinition of 'reqSym'
vesa.c:678: error: previous definition of 'reqSym' was here
vesa.c:682: warning: initialization makes integer from pointer without a cast
vesa.c:682: error: initializer element is not computable at load time
vesa.c:682: warning: data definition has no type or storage class
vesa.c:683: error: syntax error before "break"
vesa.c:710: error: syntax error before '->' token
vesa.c:710: warning: data definition has no type or storage class
vesa.c:720: error: redefinition of 'reqSym'
vesa.c:682: error: previous definition of 'reqSym' was here
vesa.c:720: error: redefinition of 'reqSym'
vesa.c:682: error: previous definition of 'reqSym' was here
vesa.c:720: warning: initialization makes integer from pointer without a cast
vesa.c:720: error: initializer element is not computable at load time
vesa.c:720: warning: data definition has no type or storage class
vesa.c:721: error: syntax error before '}' token
vesa.c:726: warning: parameter names (without types) in function declaration
vesa.c:726: warning: data definition has no type or storage class
vesa.c:727: error: syntax error before '}' token
vesa.c:731: error: syntax error before '->' token
vesa.c:731: warning: data definition has no type or storage class
vesa.c:743: error: syntax error before '->' token
vesa.c:743: warning: data definition has no type or storage class
vesa.c:749: error: syntax error before "VESAScreenInit"
vesa.c:749: error: syntax error before "ScreenPtr"
vesa.c: In function `VESAScreenInit':
vesa.c:751: error: `ScrnInfoPtr' undeclared (first use in this function)
vesa.c:751: error: syntax error before "pScrn"
vesa.c:753: error: `VisualPtr' undeclared (first use in this function)
vesa.c:754: error: `VbeModeInfoBlock' undeclared (first use in this function)
vesa.c:758: error: invalid type argument of `->'
vesa.c:758: error: invalid type argument of `->'
vesa.c:760: error: `SET_BIOS_SCRATCH' undeclared (first use in this function)
vesa.c:760: error: `RESTORE_BIOS_SCRATCH' undeclared (first use in this function)
vesa.c:763: error: invalid type argument of `->'
vesa.c:764: error: syntax error before ')' token
vesa.c:765: error: invalid type argument of `->'
vesa.c:766: error: invalid type argument of `->'
vesa.c:766: error: invalid type argument of `->'
vesa.c:767: error: invalid type argument of `->'
vesa.c:770: error: invalid type argument of `->'
vesa.c:771: error: invalid type argument of `->'
vesa.c:772: error: invalid type argument of `->'
vesa.c:776: error: invalid type argument of `->'
vesa.c:777: error: invalid type argument of `->'
vesa.c:778: error: invalid type argument of `->'
vesa.c:787: error: invalid type argument of `->'
vesa.c:790: error: invalid type argument of `->'
vesa.c:790: error: invalid type argument of `->'
vesa.c:796: error: `MODE_SAVE' undeclared (first use in this function)
vesa.c:797: error: invalid type argument of `->'
vesa.c:797: error: invalid type argument of `->'
vesa.c:805: error: `scrnIndex' undeclared (first use in this function)
vesa.c:808: error: `pScreen' undeclared (first use in this function)
vesa.c:808: error: `SCREEN_SAVER_ON' undeclared (first use in this function)
vesa.c:815: error: `TrueColorMask' undeclared (first use in this function)
vesa.c:816: error: `TrueColor' undeclared (first use in this function)
vesa.c:828: error: syntax error before ')' token
vesa.c:829: error: invalid type argument of `->'
vesa.c:835: error: `X_ERROR' undeclared (first use in this function)
vesa.c:836: error: invalid type argument of `->'
vesa.c:839: error: invalid type argument of `->'
vesa.c:842: error: invalid type argument of `->'
vesa.c:849: error: invalid type argument of `->'
vesa.c:859: error: invalid type argument of `->'
vesa.c:866: error: invalid type argument of `->'
vesa.c:891: error: invalid type argument of `->'
vesa.c:891: error: invalid type argument of `->'
vesa.c:891: error: invalid type argument of `->'
vesa.c:909: error: `visual' undeclared (first use in this function)
vesa.c:911: error: `DynamicClass' undeclared (first use in this function)
vesa.c:911: error: `DirectColor' undeclared (first use in this function)
vesa.c:926: error: invalid type argument of `->'
vesa.c:927: error: `ShadowUpdateProc' undeclared (first use in this function)
vesa.c:927: error: syntax error before "update"
vesa.c:928: error: `ShadowWindowProc' undeclared (first use in this function)
vesa.c:930: error: invalid type argument of `->'
vesa.c:932: error: `update' undeclared (first use in this function)
vesa.c:935: error: `window' undeclared (first use in this function)
vesa.c:937: error: invalid type argument of `->'
vesa.c:949: error: invalid type argument of `->'
vesa.c:949: error: invalid type argument of `->'
vesa.c:951: error: invalid type argument of `->'
vesa.c:953: error: invalid type argument of `->'
vesa.c:954: error: invalid type argument of `->'
vesa.c:955: error: invalid type argument of `->'
vesa.c:956: error: invalid type argument of `->'
vesa.c:957: error: invalid type argument of `->'
vesa.c:957: error: invalid type argument of `->'
vesa.c:957: error: invalid type argument of `->'
vesa.c:958: error: invalid type argument of `->'
vesa.c:958: error: invalid type argument of `->'
vesa.c:959: error: invalid type argument of `->'
vesa.c:961: error: invalid type argument of `->'
vesa.c:981: error: `CMAP_RELOAD_ON_MODE_SWITCH' undeclared (first use in this function)
vesa.c:984: error: invalid type argument of `->'
vesa.c:988: error: invalid type argument of `->'
vesa.c:995: error: `serverGeneration' undeclared (first use in this function)
vesa.c:998: error: `TRUE' undeclared (first use in this function)
vesa.c: At top level:
vesa.c:1002: error: syntax error before "VESAEnterVT"
vesa.c: In function `VESAEnterVT':
vesa.c:1004: error: `ScrnInfoPtr' undeclared (first use in this function)
vesa.c:1004: error: syntax error before "pScrn"
vesa.c:1009: error: `TRUE' undeclared (first use in this function)
vesa.c: In function `VESALeaveVT':
vesa.c:1015: error: `xf86Screens' undeclared (first use in this function)
vesa.c:1015: error: `MODE_RESTORE' undeclared (first use in this function)
vesa.c: At top level:
vesa.c:1019: error: syntax error before "VESACloseScreen"
vesa.c:1019: error: syntax error before "ScreenPtr"
vesa.c: In function `VESACloseScreen':
vesa.c:1021: error: `ScrnInfoPtr' undeclared (first use in this function)
vesa.c:1021: error: syntax error before "pScrn"
vesa.c:1025: error: `xf86Screens' undeclared (first use in this function)
vesa.c:1025: error: `scrnIndex' undeclared (first use in this function)
vesa.c:1025: error: `MODE_RESTORE' undeclared (first use in this function)
vesa.c:1026: error: invalid type argument of `->'
vesa.c:1027: error: invalid type argument of `->'
vesa.c:1027: error: `TRUE' undeclared (first use in this function)
vesa.c:1028: error: invalid type argument of `->'
vesa.c:1031: error: invalid type argument of `->'
vesa.c:1032: error: invalid type argument of `->'
vesa.c:1033: error: invalid type argument of `->'
vesa.c:1035: error: invalid type argument of `->'
vesa.c:1036: error: invalid type argument of `->'
vesa.c:1037: error: invalid type argument of `->'
vesa.c:1038: error: invalid type argument of `->'
vesa.c:1042: error: `pScreen' undeclared (first use in this function)
vesa.c:1042: error: invalid type argument of `->'
vesa.c: At top level:
vesa.c:1047: error: syntax error before "VESASwitchMode"
vesa.c:1047: error: syntax error before "DisplayModePtr"
vesa.c: In function `VESASwitchMode':
vesa.c:1049: error: `ScrnInfoPtr' undeclared (first use in this function)
vesa.c:1049: error: syntax error before "pScrn"
vesa.c:1051: error: `Bool' undeclared (first use in this function)
vesa.c:1053: error: invalid type argument of `->'
vesa.c:1054: error: `scrnIndex' undeclared (first use in this function)
vesa.c:1055: error: `ret' undeclared (first use in this function)
vesa.c:1055: error: `xf86Screens' undeclared (first use in this function)
vesa.c:1056: error: invalid type argument of `->'
vesa.c:1057: error: `TRUE' undeclared (first use in this function)
vesa.c: At top level:
vesa.c:1063: error: syntax error before "VESASetMode"
vesa.c:1063: error: syntax error before "pScrn"
vesa.c: In function `VESASetMode':
vesa.c:1065: error: syntax error before "pVesa"
vesa.c:1066: error: `data' undeclared (first use in this function)
vesa.c:1071: error: syntax error before ')' token
vesa.c:1072: error: invalid type argument of `->'
vesa.c:1075: error: invalid type argument of `->'
vesa.c:1078: error: invalid type argument of `->'
vesa.c:1079: error: `X_INFO' undeclared (first use in this function)
vesa.c:1081: error: invalid type argument of `->'
vesa.c:1081: error: `TRUE' undeclared (first use in this function)
vesa.c:1092: error: `X_ERROR' undeclared (first use in this function)
vesa.c:1097: error: invalid type argument of `->'
vesa.c:1101: error: invalid type argument of `->'
vesa.c:1103: error: invalid type argument of `->'
vesa.c:1104: error: invalid type argument of `->'
vesa.c: In function `VESAAdjustFrame':
vesa.c:1114: error: syntax error before "pVesa"
vesa.c:1116: error: invalid type argument of `->'
vesa.c:1116: error: `TRUE' undeclared (first use in this function)
vesa.c: In function `VESAFreeScreen':
vesa.c:1122: error: `xf86Screens' undeclared (first use in this function)
vesa.c: At top level:
vesa.c:1126: error: syntax error before "VESAMapVidMem"
vesa.c:1126: error: syntax error before "pScrn"
vesa.c: In function `VESAMapVidMem':
vesa.c:1128: error: syntax error before "pVesa"
vesa.c:1130: error: invalid type argument of `->'
vesa.c:1131: error: `TRUE' undeclared (first use in this function)
vesa.c:1133: error: invalid type argument of `->'
vesa.c:1134: error: invalid type argument of `->'
vesa.c:1136: error: invalid type argument of `->'
vesa.c:1136: error: invalid type argument of `->'
vesa.c:1136: error: `BUS_PCI' undeclared (first use in this function)
vesa.c:1137: error: invalid type argument of `->'
vesa.c:1137: error: `VIDMEM_FRAMEBUFFER' undeclared (first use in this function)
vesa.c:1138: error: invalid type argument of `->'
vesa.c:1139: error: invalid type argument of `->'
vesa.c:1141: error: invalid type argument of `->'
vesa.c:1141: error: invalid type argument of `->'
vesa.c:1142: error: invalid type argument of `->'
vesa.c:1144: error: invalid type argument of `->'
vesa.c:1145: error: invalid type argument of `->'
vesa.c:1146: error: invalid type argument of `->'
vesa.c:1147: error: invalid type argument of `->'
vesa.c:1150: error: invalid type argument of `->'
vesa.c:1150: error: invalid type argument of `->'
vesa.c:1153: error: invalid type argument of `->'
vesa.c:1155: error: `X_INFO' undeclared (first use in this function)
vesa.c:1158: error: invalid type argument of `->'
vesa.c:1158: error: invalid type argument of `->'
vesa.c:1160: error: invalid type argument of `->'
vesa.c: At top level:
vesa.c:1164: error: syntax error before "pScrn"
vesa.c: In function `VESAUnmapVidMem':
vesa.c:1166: error: syntax error before "pVesa"
vesa.c:1168: error: invalid type argument of `->'
vesa.c:1171: error: invalid type argument of `->'
vesa.c:1171: error: invalid type argument of `->'
vesa.c:1172: error: invalid type argument of `->'
vesa.c:1173: error: invalid type argument of `->'
vesa.c:1174: error: invalid type argument of `->'
vesa.c: At top level:
vesa.c:1178: error: syntax error before "pScreen"
vesa.c: In function `VESAWindowPlanar':
vesa.c:1181: error: `ScrnInfoPtr' undeclared (first use in this function)
vesa.c:1181: error: syntax error before "pScrn"
vesa.c:1183: error: `VbeModeInfoBlock' undeclared (first use in this function)
vesa.c:1183: error: `data' undeclared (first use in this function)
vesa.c:1183: error: syntax error before ')' token
vesa.c:1185: error: `offset' undeclared (first use in this function)
vesa.c:1187: error: invalid type argument of `->'
vesa.c:1187: error: `VGA_SEQ_INDEX' undeclared (first use in this function)
vesa.c:1188: error: invalid type argument of `->'
vesa.c:1188: error: `VGA_SEQ_DATA' undeclared (first use in this function)
vesa.c:1189: error: invalid type argument of `->'
vesa.c:1189: error: `row' undeclared (first use in this function)
vesa.c:1191: error: invalid type argument of `->'
vesa.c:1192: error: `pScreen' undeclared (first use in this function)
vesa.c:1193: error: `size' undeclared (first use in this function)
vesa.c:1193: error: invalid type argument of `->'
vesa.c:1195: error: invalid type argument of `->'
vesa.c:1196: error: invalid type argument of `->'
vesa.c: At top level:
vesa.c:1200: error: syntax error before "pScreen"
vesa.c: In function `VESAWindowLinear':
vesa.c:1203: error: `ScrnInfoPtr' undeclared (first use in this function)
vesa.c:1203: error: syntax error before "pScrn"
vesa.c:1206: error: `size' undeclared (first use in this function)
vesa.c:1206: error: invalid type argument of `->'
vesa.c:1207: error: `CARD8' undeclared (first use in this function)
vesa.c:1207: error: syntax error before ')' token
vesa.c: At top level:
vesa.c:1211: error: syntax error before "pScreen"
vesa.c: In function `VESAWindowWindowed':
vesa.c:1214: error: `ScrnInfoPtr' undeclared (first use in this function)
vesa.c:1214: error: syntax error before "pScrn"
vesa.c:1216: error: `VbeModeInfoBlock' undeclared (first use in this function)
vesa.c:1216: error: `data' undeclared (first use in this function)
vesa.c:1216: error: syntax error before ')' token
vesa.c:1219: error: `offset' undeclared (first use in this function)
vesa.c:1219: error: invalid type argument of `->'
vesa.c:1219: error: `row' undeclared (first use in this function)
vesa.c:1221: error: invalid type argument of `->'
vesa.c:1222: error: `pScreen' undeclared (first use in this function)
vesa.c:1223: error: `size' undeclared (first use in this function)
vesa.c:1223: error: invalid type argument of `->'
vesa.c:1225: error: invalid type argument of `->'
vesa.c:1226: error: invalid type argument of `->'
vesa.c: At top level:
vesa.c:1230: error: syntax error before "pScrn"
vesa.c: In function `VESALoadPalette':
vesa.c:1233: error: syntax error before "pVesa"
vesa.c:1271: error: `numColors' undeclared (first use in this function)
vesa.c:1272: error: `indices' undeclared (first use in this function)
vesa.c:1273: error: invalid type argument of `->'
vesa.c:1273: error: `VGA_DAC_WRITE_ADDR' undeclared (first use in this function)
vesa.c:1274: error: invalid type argument of `->'
vesa.c:1274: error: `VGA_IOBASE_COLOR' undeclared (first use in this function)
vesa.c:1274: error: `VGA_IN_STAT_1_OFFSET' undeclared (first use in this function)
vesa.c:1274: error: invalid type argument of `->'
vesa.c:1275: error: invalid type argument of `->'
vesa.c:1275: error: `VGA_DAC_DATA' undeclared (first use in this function)
vesa.c:1275: error: `colors' undeclared (first use in this function)
vesa.c:1276: error: invalid type argument of `->'
vesa.c:1276: error: invalid type argument of `->'
vesa.c:1277: error: invalid type argument of `->'
vesa.c:1278: error: invalid type argument of `->'
vesa.c:1278: error: invalid type argument of `->'
vesa.c:1279: error: invalid type argument of `->'
vesa.c:1280: error: invalid type argument of `->'
vesa.c:1280: error: invalid type argument of `->'
vesa.c: At top level:
vesa.c:1290: error: syntax error before "pVesa"
vesa.c: In function `WriteAttr':
vesa.c:1292: error: invalid type argument of `->'
vesa.c:1292: error: `VGA_IOBASE_COLOR' undeclared (first use in this function)
vesa.c:1292: error: `VGA_IN_STAT_1_OFFSET' undeclared (first use in this function)
vesa.c:1294: error: `index' undeclared (first use in this function)
vesa.c:1295: error: invalid type argument of `->'
vesa.c:1295: error: `VGA_ATTR_INDEX' undeclared (first use in this function)
vesa.c:1296: error: invalid type argument of `->'
vesa.c:1296: error: `VGA_ATTR_DATA_W' undeclared (first use in this function)
vesa.c:1296: error: `value' undeclared (first use in this function)
vesa.c: At top level:
vesa.c:1300: error: syntax error before "pVesa"
vesa.c: In function `ReadAttr':
vesa.c:1302: error: invalid type argument of `->'
vesa.c:1302: error: `VGA_IOBASE_COLOR' undeclared (first use in this function)
vesa.c:1302: error: `VGA_IN_STAT_1_OFFSET' undeclared (first use in this function)
vesa.c:1304: error: `index' undeclared (first use in this function)
vesa.c:1305: error: invalid type argument of `->'
vesa.c:1305: error: `VGA_ATTR_INDEX' undeclared (first use in this function)
vesa.c:1306: error: invalid type argument of `->'
vesa.c:1306: error: `VGA_ATTR_DATA_R' undeclared (first use in this function)
vesa.c: At top level:
vesa.c:1315: error: syntax error before "pVesa"
vesa.c: In function `ReadSeq':
vesa.c:1317: error: invalid type argument of `->'
vesa.c:1317: error: `VGA_SEQ_INDEX' undeclared (first use in this function)
vesa.c:1317: error: `index' undeclared (first use in this function)
vesa.c:1319: error: invalid type argument of `->'
vesa.c:1319: error: `VGA_SEQ_DATA' undeclared (first use in this function)
vesa.c: At top level:
vesa.c:1327: error: syntax error before "pVesa"
vesa.c: In function `ReadGr':
vesa.c:1329: error: invalid type argument of `->'
vesa.c:1329: error: `VGA_GRAPH_INDEX' undeclared (first use in this function)
vesa.c:1329: error: `index' undeclared (first use in this function)
vesa.c:1331: error: invalid type argument of `->'
vesa.c:1331: error: `VGA_GRAPH_DATA' undeclared (first use in this function)
vesa.c: At top level:
vesa.c:1339: error: syntax error before "pVesa"
vesa.c: In function `ReadCrtc':
vesa.c:1341: error: invalid type argument of `->'
vesa.c:1341: error: `VGA_IOBASE_COLOR' undeclared (first use in this function)
vesa.c:1341: error: `VGA_CRTC_INDEX_OFFSET' undeclared (first use in this function)
vesa.c:1341: error: `index' undeclared (first use in this function)
vesa.c:1342: error: invalid type argument of `->'
vesa.c:1342: error: `VGA_CRTC_DATA_OFFSET' undeclared (first use in this function)
vesa.c: At top level:
vesa.c:1346: error: syntax error before "pVesa"
vesa.c: In function `SeqReset':
vesa.c:1348: error: `start' undeclared (first use in this function)
vesa.c:1349: error: invalid type argument of `->'
vesa.c:1349: error: `VGA_SEQ_INDEX' undeclared (first use in this function)
vesa.c:1349: error: invalid type argument of `->'
vesa.c:1349: error: `VGA_SEQ_DATA' undeclared (first use in this function)
vesa.c:1352: error: invalid type argument of `->'
vesa.c:1352: error: invalid type argument of `->'
vesa.c: At top level:
vesa.c:1357: error: syntax error before "pScrn"
vesa.c: In function `SaveFonts':
vesa.c:1359: error: syntax error before "pVesa"
vesa.c:1362: error: invalid type argument of `->'
vesa.c:1370: error: invalid type argument of `->'
vesa.c:1373: error: invalid type argument of `->'
vesa.c:1373: error: `VGA_MISC_OUT_R' undeclared (first use in this function)
vesa.c:1381: error: invalid type argument of `->'
vesa.c:1381: error: `VGA_MISC_OUT_W' undeclared (first use in this function)
vesa.c:1384: error: `TRUE' undeclared (first use in this function)
vesa.c:1385: error: invalid type argument of `->'
vesa.c:1385: error: `VGA_SEQ_INDEX' undeclared (first use in this function)
vesa.c:1385: error: invalid type argument of `->'
vesa.c:1385: error: `VGA_SEQ_DATA' undeclared (first use in this function)
vesa.c:1391: error: invalid type argument of `->'
vesa.c:1391: error: invalid type argument of `->'
vesa.c:1392: error: invalid type argument of `->'
vesa.c:1392: error: invalid type argument of `->'
vesa.c:1393: error: invalid type argument of `->'
vesa.c:1393: error: `VGA_GRAPH_INDEX' undeclared (first use in this function)
vesa.c:1393: error: invalid type argument of `->'
vesa.c:1393: error: `VGA_GRAPH_DATA' undeclared (first use in this function)
vesa.c:1394: error: invalid type argument of `->'
vesa.c:1394: error: invalid type argument of `->'
vesa.c:1395: error: invalid type argument of `->'
vesa.c:1395: error: invalid type argument of `->'
vesa.c:1396: error: invalid type argument of `->'
vesa.c:1396: error: invalid type argument of `->'
vesa.c:1399: error: invalid type argument of `->'
vesa.c:1399: error: invalid type argument of `->'
vesa.c:1400: error: invalid type argument of `->'
vesa.c:1400: error: invalid type argument of `->'
vesa.c:1401: error: invalid type argument of `->'
vesa.c:1401: error: invalid type argument of `->'
vesa.c:1402: error: invalid type argument of `->'
vesa.c:1402: error: invalid type argument of `->'
vesa.c:1403: error: invalid type argument of `->'
vesa.c:1403: error: invalid type argument of `->'
vesa.c:1404: error: invalid type argument of `->'
vesa.c:1404: error: invalid type argument of `->'
vesa.c:1408: error: invalid type argument of `->'
vesa.c:1408: error: invalid type argument of `->'
vesa.c:1413: error: invalid type argument of `->'
vesa.c:1413: error: invalid type argument of `->'
vesa.c:1414: error: invalid type argument of `->'
vesa.c:1414: error: invalid type argument of `->'
vesa.c:1415: error: invalid type argument of `->'
vesa.c:1415: error: invalid type argument of `->'
vesa.c:1416: error: invalid type argument of `->'
vesa.c:1416: error: invalid type argument of `->'
vesa.c:1417: error: invalid type argument of `->'
vesa.c:1417: error: invalid type argument of `->'
vesa.c:1418: error: invalid type argument of `->'
vesa.c: At top level:
vesa.c:1422: error: syntax error before "pScrn"
vesa.c: In function `RestoreFonts':
vesa.c:1424: error: syntax error before "pVesa"
vesa.c:1427: error: invalid type argument of `->'
vesa.c:1430: error: invalid type argument of `->'
vesa.c:1430: error: invalid type argument of `->'
vesa.c:1434: error: invalid type argument of `->'
vesa.c:1434: error: `VGA_MISC_OUT_R' undeclared (first use in this function)
vesa.c:1446: error: invalid type argument of `->'
vesa.c:1446: error: `VGA_MISC_OUT_W' undeclared (first use in this function)
vesa.c:1449: error: `TRUE' undeclared (first use in this function)
vesa.c:1450: error: invalid type argument of `->'
vesa.c:1450: error: `VGA_SEQ_INDEX' undeclared (first use in this function)
vesa.c:1450: error: invalid type argument of `->'
vesa.c:1450: error: `VGA_SEQ_DATA' undeclared (first use in this function)
vesa.c:1456: error: invalid type argument of `->'
vesa.c:1456: error: `VGA_GRAPH_INDEX' undeclared (first use in this function)
vesa.c:1456: error: invalid type argument of `->'
vesa.c:1456: error: `VGA_GRAPH_DATA' undeclared (first use in this function)
vesa.c:1457: error: invalid type argument of `->'
vesa.c:1457: error: invalid type argument of `->'
vesa.c:1458: error: invalid type argument of `->'
vesa.c:1458: error: invalid type argument of `->'
vesa.c:1461: error: invalid type argument of `->'
vesa.c:1461: error: invalid type argument of `->'
vesa.c:1462: error: invalid type argument of `->'
vesa.c:1462: error: invalid type argument of `->'
vesa.c:1463: error: invalid type argument of `->'
vesa.c:1463: error: invalid type argument of `->'
vesa.c:1464: error: invalid type argument of `->'
vesa.c:1464: error: invalid type argument of `->'
vesa.c:1465: error: invalid type argument of `->'
vesa.c:1465: error: invalid type argument of `->'
vesa.c:1466: error: invalid type argument of `->'
vesa.c:1466: error: invalid type argument of `->'
vesa.c:1468: error: invalid type argument of `->'
vesa.c:1468: error: invalid type argument of `->'
vesa.c:1469: error: invalid type argument of `->'
vesa.c:1469: error: invalid type argument of `->'
vesa.c:1470: error: invalid type argument of `->'
vesa.c:1470: error: invalid type argument of `->'
vesa.c:1471: error: invalid type argument of `->'
vesa.c:1471: error: invalid type argument of `->'
vesa.c:1472: error: invalid type argument of `->'
vesa.c:1472: error: invalid type argument of `->'
vesa.c:1473: error: invalid type argument of `->'
vesa.c:1473: error: invalid type argument of `->'
vesa.c:1477: error: invalid type argument of `->'
vesa.c:1477: error: invalid type argument of `->'
vesa.c:1481: error: invalid type argument of `->'
vesa.c:1483: error: invalid type argument of `->'
vesa.c:1483: error: invalid type argument of `->'
vesa.c:1484: error: invalid type argument of `->'
vesa.c:1484: error: invalid type argument of `->'
vesa.c:1485: error: invalid type argument of `->'
vesa.c:1485: error: invalid type argument of `->'
vesa.c:1486: error: invalid type argument of `->'
vesa.c:1486: error: invalid type argument of `->'
vesa.c:1487: error: invalid type argument of `->'
vesa.c:1487: error: invalid type argument of `->'
vesa.c:1488: error: invalid type argument of `->'
vesa.c:1488: error: invalid type argument of `->'
vesa.c:1489: error: invalid type argument of `->'
vesa.c:1489: error: invalid type argument of `->'
vesa.c:1490: error: invalid type argument of `->'
vesa.c:1490: error: invalid type argument of `->'
vesa.c: At top level:
vesa.c:1494: error: syntax error before "VESASaveScreen"
vesa.c:1494: error: syntax error before "pScreen"
vesa.c: In function `VESASaveScreen':
vesa.c:1496: error: `ScrnInfoPtr' undeclared (first use in this function)
vesa.c:1496: error: syntax error before "pScrn"
vesa.c:1498: error: `Bool' undeclared (first use in this function)
vesa.c:1500: error: `on' undeclared (first use in this function)
vesa.c:1510: error: `TRUE' undeclared (first use in this function)
vesa.c:1511: error: invalid type argument of `->'
vesa.c:1511: error: `VGA_SEQ_INDEX' undeclared (first use in this function)
vesa.c:1511: error: invalid type argument of `->'
vesa.c:1511: error: `VGA_SEQ_DATA' undeclared (first use in this function)
vesa.c: At top level:
vesa.c:1519: error: syntax error before "pScreen"
vesa.c: In function `VESABankSwitch':
vesa.c:1521: error: `ScrnInfoPtr' undeclared (first use in this function)
vesa.c:1521: error: syntax error before "pScrn"
vesa.c:1524: error: invalid type argument of `->'
vesa.c:1524: error: `iBank' undeclared (first use in this function)
vesa.c:1526: error: invalid type argument of `->'
vesa.c:1528: error: invalid type argument of `->'
vesa.c:1529: error: invalid type argument of `->'
vesa.c:1532: error: invalid type argument of `->'
vesa.c: At top level:
vesa.c:1538: error: syntax error before "VESASaveRestore"
vesa.c:1538: error: syntax error before "pScrn"
vesa.c: In function `VESASaveRestore':
vesa.c:1540: error: syntax error before "pVesa"
vesa.c:1542: error: `MODE_QUERY' undeclared (first use in this function)
vesa.c:1542: error: `function' undeclared (first use in this function)
vesa.c:1542: error: `MODE_RESTORE' undeclared (first use in this function)
vesa.c:1550: error: `MODE_SAVE' undeclared (first use in this function)
vesa.c:1550: error: invalid type argument of `->'
vesa.c:1553: error: invalid type argument of `->'
vesa.c:1553: error: invalid type argument of `->'
vesa.c:1556: error: invalid type argument of `->'
vesa.c:1557: error: invalid type argument of `->'
vesa.c:1557: error: `pointer' undeclared (first use in this function)
vesa.c:1557: error: invalid type argument of `->'
vesa.c:1558: error: invalid type argument of `->'
vesa.c:1558: error: invalid type argument of `->'
vesa.c:1566: error: `Bool' undeclared (first use in this function)
vesa.c:1566: error: syntax error before "retval"
vesa.c:1568: error: invalid type argument of `->'
vesa.c:1570: error: invalid type argument of `->'
vesa.c:1570: error: invalid type argument of `->'
vesa.c:1570: error: invalid type argument of `->'
vesa.c:1572: error: `retval' undeclared (first use in this function)
vesa.c:1572: error: invalid type argument of `->'
vesa.c:1573: error: invalid type argument of `->'
vesa.c:1574: error: invalid type argument of `->'
vesa.c:1574: error: invalid type argument of `->'
vesa.c:1577: error: invalid type argument of `->'
vesa.c:1578: error: invalid type argument of `->'
vesa.c:1578: error: invalid type argument of `->'
vesa.c:1579: error: invalid type argument of `->'
vesa.c:1579: error: invalid type argument of `->'
vesa.c:1579: error: invalid type argument of `->'
vesa.c:1584: error: invalid type argument of `->'
vesa.c:1584: error: invalid type argument of `->'
vesa.c:1593: error: `TRUE' undeclared (first use in this function)
vesa.c: At top level:
vesa.c:1597: error: syntax error before "pScrn"
vesa.c: In function `VESADisplayPowerManagementSet':
vesa.c:1600: error: syntax error before "pVesa"
vesa.c:1628: error: invalid type argument of `->'
vesa.c:1628: error: `VGA_SEQ_INDEX' undeclared (first use in this function)
vesa.c:1628: error: invalid type argument of `->'
vesa.c:1628: error: `VGA_SEQ_DATA' undeclared (first use in this function)
vesa.c:1630: error: invalid type argument of `->'
vesa.c:1630: error: invalid type argument of `->'
vesa.c:1633: error: invalid type argument of `->'
vesa.c:1633: error: `VGA_IOBASE_COLOR' undeclared (first use in this function)
vesa.c:1633: error: `VGA_CRTC_INDEX_OFFSET' undeclared (first use in this function)
vesa.c:1633: error: invalid type argument of `->'
vesa.c:1633: error: `VGA_CRTC_DATA_OFFSET' undeclared (first use in this function)
vesa.c:1634: error: invalid type argument of `->'
vesa.c:1634: error: invalid type argument of `->'
vesa.c: At top level:
vesa.c:1643: error: syntax error before "VESADGAOpenFramebuffer"
vesa.c:1643: error: syntax error before "pScrn"
vesa.c:1646: warning: data definition has no type or storage class
vesa.c:1647: error: syntax error before "VESADGASetMode"
vesa.c:1647: error: syntax error before "pScrn"
vesa.c:1647: warning: data definition has no type or storage class
vesa.c:1648: error: syntax error before "pScrn"
vesa.c:1651: error: syntax error before "VESADGAOpenFramebuffer"
vesa.c:1651: error: syntax error before "pScrn"
vesa.c: In function `VESADGAOpenFramebuffer':
vesa.c:1655: error: syntax error before "pVesa"
vesa.c:1657: error: `DeviceName' undeclared (first use in this function)
vesa.c:1658: error: `ApertureBase' undeclared (first use in this function)
vesa.c:1658: error: invalid type argument of `->'
vesa.c:1659: error: `ApertureSize' undeclared (first use in this function)
vesa.c:1659: error: invalid type argument of `->'
vesa.c:1660: error: `ApertureOffset' undeclared (first use in this function)
vesa.c:1660: error: invalid type argument of `->'
vesa.c:1661: error: `flags' undeclared (first use in this function)
vesa.c:1661: error: `DGA_NEED_ROOT' undeclared (first use in this function)
vesa.c:1663: error: `TRUE' undeclared (first use in this function)
vesa.c: At top level:
vesa.c:1667: error: syntax error before "VESADGASetMode"
vesa.c:1667: error: syntax error before "pScrn"
vesa.c: In function `VESADGASetMode':
vesa.c:1669: error: `DisplayModePtr' undeclared (first use in this function)
vesa.c:1669: error: syntax error before "pMode"
vesa.c:1674: error: invalid type argument of `->'
vesa.c:1679: error: `TRUE' undeclared (first use in this function)
vesa.c: At top level:
vesa.c:1693: error: syntax error before "pScrn"
vesa.c: In function `VESADGASetViewport':
vesa.c:1695: error: `x' undeclared (first use in this function)
vesa.c:1695: error: `y' undeclared (first use in this function)
vesa.c:1695: error: `flags' undeclared (first use in this function)
vesa.c: At top level:
vesa.c:1699: error: syntax error before "pScrn"
vesa.c:1704: error: syntax error before "VESADGAFunctions"
vesa.c:1706: warning: initialization makes integer from pointer without a cast
vesa.c:1706: error: initializer element is not computable at load time
vesa.c:1706: error: (near initialization for `VESADGAFunctions')
vesa.c:1707: warning: excess elements in scalar initializer
vesa.c:1707: warning: (near initialization for `VESADGAFunctions')
vesa.c:1708: warning: excess elements in scalar initializer
vesa.c:1708: warning: (near initialization for `VESADGAFunctions')
vesa.c:1709: warning: excess elements in scalar initializer
vesa.c:1709: warning: (near initialization for `VESADGAFunctions')
vesa.c:1710: warning: excess elements in scalar initializer
vesa.c:1710: warning: (near initialization for `VESADGAFunctions')
vesa.c:1711: warning: excess elements in scalar initializer
vesa.c:1711: warning: (near initialization for `VESADGAFunctions')
vesa.c:1712: warning: excess elements in scalar initializer
vesa.c:1712: warning: (near initialization for `VESADGAFunctions')
vesa.c:1713: warning: excess elements in scalar initializer
vesa.c:1713: warning: (near initialization for `VESADGAFunctions')
vesa.c:1714: warning: excess elements in scalar initializer
vesa.c:1714: warning: (near initialization for `VESADGAFunctions')
vesa.c:1715: warning: data definition has no type or storage class
vesa.c:1718: error: syntax error before "pScrn"
vesa.c: In function `VESADGAAddModes':
vesa.c:1720: error: syntax error before "pVesa"
vesa.c:1721: error: `DisplayModePtr' undeclared (first use in this function)
vesa.c:1722: error: `DGAModePtr' undeclared (first use in this function)
vesa.c:1725: error: invalid type argument of `->'
vesa.c:1726: error: invalid type argument of `->'
vesa.c:1726: error: `DGAModeRec' undeclared (first use in this function)
vesa.c:1730: error: invalid type argument of `->'
vesa.c:1731: error: invalid type argument of `->'
vesa.c:1732: warning: passing arg 1 of `memset' makes pointer from integer without a cast
vesa.c:1734: error: invalid type argument of `->'
vesa.c:1735: error: invalid type argument of `->'
vesa.c:1736: error: invalid type argument of `->'
vesa.c:1736: error: `DGA_CONCURRENT_ACCESS' undeclared (first use in this function)
vesa.c:1736: error: `DGA_PIXMAP_AVAILABLE' undeclared (first use in this function)
vesa.c:1737: error: invalid type argument of `->'
vesa.c:1738: error: invalid type argument of `->'
vesa.c:1739: error: invalid type argument of `->'
vesa.c:1740: error: invalid type argument of `->'
vesa.c:1741: error: invalid type argument of `->'
vesa.c:1742: error: invalid type argument of `->'
vesa.c:1743: error: invalid type argument of `->'
vesa.c:1744: error: `TrueColor' undeclared (first use in this function)
vesa.c:1744: error: `PseudoColor' undeclared (first use in this function)
vesa.c:1745: error: invalid type argument of `->'
vesa.c:1746: error: invalid type argument of `->'
vesa.c:1747: error: invalid type argument of `->'
vesa.c:1747: error: invalid type argument of `->'
vesa.c:1748: error: invalid type argument of `->'
vesa.c:1748: error: invalid type argument of `->'
vesa.c:1750: error: invalid type argument of `->'
vesa.c:1750: error: invalid type argument of `->'
vesa.c:1751: error: invalid type argument of `->'
vesa.c:1751: error: invalid type argument of `->'
vesa.c:1752: error: invalid type argument of `->'
vesa.c:1752: error: invalid type argument of `->'
vesa.c:1753: error: invalid type argument of `->'
vesa.c:1753: error: invalid type argument of `->'
vesa.c:1754: error: invalid type argument of `->'
vesa.c:1754: error: invalid type argument of `->'
vesa.c:1755: error: invalid type argument of `->'
vesa.c:1756: error: invalid type argument of `->'
vesa.c:1757: error: invalid type argument of `->'
vesa.c:1758: error: invalid type argument of `->'
vesa.c:1760: error: invalid type argument of `->'
vesa.c:1760: error: invalid type argument of `->'
vesa.c:1762: error: invalid type argument of `->'
vesa.c: At top level:
vesa.c:1767: error: syntax error before "VESADGAInit"
vesa.c:1767: error: syntax error before "pScrn"
vesa.c: In function `VESADGAInit':
vesa.c:1769: error: syntax error before "pVesa"
vesa.c:1771: error: invalid type argument of `->'
vesa.c:1774: error: invalid type argument of `->'
vesa.c:1777: error: `pScreen' undeclared (first use in this function)
vesa.c:1778: error: invalid type argument of `->'
vesa.c:1778: error: invalid type argument of `->'
make[2]: *** [vesa.lo] Error 1
make[2]: Leaving directory `/var/tmp/portage/xf86-video-vesa-1.0.1.3/work/xf86-video-vesa-1.0.1.3/src'
make[1]: *** [all-recursive] Error 1
make[1]: Leaving directory `/var/tmp/portage/xf86-video-vesa-1.0.1.3/work/xf86-video-vesa-1.0.1.3'
make: *** [all] Error 2
!!! ERROR: x11-drivers/xf86-video-vesa-1.0.1.3 failed.
Call stack:
ebuild.sh, line 1540: Called dyn_compile
ebuild.sh, line 940: Called src_compile
ebuild.sh, line 1249: Called x-modular_src_compile
x-modular.eclass, line 317: Called x-modular_src_make
x-modular.eclass, line 312: Called die