All pastes #673314 Raw Edit

Unnamed

public text v1 · immutable
#673314 ·published 2007-08-28 09:30 UTC
rendered paste body
reye@reye-desktop:~/Desktop/epic5-0.3.4$ make install
make[1]: Entering directory `/home/reye/Desktop/epic5-0.3.4/source'
gcc -g -O -Wno-pointer-sign  -I./../include -I../include -c ./ruby.c -I/usr/lib/ruby/1.8/i486-linux
./ruby.c:43:18: error: ruby.h: No such file or directory
./ruby.c:45: error: expected ‘=’, ‘,’, ‘;’, ‘asm’ or ‘__attribute__’ before ‘rubyclass’
./ruby.c:55: error: expected ‘=’, ‘,’, ‘;’, ‘asm’ or ‘__attribute__’ before ‘epic_echo’
./ruby.c:62: error: expected ‘=’, ‘,’, ‘;’, ‘asm’ or ‘__attribute__’ before ‘epic_say’
./ruby.c:69: error: expected ‘=’, ‘,’, ‘;’, ‘asm’ or ‘__attribute__’ before ‘epic_cmd’
./ruby.c:76: error: expected ‘=’, ‘,’, ‘;’, ‘asm’ or ‘__attribute__’ before ‘epic_eval’
./ruby.c:83: error: expected ‘=’, ‘,’, ‘;’, ‘asm’ or ‘__attribute__’ before ‘epic_expr’
./ruby.c:92: error: expected ‘=’, ‘,’, ‘;’, ‘asm’ or ‘__attribute__’ before ‘epic_call’
./ruby.c: In function ‘ruby_startstop’:
./ruby.c:118: error: ‘rubyclass’ undeclared (first use in this function)
./ruby.c:118: error: (Each undeclared identifier is reported only once
./ruby.c:118: error: for each function it appears in.)
./ruby.c:118: error: ‘rb_cObject’ undeclared (first use in this function)
./ruby.c:119: error: ‘epic_echo’ undeclared (first use in this function)
./ruby.c:120: error: ‘epic_say’ undeclared (first use in this function)
./ruby.c:121: error: ‘epic_cmd’ undeclared (first use in this function)
./ruby.c:122: error: ‘epic_eval’ undeclared (first use in this function)
./ruby.c:123: error: ‘epic_expr’ undeclared (first use in this function)
./ruby.c:124: error: ‘epic_call’ undeclared (first use in this function)
./ruby.c: At top level:
./ruby.c:133: error: expected ‘=’, ‘,’, ‘;’, ‘asm’ or ‘__attribute__’ before ‘internal_rubyeval’
./ruby.c:145: error: expected ‘=’, ‘,’, ‘;’, ‘asm’ or ‘__attribute__’ before ‘eval_failed’
./ruby.c: In function ‘rubyeval’:
./ruby.c:158: error: ‘VALUE’ undeclared (first use in this function)
./ruby.c:158: error: expected ‘;’ before ‘rubyval’
./ruby.c:164: error: ‘rubyval’ undeclared (first use in this function)
./ruby.c:164: error: ‘internal_rubyeval’ undeclared (first use in this function)
./ruby.c:164: error: expected ‘)’ before ‘input’
./ruby.c:167: error: ‘Qnil’ undeclared (first use in this function)
./ruby.c:171: error: expected ‘;’ before ‘x’
./ruby.c:172: error: ‘x’ undeclared (first use in this function)
./ruby.c:173: warning: assignment makes pointer from integer without a cast
make[1]: *** [ruby.o] Error 1
make[1]: Leaving directory `/home/reye/Desktop/epic5-0.3.4/source'
make: *** [epic5] Error 2