Making all in tests
if c++ -DHAVE_CONFIG_H -I. -I. -I.. -I.. -I../gdk -I../gdk -DGDK_PIXBUF_DISABLE_DEPRECATED -DGDK_DISABLE_DEPRECATED -DGTK_DISABLE_DEPRECATED -DG_ENABLE_DEBUG -DG_ERRORCHECK_MUTEXES -D_REENTRANT -I/opt/gtk/include/glib-2.0 -I/opt/gtk/lib/glib-2.0/include -I/opt/gtk/include/pango-1.0 -I/opt/gtk/include/cairo -I/opt/gtk/include/freetype2 -I/opt/gtk/include -I/opt/gtk/include/libpng12 -I/opt/gtk/include/atk-1.0 -I./dummy-headers -DHAVE_OBJC=1 -x objective-c++ -g -O2 -MT autotestkeywords-autotestkeywords.o -MD -MP -MF ".deps/autotestkeywords-autotestkeywords.Tpo" \
-c -o autotestkeywords-autotestkeywords.o `test -f 'autotestkeywords.cc' || echo './'`autotestkeywords.cc; \
then mv -f ".deps/autotestkeywords-autotestkeywords.Tpo" ".deps/autotestkeywords-autotestkeywords.Po"; \
else rm -f ".deps/autotestkeywords-autotestkeywords.Tpo"; exit 1; \
fi
In file included from ../gdk/quartz/gdkquartz.h:6,
from autotestkeywords.cc:14:
../gdk/quartz/gdkprivate-quartz.h:96: error: `NSDraggingInfo' was not declared
in this scope
../gdk/quartz/gdkprivate-quartz.h:96: error: 'id' is used as a type, but is not
defined as a type.
make[2]: *** [autotestkeywords-autotestkeywords.o] Error 1
make[1]: *** [all-recursive] Error 1
make: *** [all] Error 2
zimmys-power-mac-g4:~/source/gtk/gtk+ zimmy$