All pastes #67121 Raw Edit

koolhead17

public text v1 · immutable
#67121 ·published 2006-06-19 12:12 UTC
rendered paste body
/lib'
make[3]: Leaving directory `/home/atul/cvs/gnome2/gettext-0.14.5/gettext-runtime /lib'
make[2]: Leaving directory `/home/atul/cvs/gnome2/gettext-0.14.5/gettext-runtime /lib'
Making install in libasprintf
make[2]: Entering directory `/home/atul/cvs/gnome2/gettext-0.14.5/gettext-runtim e/libasprintf'
make[3]: Entering directory `/home/atul/cvs/gnome2/gettext-0.14.5/gettext-runtim e/libasprintf'
test -z "/opt/gnome2/lib" || mkdir -p -- "/opt/gnome2/lib"
 /bin/sh ./libtool --mode=install /home/atul/bin/install-check  'libasprintf.la'  '/opt/gnome2/lib/libasprintf.la'
/home/atul/bin/install-check .libs/libasprintf.so.0.0.0 /opt/gnome2/lib/libaspri ntf.so.0.0.0
/usr/bin/install: cannot create regular file `/opt/gnome2/lib/libasprintf.so.0.0 .0': Permission denied
make[3]: *** [install-libLTLIBRARIES] Error 1
make[3]: Leaving directory `/home/atul/cvs/gnome2/gettext-0.14.5/gettext-runtime /libasprintf'
make[2]: *** [install-am] Error 2
make[2]: Leaving directory `/home/atul/cvs/gnome2/gettext-0.14.5/gettext-runtime /libasprintf'
make[1]: *** [install-recursive] Error 1
make[1]: Leaving directory `/home/atul/cvs/gnome2/gettext-0.14.5/gettext-runtime '
make: *** [install-recursive] Error 1
*** error during stage install of gettext: Error running make   install *** [1/1 0]


  [1] rerun stage install
  [2] ignore error and continue to done
  [3] give up on module
  [4] start shell
choice: