rendered paste bodyo"; exit 1; fi
../src/CLucene/search/RangeFilter.h:28: error: extra qualification 'lucene::search::RangeFilter::' on member 'Less'
../src/CLucene/search/RangeFilter.h:30: error: extra qualification 'lucene::search::RangeFilter::' on member 'More'
make[3]: *** [RangeFilter.lo] Error 1
make[3]: *** Waiting for unfinished jobs....
i686-pc-linux-gnu-g++ -DHAVE_CONFIG_H -I. -I. -I.. -march=pentium4 -O2 -pipe -fomit-frame-pointer -ffast-math -fvisibility-inlines-hidden -MT SearchHeader.lo -MD -MP -MF .deps/SearchHeader.Tpo -c ../src/CLucene/search/SearchHeader.cpp -fPIC -DPIC -o .libs/SearchHeader.o
i686-pc-linux-gnu-g++ -DHAVE_CONFIG_H -I. -I. -I.. -march=pentium4 -O2 -pipe -fomit-frame-pointer -ffast-math -fvisibility-inlines-hidden -MT SearchHeader.lo -MD -MP -MF .deps/SearchHeader.Tpo -c ../src/CLucene/search/SearchHeader.cpp -o SearchHeader.o >/dev/null 2>&1
make[3]: Leaving directory `/var/tmp/portage/clucene-cvs-flock-9999/work/clucene-cvs-flock-9999/src'
make[2]: *** [all-recursive] Error 1
make[2]: Leaving directory `/var/tmp/portage/clucene-cvs-flock-9999/work/clucene-cvs-flock-9999/src'
make[1]: *** [all-recursive] Error 1
make[1]: Leaving directory `/var/tmp/portage/clucene-cvs-flock-9999/work/clucene-cvs-flock-9999'
make: *** [all] Error 2
!!! ERROR: dev-cpp/clucene-cvs-flock-9999 failed.
Call stack:
ebuild.sh, line 1539: Called dyn_compile
ebuild.sh, line 939: Called src_compile
clucene-cvs-flock-9999.ebuild, line 35: Called die
!!! (no error message)
!!! If you need support, post the topmost build error, and the call stack if relevant.
!!! This ebuild is from an overlay: '/usr/local/portage'