rendered paste bodyThis file contains any messages produced by compilers while
running configure, to aid debugging if configure makes a mistake.
It was created by configure, which was
generated by GNU Autoconf 2.59. Invocation command line was
$ ./configure
## --------- ##
## Platform. ##
## --------- ##
hostname = Planet-MoFo
uname -m = i686
uname -r = 2.6.15-23-386
uname -s = Linux
uname -v = #1 PREEMPT Tue May 23 13:49:40 UTC 2006
/usr/bin/uname -p = unknown
/bin/uname -X = unknown
/bin/arch = i686
/usr/bin/arch -k = unknown
/usr/convex/getsysinfo = unknown
hostinfo = unknown
/bin/machine = unknown
/usr/bin/oslevel = unknown
/bin/universe = unknown
PATH: /usr/local/sbin
PATH: /usr/local/bin
PATH: /usr/sbin
PATH: /usr/bin
PATH: /sbin
PATH: /bin
PATH: /usr/bin/X11
PATH: /usr/games
## ----------- ##
## Core tests. ##
## ----------- ##
configure:1565: checking build system type
configure:1583: result: i686-pc-linux-gnu
configure:1591: checking host system type
configure:1605: result: i686-pc-linux-gnu
configure:1613: checking target system type
configure:1627: result: i686-pc-linux-gnu
configure:1655: checking for a BSD-compatible install
configure:1710: result: /usr/bin/install -c
configure:1721: checking whether build environment is sane
configure:1764: result: yes
configure:1829: checking for gawk
configure:1858: result: no
configure:1829: checking for mawk
configure:1845: found /usr/bin/mawk
configure:1855: result: mawk
configure:1865: checking whether make sets $(MAKE)
configure:1889: result: no
configure:2069: checking for whoami
configure:2085: found /usr/bin/whoami
configure:2096: result: yes
configure:2170: checking whether make sets $(MAKE)
configure:2194: result: no
configure:2245: checking for gcc
configure:2261: found /usr/bin/gcc
configure:2271: result: gcc
configure:2515: checking for C compiler version
configure:2518: gcc --version </dev/null >&5
gcc (GCC) 4.0.3 (Ubuntu 4.0.3-1ubuntu5)
Copyright (C) 2006 Free Software Foundation, Inc.
This is free software; see the source for copying conditions. There is NO
warranty; not even for MERCHANTABILITY or FITNESS FOR A PARTICULAR PURPOSE.
configure:2521: $? = 0
configure:2523: gcc -v </dev/null >&5
Using built-in specs.
Target: i486-linux-gnu
Configured with: ../src/configure -v --enable-languages=c,c++,java,f95,objc,ada,treelang --prefix=/usr --enable-shared --with-system-zlib --libexecdir=/usr/lib --without-included-gettext --enable-threads=posix --enable-nls --program-suffix=-4.0 --enable-__cxa_atexit --enable-clocale=gnu --enable-libstdcxx-debug --enable-java-awt=gtk-default --enable-gtk-cairo --with-java-home=/usr/lib/jvm/java-1.4.2-gcj-4.0-1.4.2.0/jre --enable-mpfr --disable-werror --with-tune=pentium4 --enable-checking=release i486-linux-gnu
Thread model: posix
gcc version 4.0.3 (Ubuntu 4.0.3-1ubuntu5)
configure:2526: $? = 0
configure:2528: gcc -V </dev/null >&5
gcc: '-V' option must have argument
configure:2531: $? = 1
configure:2554: checking for C compiler default output file name
configure:2557: gcc conftest.c >&5
configure:2560: $? = 0
configure:2606: result: a.out
configure:2611: checking whether the C compiler works
configure:2617: ./a.out
configure:2620: $? = 0
configure:2637: result: yes
configure:2644: checking whether we are cross compiling
configure:2646: result: no
configure:2649: checking for suffix of executables
configure:2651: gcc -o conftest conftest.c >&5
configure:2654: $? = 0
configure:2679: result:
configure:2685: checking for suffix of object files
configure:2706: gcc -c conftest.c >&5
configure:2709: $? = 0
configure:2731: result: o
configure:2735: checking whether we are using the GNU C compiler
configure:2759: gcc -c conftest.c >&5
configure:2765: $? = 0
configure:2768: test -z || test ! -s conftest.err
configure:2771: $? = 0
configure:2774: test -s conftest.o
configure:2777: $? = 0
configure:2790: result: yes
configure:2796: checking whether gcc accepts -g
configure:2817: gcc -c -g conftest.c >&5
configure:2823: $? = 0
configure:2826: test -z || test ! -s conftest.err
configure:2829: $? = 0
configure:2832: test -s conftest.o
configure:2835: $? = 0
configure:2846: result: yes
configure:2863: checking for gcc option to accept ANSI C
configure:2933: gcc -c -g -O2 conftest.c >&5
configure:2939: $? = 0
configure:2942: test -z || test ! -s conftest.err
configure:2945: $? = 0
configure:2948: test -s conftest.o
configure:2951: $? = 0
configure:2969: result: none needed
configure:2987: gcc -c -g -O2 conftest.c >&5
conftest.c:2: error: syntax error before 'me'
configure:2993: $? = 1
configure: failed program was:
| #ifndef __cplusplus
| choke me
| #endif
configure:3134: checking for style of include used by make
configure:3162: result: none
configure:3190: checking dependency style of gcc
configure:3280: result: none
configure:3349: checking for g++
configure:3378: result: no
configure:3349: checking for c++
configure:3378: result: no
configure:3349: checking for gpp
configure:3378: result: no
configure:3349: checking for aCC
configure:3378: result: no
configure:3349: checking for CC
configure:3378: result: no
configure:3349: checking for cxx
configure:3378: result: no
configure:3349: checking for cc++
configure:3378: result: no
configure:3349: checking for cl
configure:3378: result: no
configure:3349: checking for FCC
configure:3378: result: no
configure:3349: checking for KCC
configure:3378: result: no
configure:3349: checking for RCC
configure:3378: result: no
configure:3349: checking for xlC_r
configure:3378: result: no
configure:3349: checking for xlC
configure:3378: result: no
configure:3391: checking for C++ compiler version
configure:3394: g++ --version </dev/null >&5
./configure: line 3395: g++: command not found
configure:3397: $? = 127
configure:3399: g++ -v </dev/null >&5
./configure: line 3400: g++: command not found
configure:3402: $? = 127
configure:3404: g++ -V </dev/null >&5
./configure: line 3405: g++: command not found
configure:3407: $? = 127
configure:3410: checking whether we are using the GNU C++ compiler
configure:3434: g++ -c conftest.cc >&5
./configure: line 3435: g++: command not found
configure:3440: $? = 127
configure: failed program was:
| /* confdefs.h. */
|
| #define PACKAGE_NAME ""
| #define PACKAGE_TARNAME ""
| #define PACKAGE_VERSION ""
| #define PACKAGE_STRING ""
| #define PACKAGE_BUGREPORT ""
| #define PACKAGE "bzflag"
| #define VERSION "2.0.9"
| #define BZ_BUILD_OS "linux-gnu"
| #define BZ_BUILD_USER "mofo"
| #define BUILD_REGEX 1
| /* end confdefs.h. */
|
| int
| main ()
| {
| #ifndef __GNUC__
| choke me
| #endif
|
| ;
| return 0;
| }
configure:3465: result: no
configure:3471: checking whether g++ accepts -g
configure:3492: g++ -c -g conftest.cc >&5
./configure: line 3493: g++: command not found
configure:3498: $? = 127
configure: failed program was:
| /* confdefs.h. */
|
| #define PACKAGE_NAME ""
| #define PACKAGE_TARNAME ""
| #define PACKAGE_VERSION ""
| #define PACKAGE_STRING ""
| #define PACKAGE_BUGREPORT ""
| #define PACKAGE "bzflag"
| #define VERSION "2.0.9"
| #define BZ_BUILD_OS "linux-gnu"
| #define BZ_BUILD_USER "mofo"
| #define BUILD_REGEX 1
| /* end confdefs.h. */
|
| int
| main ()
| {
|
| ;
| return 0;
| }
configure:3521: result: no
configure:3563: g++ -c conftest.cc >&5
./configure: line 3564: g++: command not found
configure:3569: $? = 127
configure: failed program was:
| /* confdefs.h. */
|
| #define PACKAGE_NAME ""
| #define PACKAGE_TARNAME ""
| #define PACKAGE_VERSION ""
| #define PACKAGE_STRING ""
| #define PACKAGE_BUGREPORT ""
| #define PACKAGE "bzflag"
| #define VERSION "2.0.9"
| #define BZ_BUILD_OS "linux-gnu"
| #define BZ_BUILD_USER "mofo"
| #define BUILD_REGEX 1
| /* end confdefs.h. */
|
| #include <stdlib.h>
| int
| main ()
| {
| exit (42);
| ;
| return 0;
| }
configure:3563: g++ -c conftest.cc >&5
./configure: line 3564: g++: command not found
configure:3569: $? = 127
configure: failed program was:
| /* confdefs.h. */
|
| #define PACKAGE_NAME ""
| #define PACKAGE_TARNAME ""
| #define PACKAGE_VERSION ""
| #define PACKAGE_STRING ""
| #define PACKAGE_BUGREPORT ""
| #define PACKAGE "bzflag"
| #define VERSION "2.0.9"
| #define BZ_BUILD_OS "linux-gnu"
| #define BZ_BUILD_USER "mofo"
| #define BUILD_REGEX 1
| /* end confdefs.h. */
| extern "C" void std::exit (int) throw (); using std::exit;
| #include <stdlib.h>
| int
| main ()
| {
| exit (42);
| ;
| return 0;
| }
configure:3563: g++ -c conftest.cc >&5
./configure: line 3564: g++: command not found
configure:3569: $? = 127
configure: failed program was:
| /* confdefs.h. */
|
| #define PACKAGE_NAME ""
| #define PACKAGE_TARNAME ""
| #define PACKAGE_VERSION ""
| #define PACKAGE_STRING ""
| #define PACKAGE_BUGREPORT ""
| #define PACKAGE "bzflag"
| #define VERSION "2.0.9"
| #define BZ_BUILD_OS "linux-gnu"
| #define BZ_BUILD_USER "mofo"
| #define BUILD_REGEX 1
| /* end confdefs.h. */
| extern "C" void std::exit (int); using std::exit;
| #include <stdlib.h>
| int
| main ()
| {
| exit (42);
| ;
| return 0;
| }
configure:3563: g++ -c conftest.cc >&5
./configure: line 3564: g++: command not found
configure:3569: $? = 127
configure: failed program was:
| /* confdefs.h. */
|
| #define PACKAGE_NAME ""
| #define PACKAGE_TARNAME ""
| #define PACKAGE_VERSION ""
| #define PACKAGE_STRING ""
| #define PACKAGE_BUGREPORT ""
| #define PACKAGE "bzflag"
| #define VERSION "2.0.9"
| #define BZ_BUILD_OS "linux-gnu"
| #define BZ_BUILD_USER "mofo"
| #define BUILD_REGEX 1
| /* end confdefs.h. */
| extern "C" void exit (int) throw ();
| #include <stdlib.h>
| int
| main ()
| {
| exit (42);
| ;
| return 0;
| }
configure:3563: g++ -c conftest.cc >&5
./configure: line 3564: g++: command not found
configure:3569: $? = 127
configure: failed program was:
| /* confdefs.h. */
|
| #define PACKAGE_NAME ""
| #define PACKAGE_TARNAME ""
| #define PACKAGE_VERSION ""
| #define PACKAGE_STRING ""
| #define PACKAGE_BUGREPORT ""
| #define PACKAGE "bzflag"
| #define VERSION "2.0.9"
| #define BZ_BUILD_OS "linux-gnu"
| #define BZ_BUILD_USER "mofo"
| #define BUILD_REGEX 1
| /* end confdefs.h. */
| extern "C" void exit (int);
| #include <stdlib.h>
| int
| main ()
| {
| exit (42);
| ;
| return 0;
| }
configure:3563: g++ -c conftest.cc >&5
./configure: line 3564: g++: command not found
configure:3569: $? = 127
configure: failed program was:
| /* confdefs.h. */
|
| #define PACKAGE_NAME ""
| #define PACKAGE_TARNAME ""
| #define PACKAGE_VERSION ""
| #define PACKAGE_STRING ""
| #define PACKAGE_BUGREPORT ""
| #define PACKAGE "bzflag"
| #define VERSION "2.0.9"
| #define BZ_BUILD_OS "linux-gnu"
| #define BZ_BUILD_USER "mofo"
| #define BUILD_REGEX 1
| /* end confdefs.h. */
| void exit (int);
| #include <stdlib.h>
| int
| main ()
| {
| exit (42);
| ;
| return 0;
| }
configure:3650: checking dependency style of g++
configure:3740: result: none
configure:3766: checking for ccache
configure:3799: result: no
configure:3851: checking for windres
configure:3878: result: :
configure:3948: checking whether ln -s works
configure:3952: result: yes
configure:4000: checking for ranlib
configure:4016: found /usr/bin/ranlib
configure:4027: result: ranlib
configure:4140: checking for a sed that does not truncate output
configure:4194: result: /bin/sed
configure:4197: checking for egrep
configure:4207: result: grep -E
configure:4223: checking for ld used by gcc
configure:4290: result: /usr/bin/ld
configure:4299: checking if the linker (/usr/bin/ld) is GNU ld
configure:4314: result: yes
configure:4319: checking for /usr/bin/ld option to reload object files
configure:4326: result: -r
configure:4344: checking for BSD-compatible nm
configure:4393: result: /usr/bin/nm -B
configure:4397: checking how to recognise dependent libraries
configure:4573: result: pass_all
configure:4808: checking how to run the C preprocessor
configure:4843: gcc -E conftest.c
configure:4849: $? = 0
configure:4881: gcc -E conftest.c
conftest.c:17:28: error: ac_nonexistent.h: No such file or directory
configure:4887: $? = 1
configure: failed program was:
| /* confdefs.h. */
|
| #define PACKAGE_NAME ""
| #define PACKAGE_TARNAME ""
| #define PACKAGE_VERSION ""
| #define PACKAGE_STRING ""
| #define PACKAGE_BUGREPORT ""
| #define PACKAGE "bzflag"
| #define VERSION "2.0.9"
| #define BZ_BUILD_OS "linux-gnu"
| #define BZ_BUILD_USER "mofo"
| #define BUILD_REGEX 1
| #ifdef __cplusplus
| void exit (int);
| #endif
| /* end confdefs.h. */
| #include <ac_nonexistent.h>
configure:4926: result: gcc -E
configure:4950: gcc -E conftest.c
configure:4956: $? = 0
configure:4988: gcc -E conftest.c
conftest.c:17:28: error: ac_nonexistent.h: No such file or directory
configure:4994: $? = 1
configure: failed program was:
| /* confdefs.h. */
|
| #define PACKAGE_NAME ""
| #define PACKAGE_TARNAME ""
| #define PACKAGE_VERSION ""
| #define PACKAGE_STRING ""
| #define PACKAGE_BUGREPORT ""
| #define PACKAGE "bzflag"
| #define VERSION "2.0.9"
| #define BZ_BUILD_OS "linux-gnu"
| #define BZ_BUILD_USER "mofo"
| #define BUILD_REGEX 1
| #ifdef __cplusplus
| void exit (int);
| #endif
| /* end confdefs.h. */
| #include <ac_nonexistent.h>
configure:5038: checking for ANSI C header files
configure:5063: gcc -c -g -O2 conftest.c >&5
configure:5069: $? = 0
configure:5072: test -z || test ! -s conftest.err
configure:5075: $? = 0
configure:5078: test -s conftest.o
configure:5081: $? = 0
configure:5170: gcc -o conftest -g -O2 conftest.c >&5
conftest.c: In function 'main':
conftest.c:34: warning: incompatible implicit declaration of built-in function 'exit'
configure:5173: $? = 0
configure:5175: ./conftest
configure:5178: $? = 0
configure:5193: result: yes
configure:5217: checking for sys/types.h
configure:5233: gcc -c -g -O2 conftest.c >&5
configure:5239: $? = 0
configure:5242: test -z || test ! -s conftest.err
configure:5245: $? = 0
configure:5248: test -s conftest.o
configure:5251: $? = 0
configure:5262: result: yes
configure:5217: checking for sys/stat.h
configure:5233: gcc -c -g -O2 conftest.c >&5
configure:5239: $? = 0
configure:5242: test -z || test ! -s conftest.err
configure:5245: $? = 0
configure:5248: test -s conftest.o
configure:5251: $? = 0
configure:5262: result: yes
configure:5217: checking for stdlib.h
configure:5233: gcc -c -g -O2 conftest.c >&5
configure:5239: $? = 0
configure:5242: test -z || test ! -s conftest.err
configure:5245: $? = 0
configure:5248: test -s conftest.o
configure:5251: $? = 0
configure:5262: result: yes
configure:5217: checking for string.h
configure:5233: gcc -c -g -O2 conftest.c >&5
configure:5239: $? = 0
configure:5242: test -z || test ! -s conftest.err
configure:5245: $? = 0
configure:5248: test -s conftest.o
configure:5251: $? = 0
configure:5262: result: yes
configure:5217: checking for memory.h
configure:5233: gcc -c -g -O2 conftest.c >&5
configure:5239: $? = 0
configure:5242: test -z || test ! -s conftest.err
configure:5245: $? = 0
configure:5248: test -s conftest.o
configure:5251: $? = 0
configure:5262: result: yes
configure:5217: checking for strings.h
configure:5233: gcc -c -g -O2 conftest.c >&5
configure:5239: $? = 0
configure:5242: test -z || test ! -s conftest.err
configure:5245: $? = 0
configure:5248: test -s conftest.o
configure:5251: $? = 0
configure:5262: result: yes
configure:5217: checking for inttypes.h
configure:5233: gcc -c -g -O2 conftest.c >&5
configure:5239: $? = 0
configure:5242: test -z || test ! -s conftest.err
configure:5245: $? = 0
configure:5248: test -s conftest.o
configure:5251: $? = 0
configure:5262: result: yes
configure:5217: checking for stdint.h
configure:5233: gcc -c -g -O2 conftest.c >&5
configure:5239: $? = 0
configure:5242: test -z || test ! -s conftest.err
configure:5245: $? = 0
configure:5248: test -s conftest.o
configure:5251: $? = 0
configure:5262: result: yes
configure:5217: checking for unistd.h
configure:5233: gcc -c -g -O2 conftest.c >&5
configure:5239: $? = 0
configure:5242: test -z || test ! -s conftest.err
configure:5245: $? = 0
configure:5248: test -s conftest.o
configure:5251: $? = 0
configure:5262: result: yes
configure:5288: checking dlfcn.h usability
configure:5300: gcc -c -g -O2 conftest.c >&5
configure:5306: $? = 0
configure:5309: test -z || test ! -s conftest.err
configure:5312: $? = 0
configure:5315: test -s conftest.o
configure:5318: $? = 0
configure:5328: result: yes
configure:5332: checking dlfcn.h presence
configure:5342: gcc -E conftest.c
configure:5348: $? = 0
configure:5368: result: yes
configure:5403: checking for dlfcn.h
configure:5410: result: yes
configure:5712: checking for g77
configure:5741: result: no
configure:5712: checking for f77
configure:5741: result: no
configure:5712: checking for xlf
configure:5741: result: no
configure:5712: checking for frt
configure:5741: result: no
configure:5712: checking for pgf77
configure:5741: result: no
configure:5712: checking for fort77
configure:5741: result: no
configure:5712: checking for fl32
configure:5741: result: no
configure:5712: checking for af77
configure:5741: result: no
configure:5712: checking for f90
configure:5741: result: no
configure:5712: checking for xlf90
configure:5741: result: no
configure:5712: checking for pgf90
configure:5741: result: no
configure:5712: checking for epcf90
configure:5741: result: no
configure:5712: checking for f95
configure:5741: result: no
configure:5712: checking for fort
configure:5741: result: no
configure:5712: checking for xlf95
configure:5741: result: no
configure:5712: checking for ifc
configure:5741: result: no
configure:5712: checking for efc
configure:5741: result: no
configure:5712: checking for pgf95
configure:5741: result: no
configure:5712: checking for lf95
configure:5741: result: no
configure:5712: checking for gfortran
configure:5741: result: no
configure:5753: checking for Fortran 77 compiler version
configure:5756: --version </dev/null >&5
./configure: line 5757: --version: command not found
configure:5759: $? = 127
configure:5761: -v </dev/null >&5
./configure: line 5762: -v: command not found
configure:5764: $? = 127
configure:5766: -V </dev/null >&5
./configure: line 5767: -V: command not found
configure:5769: $? = 127
configure:5777: checking whether we are using the GNU Fortran 77 compiler
configure:5791: -c conftest.F >&5
./configure: line 5792: -c: command not found
configure:5797: $? = 127
configure: failed program was:
| program main
| #ifndef __GNUC__
| choke me
| #endif
|
| end
configure:5822: result: no
configure:5828: checking whether accepts -g
configure:5840: -c -g conftest.f >&5
./configure: line 5841: -c: command not found
configure:5846: $? = 127
configure: failed program was:
| program main
|
| end
configure:5870: result: no
configure:5900: checking the maximum length of command line arguments
configure:6009: result: 32768
configure:6020: checking command to parse /usr/bin/nm -B output from gcc object
configure:6125: gcc -c -g -O2 conftest.c >&5
configure:6128: $? = 0
configure:6132: /usr/bin/nm -B conftest.o \| sed -n -e 's/^.*[ ]\([ABCDGIRSTW][ABCDGIRSTW]*\)[ ][ ]*\([_A-Za-z][_A-Za-z0-9]*\)$/\1 \2 \2/p' \> conftest.nm
configure:6135: $? = 0
configure:6187: gcc -o conftest -g -O2 conftest.c conftstm.o >&5
configure:6190: $? = 0
configure:6228: result: ok
configure:6232: checking for objdir
configure:6247: result: .libs
configure:6337: checking for ar
configure:6353: found /usr/bin/ar
configure:6364: result: ar
configure:6417: checking for ranlib
configure:6444: result: ranlib
configure:6497: checking for strip
configure:6513: found /usr/bin/strip
configure:6524: result: strip
configure:6796: checking if gcc supports -fno-rtti -fno-exceptions
configure:6814: gcc -c -g -O2 -fno-rtti -fno-exceptions conftest.c >&5
cc1: warning: command line option "-fno-rtti" is valid for C++/ObjC++ but not for C
configure:6818: $? = 0
configure:6831: result: no
configure:6846: checking for gcc option to produce PIC
configure:7056: result: -fPIC
configure:7064: checking if gcc PIC flag -fPIC works
configure:7082: gcc -c -g -O2 -fPIC -DPIC conftest.c >&5
configure:7086: $? = 0
configure:7099: result: yes
configure:7127: checking if gcc static flag -static works
configure:7155: result: yes
configure:7165: checking if gcc supports -c -o file.o
configure:7186: gcc -c -g -O2 -o out/conftest2.o conftest.c >&5
configure:7190: $? = 0
configure:7212: result: yes
configure:7238: checking whether the gcc linker (/usr/bin/ld) supports shared libraries
configure:8204: result: yes
configure:8271: checking dynamic linker characteristics
configure:8871: result: GNU/Linux ld.so
configure:8880: checking how to hardcode library paths into programs
configure:8905: result: immediate
configure:8919: checking whether stripping libraries is possible
configure:8924: result: yes
configure:9049: checking for shl_load
configure:9106: gcc -o conftest -g -O2 conftest.c >&5
/tmp/ccsoIEPi.o: In function `main':/home/mofo/bzflag/conftest.c:67: undefined reference to `shl_load'
/tmp/ccsoIEPi.o:(.data+0x0): undefined reference to `shl_load'
collect2: ld returned 1 exit status
configure:9112: $? = 1
configure: failed program was:
| /* confdefs.h. */
|
| #define PACKAGE_NAME ""
| #define PACKAGE_TARNAME ""
| #define PACKAGE_VERSION ""
| #define PACKAGE_STRING ""
| #define PACKAGE_BUGREPORT ""
| #define PACKAGE "bzflag"
| #define VERSION "2.0.9"
| #define BZ_BUILD_OS "linux-gnu"
| #define BZ_BUILD_USER "mofo"
| #define BUILD_REGEX 1
| #ifdef __cplusplus
| void exit (int);
| #endif
| #define STDC_HEADERS 1
| #define HAVE_SYS_TYPES_H 1
| #define HAVE_SYS_STAT_H 1
| #define HAVE_STDLIB_H 1
| #define HAVE_STRING_H 1
| #define HAVE_MEMORY_H 1
| #define HAVE_STRINGS_H 1
| #define HAVE_INTTYPES_H 1
| #define HAVE_STDINT_H 1
| #define HAVE_UNISTD_H 1
| #define HAVE_DLFCN_H 1
| /* end confdefs.h. */
| /* Define shl_load to an innocuous variant, in case <limits.h> declares shl_load.
| For example, HP-UX 11i <limits.h> declares gettimeofday. */
| #define shl_load innocuous_shl_load
|
| /* System header to define __stub macros and hopefully few prototypes,
| which can conflict with char shl_load (); below.
| Prefer <limits.h> to <assert.h> if __STDC__ is defined, since
| <limits.h> exists even on freestanding compilers. */
|
| #ifdef __STDC__
| # include <limits.h>
| #else
| # include <assert.h>
| #endif
|
| #undef shl_load
|
| /* Override any gcc2 internal prototype to avoid an error. */
| #ifdef __cplusplus
| extern "C"
| {
| #endif
| /* We use char because int might match the return type of a gcc2
| builtin and then its argument prototype would still apply. */
| char shl_load ();
| /* The GNU C library defines this for functions which it implements
| to always fail with ENOSYS. Some functions are actually named
| something starting with __ and the normal name is an alias. */
| #if defined (__stub_shl_load) || defined (__stub___shl_load)
| choke me
| #else
| char (*f) () = shl_load;
| #endif
| #ifdef __cplusplus
| }
| #endif
|
| int
| main ()
| {
| return f != shl_load;
| ;
| return 0;
| }
configure:9136: result: no
configure:9141: checking for shl_load in -ldld
configure:9171: gcc -o conftest -g -O2 conftest.c -ldld >&5
/usr/bin/ld: cannot find -ldld
collect2: ld returned 1 exit status
configure:9177: $? = 1
configure: failed program was:
| /* confdefs.h. */
|
| #define PACKAGE_NAME ""
| #define PACKAGE_TARNAME ""
| #define PACKAGE_VERSION ""
| #define PACKAGE_STRING ""
| #define PACKAGE_BUGREPORT ""
| #define PACKAGE "bzflag"
| #define VERSION "2.0.9"
| #define BZ_BUILD_OS "linux-gnu"
| #define BZ_BUILD_USER "mofo"
| #define BUILD_REGEX 1
| #ifdef __cplusplus
| void exit (int);
| #endif
| #define STDC_HEADERS 1
| #define HAVE_SYS_TYPES_H 1
| #define HAVE_SYS_STAT_H 1
| #define HAVE_STDLIB_H 1
| #define HAVE_STRING_H 1
| #define HAVE_MEMORY_H 1
| #define HAVE_STRINGS_H 1
| #define HAVE_INTTYPES_H 1
| #define HAVE_STDINT_H 1
| #define HAVE_UNISTD_H 1
| #define HAVE_DLFCN_H 1
| /* end confdefs.h. */
|
| /* Override any gcc2 internal prototype to avoid an error. */
| #ifdef __cplusplus
| extern "C"
| #endif
| /* We use char because int might match the return type of a gcc2
| builtin and then its argument prototype would still apply. */
| char shl_load ();
| int
| main ()
| {
| shl_load ();
| ;
| return 0;
| }
configure:9202: result: no
configure:9207: checking for dlopen
configure:9264: gcc -o conftest -g -O2 conftest.c >&5
/tmp/ccazfN9f.o: In function `main':/home/mofo/bzflag/conftest.c:67: undefined reference to `dlopen'
/tmp/ccazfN9f.o:(.data+0x0): undefined reference to `dlopen'
collect2: ld returned 1 exit status
configure:9270: $? = 1
configure: failed program was:
| /* confdefs.h. */
|
| #define PACKAGE_NAME ""
| #define PACKAGE_TARNAME ""
| #define PACKAGE_VERSION ""
| #define PACKAGE_STRING ""
| #define PACKAGE_BUGREPORT ""
| #define PACKAGE "bzflag"
| #define VERSION "2.0.9"
| #define BZ_BUILD_OS "linux-gnu"
| #define BZ_BUILD_USER "mofo"
| #define BUILD_REGEX 1
| #ifdef __cplusplus
| void exit (int);
| #endif
| #define STDC_HEADERS 1
| #define HAVE_SYS_TYPES_H 1
| #define HAVE_SYS_STAT_H 1
| #define HAVE_STDLIB_H 1
| #define HAVE_STRING_H 1
| #define HAVE_MEMORY_H 1
| #define HAVE_STRINGS_H 1
| #define HAVE_INTTYPES_H 1
| #define HAVE_STDINT_H 1
| #define HAVE_UNISTD_H 1
| #define HAVE_DLFCN_H 1
| /* end confdefs.h. */
| /* Define dlopen to an innocuous variant, in case <limits.h> declares dlopen.
| For example, HP-UX 11i <limits.h> declares gettimeofday. */
| #define dlopen innocuous_dlopen
|
| /* System header to define __stub macros and hopefully few prototypes,
| which can conflict with char dlopen (); below.
| Prefer <limits.h> to <assert.h> if __STDC__ is defined, since
| <limits.h> exists even on freestanding compilers. */
|
| #ifdef __STDC__
| # include <limits.h>
| #else
| # include <assert.h>
| #endif
|
| #undef dlopen
|
| /* Override any gcc2 internal prototype to avoid an error. */
| #ifdef __cplusplus
| extern "C"
| {
| #endif
| /* We use char because int might match the return type of a gcc2
| builtin and then its argument prototype would still apply. */
| char dlopen ();
| /* The GNU C library defines this for functions which it implements
| to always fail with ENOSYS. Some functions are actually named
| something starting with __ and the normal name is an alias. */
| #if defined (__stub_dlopen) || defined (__stub___dlopen)
| choke me
| #else
| char (*f) () = dlopen;
| #endif
| #ifdef __cplusplus
| }
| #endif
|
| int
| main ()
| {
| return f != dlopen;
| ;
| return 0;
| }
configure:9294: result: no
configure:9299: checking for dlopen in -ldl
configure:9329: gcc -o conftest -g -O2 conftest.c -ldl >&5
configure:9335: $? = 0
configure:9338: test -z || test ! -s conftest.err
configure:9341: $? = 0
configure:9344: test -s conftest
configure:9347: $? = 0
configure:9360: result: yes
configure:9533: checking whether a program can dlopen itself
configure:9607: gcc -o conftest -g -O2 -DHAVE_DLFCN_H -Wl,--export-dynamic conftest.c -ldl >&5
configure: In function 'main':
configure:9603: warning: incompatible implicit declaration of built-in function 'exit'
configure:9610: $? = 0
configure:9628: result: yes
configure:9633: checking whether a statically linked program can dlopen itself
configure:9707: gcc -o conftest -g -O2 -DHAVE_DLFCN_H -Wl,--export-dynamic -static conftest.c -ldl >&5
configure: In function 'main':
configure:9703: warning: incompatible implicit declaration of built-in function 'exit'
/tmp/ccOTUQea.o: In function `main':/home/mofo/bzflag/configure:9691: warning: Using 'dlopen' in statically linked applications requires at runtime the shared libraries from the glibc version used for linking
configure:9710: $? = 0
/lib/: cannot read file data: Is a directory
configure:9728: result: no
configure:9751: checking if libtool supports shared libraries
configure:9753: result: yes
configure:9756: checking whether to build shared libraries
configure:9777: result: no
configure:9780: checking whether to build static libraries
configure:9784: result: yes
configure:9876: creating libtool
configure:19065: checking for pod2man
configure:19081: found /usr/bin/pod2man
configure:19092: result: yes
configure:19116: checking for ar
configure:19142: result: ar
configure:19151: checking for compress in -lz
configure:19181: gcc -o conftest -g -O2 conftest.c -lz >&5
configure:19187: $? = 0
configure:19190: test -z || test ! -s conftest.err
configure:19193: $? = 0
configure:19196: test -s conftest
configure:19199: $? = 0
configure:19212: result: yes
configure:19241: checking for curl >= 7.10.0
configure:19251: result: 7.15.1
configure:19345: checking for artificial intelligence for bz's robots
configure:19347: result: not found
configure:19351: checking for ANSI C header files
configure:19506: result: yes
configure:19543: checking cstdlib usability
configure:19555: g++ -c conftest.cc >&5
./configure: line 19556: g++: command not found
configure:19561: $? = 127
configure: failed program was:
| /* confdefs.h. */
|
| #define PACKAGE_NAME ""
| #define PACKAGE_TARNAME ""
| #define PACKAGE_VERSION ""
| #define PACKAGE_STRING ""
| #define PACKAGE_BUGREPORT ""
| #define PACKAGE "bzflag"
| #define VERSION "2.0.9"
| #define BZ_BUILD_OS "linux-gnu"
| #define BZ_BUILD_USER "mofo"
| #define BUILD_REGEX 1
| #ifdef __cplusplus
| void exit (int);
| #endif
| #define STDC_HEADERS 1
| #define HAVE_SYS_TYPES_H 1
| #define HAVE_SYS_STAT_H 1
| #define HAVE_STDLIB_H 1
| #define HAVE_STRING_H 1
| #define HAVE_MEMORY_H 1
| #define HAVE_STRINGS_H 1
| #define HAVE_INTTYPES_H 1
| #define HAVE_STDINT_H 1
| #define HAVE_UNISTD_H 1
| #define HAVE_DLFCN_H 1
| #define STDC_HEADERS 1
| /* end confdefs.h. */
| #include <stdio.h>
| #if HAVE_SYS_TYPES_H
| # include <sys/types.h>
| #endif
| #if HAVE_SYS_STAT_H
| # include <sys/stat.h>
| #endif
| #if STDC_HEADERS
| # include <stdlib.h>
| # include <stddef.h>
| #else
| # if HAVE_STDLIB_H
| # include <stdlib.h>
| # endif
| #endif
| #if HAVE_STRING_H
| # if !STDC_HEADERS && HAVE_MEMORY_H
| # include <memory.h>
| # endif
| # include <string.h>
| #endif
| #if HAVE_STRINGS_H
| # include <strings.h>
| #endif
| #if HAVE_INTTYPES_H
| # include <inttypes.h>
| #else
| # if HAVE_STDINT_H
| # include <stdint.h>
| # endif
| #endif
| #if HAVE_UNISTD_H
| # include <unistd.h>
| #endif
| #include <cstdlib>
configure:19583: result: no
configure:19587: checking cstdlib presence
configure:19597: conftest.cc
./configure: line 19598: conftest.cc: command not found
configure:19603: $? = 127
configure: failed program was:
| /* confdefs.h. */
|
| #define PACKAGE_NAME ""
| #define PACKAGE_TARNAME ""
| #define PACKAGE_VERSION ""
| #define PACKAGE_STRING ""
| #define PACKAGE_BUGREPORT ""
| #define PACKAGE "bzflag"
| #define VERSION "2.0.9"
| #define BZ_BUILD_OS "linux-gnu"
| #define BZ_BUILD_USER "mofo"
| #define BUILD_REGEX 1
| #ifdef __cplusplus
| void exit (int);
| #endif
| #define STDC_HEADERS 1
| #define HAVE_SYS_TYPES_H 1
| #define HAVE_SYS_STAT_H 1
| #define HAVE_STDLIB_H 1
| #define HAVE_STRING_H 1
| #define HAVE_MEMORY_H 1
| #define HAVE_STRINGS_H 1
| #define HAVE_INTTYPES_H 1
| #define HAVE_STDINT_H 1
| #define HAVE_UNISTD_H 1
| #define HAVE_DLFCN_H 1
| #define STDC_HEADERS 1
| /* end confdefs.h. */
| #include <cstdlib>
configure:19623: result: no
configure:19658: checking for cstdlib
configure:19665: result: no
configure:19543: checking cstdio usability
configure:19555: g++ -c conftest.cc >&5
./configure: line 19556: g++: command not found
configure:19561: $? = 127
configure: failed program was:
| /* confdefs.h. */
|
| #define PACKAGE_NAME ""
| #define PACKAGE_TARNAME ""
| #define PACKAGE_VERSION ""
| #define PACKAGE_STRING ""
| #define PACKAGE_BUGREPORT ""
| #define PACKAGE "bzflag"
| #define VERSION "2.0.9"
| #define BZ_BUILD_OS "linux-gnu"
| #define BZ_BUILD_USER "mofo"
| #define BUILD_REGEX 1
| #ifdef __cplusplus
| void exit (int);
| #endif
| #define STDC_HEADERS 1
| #define HAVE_SYS_TYPES_H 1
| #define HAVE_SYS_STAT_H 1
| #define HAVE_STDLIB_H 1
| #define HAVE_STRING_H 1
| #define HAVE_MEMORY_H 1
| #define HAVE_STRINGS_H 1
| #define HAVE_INTTYPES_H 1
| #define HAVE_STDINT_H 1
| #define HAVE_UNISTD_H 1
| #define HAVE_DLFCN_H 1
| #define STDC_HEADERS 1
| /* end confdefs.h. */
| #include <stdio.h>
| #if HAVE_SYS_TYPES_H
| # include <sys/types.h>
| #endif
| #if HAVE_SYS_STAT_H
| # include <sys/stat.h>
| #endif
| #if STDC_HEADERS
| # include <stdlib.h>
| # include <stddef.h>
| #else
| # if HAVE_STDLIB_H
| # include <stdlib.h>
| # endif
| #endif
| #if HAVE_STRING_H
| # if !STDC_HEADERS && HAVE_MEMORY_H
| # include <memory.h>
| # endif
| # include <string.h>
| #endif
| #if HAVE_STRINGS_H
| # include <strings.h>
| #endif
| #if HAVE_INTTYPES_H
| # include <inttypes.h>
| #else
| # if HAVE_STDINT_H
| # include <stdint.h>
| # endif
| #endif
| #if HAVE_UNISTD_H
| # include <unistd.h>
| #endif
| #include <cstdio>
configure:19583: result: no
configure:19587: checking cstdio presence
configure:19597: conftest.cc
./configure: line 19598: conftest.cc: command not found
configure:19603: $? = 127
configure: failed program was:
| /* confdefs.h. */
|
| #define PACKAGE_NAME ""
| #define PACKAGE_TARNAME ""
| #define PACKAGE_VERSION ""
| #define PACKAGE_STRING ""
| #define PACKAGE_BUGREPORT ""
| #define PACKAGE "bzflag"
| #define VERSION "2.0.9"
| #define BZ_BUILD_OS "linux-gnu"
| #define BZ_BUILD_USER "mofo"
| #define BUILD_REGEX 1
| #ifdef __cplusplus
| void exit (int);
| #endif
| #define STDC_HEADERS 1
| #define HAVE_SYS_TYPES_H 1
| #define HAVE_SYS_STAT_H 1
| #define HAVE_STDLIB_H 1
| #define HAVE_STRING_H 1
| #define HAVE_MEMORY_H 1
| #define HAVE_STRINGS_H 1
| #define HAVE_INTTYPES_H 1
| #define HAVE_STDINT_H 1
| #define HAVE_UNISTD_H 1
| #define HAVE_DLFCN_H 1
| #define STDC_HEADERS 1
| /* end confdefs.h. */
| #include <cstdio>
configure:19623: result: no
configure:19658: checking for cstdio
configure:19665: result: no
configure:19543: checking cstring usability
configure:19555: g++ -c conftest.cc >&5
./configure: line 19556: g++: command not found
configure:19561: $? = 127
configure: failed program was:
| /* confdefs.h. */
|
| #define PACKAGE_NAME ""
| #define PACKAGE_TARNAME ""
| #define PACKAGE_VERSION ""
| #define PACKAGE_STRING ""
| #define PACKAGE_BUGREPORT ""
| #define PACKAGE "bzflag"
| #define VERSION "2.0.9"
| #define BZ_BUILD_OS "linux-gnu"
| #define BZ_BUILD_USER "mofo"
| #define BUILD_REGEX 1
| #ifdef __cplusplus
| void exit (int);
| #endif
| #define STDC_HEADERS 1
| #define HAVE_SYS_TYPES_H 1
| #define HAVE_SYS_STAT_H 1
| #define HAVE_STDLIB_H 1
| #define HAVE_STRING_H 1
| #define HAVE_MEMORY_H 1
| #define HAVE_STRINGS_H 1
| #define HAVE_INTTYPES_H 1
| #define HAVE_STDINT_H 1
| #define HAVE_UNISTD_H 1
| #define HAVE_DLFCN_H 1
| #define STDC_HEADERS 1
| /* end confdefs.h. */
| #include <stdio.h>
| #if HAVE_SYS_TYPES_H
| # include <sys/types.h>
| #endif
| #if HAVE_SYS_STAT_H
| # include <sys/stat.h>
| #endif
| #if STDC_HEADERS
| # include <stdlib.h>
| # include <stddef.h>
| #else
| # if HAVE_STDLIB_H
| # include <stdlib.h>
| # endif
| #endif
| #if HAVE_STRING_H
| # if !STDC_HEADERS && HAVE_MEMORY_H
| # include <memory.h>
| # endif
| # include <string.h>
| #endif
| #if HAVE_STRINGS_H
| # include <strings.h>
| #endif
| #if HAVE_INTTYPES_H
| # include <inttypes.h>
| #else
| # if HAVE_STDINT_H
| # include <stdint.h>
| # endif
| #endif
| #if HAVE_UNISTD_H
| # include <unistd.h>
| #endif
| #include <cstring>
configure:19583: result: no
configure:19587: checking cstring presence
configure:19597: conftest.cc
./configure: line 19598: conftest.cc: command not found
configure:19603: $? = 127
configure: failed program was:
| /* confdefs.h. */
|
| #define PACKAGE_NAME ""
| #define PACKAGE_TARNAME ""
| #define PACKAGE_VERSION ""
| #define PACKAGE_STRING ""
| #define PACKAGE_BUGREPORT ""
| #define PACKAGE "bzflag"
| #define VERSION "2.0.9"
| #define BZ_BUILD_OS "linux-gnu"
| #define BZ_BUILD_USER "mofo"
| #define BUILD_REGEX 1
| #ifdef __cplusplus
| void exit (int);
| #endif
| #define STDC_HEADERS 1
| #define HAVE_SYS_TYPES_H 1
| #define HAVE_SYS_STAT_H 1
| #define HAVE_STDLIB_H 1
| #define HAVE_STRING_H 1
| #define HAVE_MEMORY_H 1
| #define HAVE_STRINGS_H 1
| #define HAVE_INTTYPES_H 1
| #define HAVE_STDINT_H 1
| #define HAVE_UNISTD_H 1
| #define HAVE_DLFCN_H 1
| #define STDC_HEADERS 1
| /* end confdefs.h. */
| #include <cstring>
configure:19623: result: no
configure:19658: checking for cstring
configure:19665: result: no
configure:19873: checking GL/glx.h usability
configure:19885: gcc -c -g -O2 conftest.c >&5
configure:19891: $? = 0
configure:19894: test -z || test ! -s conftest.err
configure:19897: $? = 0
configure:19900: test -s conftest.o
configure:19903: $? = 0
configure:19913: result: yes
configure:19917: checking GL/glx.h presence
configure:19927: gcc -E conftest.c
configure:19933: $? = 0
configure:19953: result: yes
configure:19988: checking for GL/glx.h
configure:19995: result: yes
configure:19873: checking SDL/SDL.h usability
configure:19885: gcc -c -g -O2 conftest.c >&5
configure:19891: $? = 0
configure:19894: test -z || test ! -s conftest.err
configure:19897: $? = 0
configure:19900: test -s conftest.o
configure:19903: $? = 0
configure:19913: result: yes
configure:19917: checking SDL/SDL.h presence
configure:19927: gcc -E conftest.c
configure:19933: $? = 0
configure:19953: result: yes
configure:19988: checking for SDL/SDL.h
configure:19995: result: yes
configure:19873: checking X11/Xlib.h usability
configure:19885: gcc -c -g -O2 conftest.c >&5
configure:19891: $? = 0
configure:19894: test -z || test ! -s conftest.err
configure:19897: $? = 0
configure:19900: test -s conftest.o
configure:19903: $? = 0
configure:19913: result: yes
configure:19917: checking X11/Xlib.h presence
configure:19927: gcc -E conftest.c
configure:19933: $? = 0
configure:19953: result: yes
configure:19988: checking for X11/Xlib.h
configure:19995: result: yes
configure:19873: checking bstring.h usability
configure:19885: gcc -c -g -O2 conftest.c >&5
conftest.c:66:21: error: bstring.h: No such file or directory
configure:19891: $? = 1
configure: failed program was:
| /* confdefs.h. */
|
| #define PACKAGE_NAME ""
| #define PACKAGE_TARNAME ""
| #define PACKAGE_VERSION ""
| #define PACKAGE_STRING ""
| #define PACKAGE_BUGREPORT ""
| #define PACKAGE "bzflag"
| #define VERSION "2.0.9"
| #define BZ_BUILD_OS "linux-gnu"
| #define BZ_BUILD_USER "mofo"
| #define BUILD_REGEX 1
| #ifdef __cplusplus
| void exit (int);
| #endif
| #define STDC_HEADERS 1
| #define HAVE_SYS_TYPES_H 1
| #define HAVE_SYS_STAT_H 1
| #define HAVE_STDLIB_H 1
| #define HAVE_STRING_H 1
| #define HAVE_MEMORY_H 1
| #define HAVE_STRINGS_H 1
| #define HAVE_INTTYPES_H 1
| #define HAVE_STDINT_H 1
| #define HAVE_UNISTD_H 1
| #define HAVE_DLFCN_H 1
| #define STDC_HEADERS 1
| #define HAVE_GL_GLX_H 1
| #define HAVE_SDL_SDL_H 1
| #define HAVE_X11_XLIB_H 1
| /* end confdefs.h. */
| #include <stdio.h>
| #if HAVE_SYS_TYPES_H
| # include <sys/types.h>
| #endif
| #if HAVE_SYS_STAT_H
| # include <sys/stat.h>
| #endif
| #if STDC_HEADERS
| # include <stdlib.h>
| # include <stddef.h>
| #else
| # if HAVE_STDLIB_H
| # include <stdlib.h>
| # endif
| #endif
| #if HAVE_STRING_H
| # if !STDC_HEADERS && HAVE_MEMORY_H
| # include <memory.h>
| # endif
| # include <string.h>
| #endif
| #if HAVE_STRINGS_H
| # include <strings.h>
| #endif
| #if HAVE_INTTYPES_H
| # include <inttypes.h>
| #else
| # if HAVE_STDINT_H
| # include <stdint.h>
| # endif
| #endif
| #if HAVE_UNISTD_H
| # include <unistd.h>
| #endif
| #include <bstring.h>
configure:19913: result: no
configure:19917: checking bstring.h presence
configure:19927: gcc -E conftest.c
conftest.c:32:21: error: bstring.h: No such file or directory
configure:19933: $? = 1
configure: failed program was:
| /* confdefs.h. */
|
| #define PACKAGE_NAME ""
| #define PACKAGE_TARNAME ""
| #define PACKAGE_VERSION ""
| #define PACKAGE_STRING ""
| #define PACKAGE_BUGREPORT ""
| #define PACKAGE "bzflag"
| #define VERSION "2.0.9"
| #define BZ_BUILD_OS "linux-gnu"
| #define BZ_BUILD_USER "mofo"
| #define BUILD_REGEX 1
| #ifdef __cplusplus
| void exit (int);
| #endif
| #define STDC_HEADERS 1
| #define HAVE_SYS_TYPES_H 1
| #define HAVE_SYS_STAT_H 1
| #define HAVE_STDLIB_H 1
| #define HAVE_STRING_H 1
| #define HAVE_MEMORY_H 1
| #define HAVE_STRINGS_H 1
| #define HAVE_INTTYPES_H 1
| #define HAVE_STDINT_H 1
| #define HAVE_UNISTD_H 1
| #define HAVE_DLFCN_H 1
| #define STDC_HEADERS 1
| #define HAVE_GL_GLX_H 1
| #define HAVE_SDL_SDL_H 1
| #define HAVE_X11_XLIB_H 1
| /* end confdefs.h. */
| #include <bstring.h>
configure:19953: result: no
configure:19988: checking for bstring.h
configure:19995: result: no
configure:19873: checking linux/input.h usability
configure:19885: gcc -c -g -O2 conftest.c >&5
configure:19891: $? = 0
configure:19894: test -z || test ! -s conftest.err
configure:19897: $? = 0
configure:19900: test -s conftest.o
configure:19903: $? = 0
configure:19913: result: yes
configure:19917: checking linux/input.h presence
configure:19927: gcc -E conftest.c
configure:19933: $? = 0
configure:19953: result: yes
configure:19988: checking for linux/input.h
configure:19995: result: yes
configure:19864: checking for stdint.h
configure:19869: result: yes
configure:19873: checking sys/param.h usability
configure:19885: gcc -c -g -O2 conftest.c >&5
configure:19891: $? = 0
configure:19894: test -z || test ! -s conftest.err
configure:19897: $? = 0
configure:19900: test -s conftest.o
configure:19903: $? = 0
configure:19913: result: yes
configure:19917: checking sys/param.h presence
configure:19927: gcc -E conftest.c
configure:19933: $? = 0
configure:19953: result: yes
configure:19988: checking for sys/param.h
configure:19995: result: yes
configure:19864: checking for unistd.h
configure:19869: result: yes
configure:19873: checking values.h usability
configure:19885: gcc -c -g -O2 conftest.c >&5
configure:19891: $? = 0
configure:19894: test -z || test ! -s conftest.err
configure:19897: $? = 0
configure:19900: test -s conftest.o
configure:19903: $? = 0
configure:19913: result: yes
configure:19917: checking values.h presence
configure:19927: gcc -E conftest.c
configure:19933: $? = 0
configure:19953: result: yes
configure:19988: checking for values.h
configure:19995: result: yes
configure:19873: checking dsound.h usability
configure:19885: gcc -c -g -O2 conftest.c >&5
conftest.c:71:20: error: dsound.h: No such file or directory
configure:19891: $? = 1
configure: failed program was:
| /* confdefs.h. */
|
| #define PACKAGE_NAME ""
| #define PACKAGE_TARNAME ""
| #define PACKAGE_VERSION ""
| #define PACKAGE_STRING ""
| #define PACKAGE_BUGREPORT ""
| #define PACKAGE "bzflag"
| #define VERSION "2.0.9"
| #define BZ_BUILD_OS "linux-gnu"
| #define BZ_BUILD_USER "mofo"
| #define BUILD_REGEX 1
| #ifdef __cplusplus
| void exit (int);
| #endif
| #define STDC_HEADERS 1
| #define HAVE_SYS_TYPES_H 1
| #define HAVE_SYS_STAT_H 1
| #define HAVE_STDLIB_H 1
| #define HAVE_STRING_H 1
| #define HAVE_MEMORY_H 1
| #define HAVE_STRINGS_H 1
| #define HAVE_INTTYPES_H 1
| #define HAVE_STDINT_H 1
| #define HAVE_UNISTD_H 1
| #define HAVE_DLFCN_H 1
| #define STDC_HEADERS 1
| #define HAVE_GL_GLX_H 1
| #define HAVE_SDL_SDL_H 1
| #define HAVE_X11_XLIB_H 1
| #define HAVE_LINUX_INPUT_H 1
| #define HAVE_STDINT_H 1
| #define HAVE_SYS_PARAM_H 1
| #define HAVE_UNISTD_H 1
| #define HAVE_VALUES_H 1
| /* end confdefs.h. */
| #include <stdio.h>
| #if HAVE_SYS_TYPES_H
| # include <sys/types.h>
| #endif
| #if HAVE_SYS_STAT_H
| # include <sys/stat.h>
| #endif
| #if STDC_HEADERS
| # include <stdlib.h>
| # include <stddef.h>
| #else
| # if HAVE_STDLIB_H
| # include <stdlib.h>
| # endif
| #endif
| #if HAVE_STRING_H
| # if !STDC_HEADERS && HAVE_MEMORY_H
| # include <memory.h>
| # endif
| # include <string.h>
| #endif
| #if HAVE_STRINGS_H
| # include <strings.h>
| #endif
| #if HAVE_INTTYPES_H
| # include <inttypes.h>
| #else
| # if HAVE_STDINT_H
| # include <stdint.h>
| # endif
| #endif
| #if HAVE_UNISTD_H
| # include <unistd.h>
| #endif
| #include <dsound.h>
configure:19913: result: no
configure:19917: checking dsound.h presence
configure:19927: gcc -E conftest.c
conftest.c:37:20: error: dsound.h: No such file or directory
configure:19933: $? = 1
configure: failed program was:
| /* confdefs.h. */
|
| #define PACKAGE_NAME ""
| #define PACKAGE_TARNAME ""
| #define PACKAGE_VERSION ""
| #define PACKAGE_STRING ""
| #define PACKAGE_BUGREPORT ""
| #define PACKAGE "bzflag"
| #define VERSION "2.0.9"
| #define BZ_BUILD_OS "linux-gnu"
| #define BZ_BUILD_USER "mofo"
| #define BUILD_REGEX 1
| #ifdef __cplusplus
| void exit (int);
| #endif
| #define STDC_HEADERS 1
| #define HAVE_SYS_TYPES_H 1
| #define HAVE_SYS_STAT_H 1
| #define HAVE_STDLIB_H 1
| #define HAVE_STRING_H 1
| #define HAVE_MEMORY_H 1
| #define HAVE_STRINGS_H 1
| #define HAVE_INTTYPES_H 1
| #define HAVE_STDINT_H 1
| #define HAVE_UNISTD_H 1
| #define HAVE_DLFCN_H 1
| #define STDC_HEADERS 1
| #define HAVE_GL_GLX_H 1
| #define HAVE_SDL_SDL_H 1
| #define HAVE_X11_XLIB_H 1
| #define HAVE_LINUX_INPUT_H 1
| #define HAVE_STDINT_H 1
| #define HAVE_SYS_PARAM_H 1
| #define HAVE_UNISTD_H 1
| #define HAVE_VALUES_H 1
| /* end confdefs.h. */
| #include <dsound.h>
configure:19953: result: no
configure:19988: checking for dsound.h
configure:19995: result: no
configure:20012: checking whether byte ordering is bigendian
configure:20039: gcc -c -g -O2 conftest.c >&5
configure:20045: $? = 0
configure:20048: test -z || test ! -s conftest.err
configure:20051: $? = 0
configure:20054: test -s conftest.o
configure:20057: $? = 0
configure:20081: gcc -c -g -O2 conftest.c >&5
conftest.c: In function 'main':
conftest.c:44: error: 'not' undeclared (first use in this function)
conftest.c:44: error: (Each undeclared identifier is reported only once
conftest.c:44: error: for each function it appears in.)
conftest.c:44: error: syntax error before 'big'
configure:20087: $? = 1
configure: failed program was:
| /* confdefs.h. */
|
| #define PACKAGE_NAME ""
| #define PACKAGE_TARNAME ""
| #define PACKAGE_VERSION ""
| #define PACKAGE_STRING ""
| #define PACKAGE_BUGREPORT ""
| #define PACKAGE "bzflag"
| #define VERSION "2.0.9"
| #define BZ_BUILD_OS "linux-gnu"
| #define BZ_BUILD_USER "mofo"
| #define BUILD_REGEX 1
| #ifdef __cplusplus
| void exit (int);
| #endif
| #define STDC_HEADERS 1
| #define HAVE_SYS_TYPES_H 1
| #define HAVE_SYS_STAT_H 1
| #define HAVE_STDLIB_H 1
| #define HAVE_STRING_H 1
| #define HAVE_MEMORY_H 1
| #define HAVE_STRINGS_H 1
| #define HAVE_INTTYPES_H 1
| #define HAVE_STDINT_H 1
| #define HAVE_UNISTD_H 1
| #define HAVE_DLFCN_H 1
| #define STDC_HEADERS 1
| #define HAVE_GL_GLX_H 1
| #define HAVE_SDL_SDL_H 1
| #define HAVE_X11_XLIB_H 1
| #define HAVE_LINUX_INPUT_H 1
| #define HAVE_STDINT_H 1
| #define HAVE_SYS_PARAM_H 1
| #define HAVE_UNISTD_H 1
| #define HAVE_VALUES_H 1
| /* end confdefs.h. */
| #include <sys/types.h>
| #include <sys/param.h>
|
| int
| main ()
| {
| #if BYTE_ORDER != BIG_ENDIAN
| not big endian
| #endif
|
| ;
| return 0;
| }
configure:20220: result: no
configure:20239: checking for an ANSI C-conforming const
configure:20306: gcc -c -g -O2 conftest.c >&5
configure:20312: $? = 0
configure:20315: test -z || test ! -s conftest.err
configure:20318: $? = 0
configure:20321: test -s conftest.o
configure:20324: $? = 0
configure:20335: result: yes
configure:20346: checking for socklen_t type
configure:20365: gcc -c -g -O2 conftest.c >&5
configure:20371: $? = 0
configure:20374: test -z || test ! -s conftest.err
configure:20377: $? = 0
configure:20380: test -s conftest.o
configure:20383: $? = 0
configure:20406: result: yes
configure:20410: checking for linux rumble joystick support
configure:20428: gcc -c -g -O2 conftest.c >&5
configure:20434: $? = 0
configure:20437: test -z || test ! -s conftest.err
configure:20440: $? = 0
configure:20443: test -s conftest.o
configure:20446: $? = 0
configure:20463: result: yes
configure:20467: checking for linux force feedback joystick support
configure:20485: gcc -c -g -O2 conftest.c >&5
configure:20491: $? = 0
configure:20494: test -z || test ! -s conftest.err
configure:20497: $? = 0
configure:20500: test -s conftest.o
configure:20503: $? = 0
configure:20520: result: yes
configure:20653: checking for X
configure:20759: gcc -E conftest.c
configure:20765: $? = 0
configure:20815: gcc -o conftest -g -O2 conftest.c -lX11 -L/usr/lib -lcurl -L/usr/lib -lgssapi_krb5 -lkrb5 -lk5crypto -lkrb5support -lcom_err -lresolv -lidn -lssl -lcrypto -ldl -lssl -lcrypto -lz >&5
configure:20821: $? = 0
configure:20824: test -z || test ! -s conftest.err
configure:20827: $? = 0
configure:20830: test -s conftest
configure:20833: $? = 0
configure:20887: result: libraries , headers in standard search path
configure:21058: gcc -o conftest -g -O2 conftest.c -L/usr/lib -lcurl -L/usr/lib -lgssapi_krb5 -lkrb5 -lk5crypto -lkrb5support -lcom_err -lresolv -lidn -lssl -lcrypto -ldl -lssl -lcrypto -lz -lX11 >&5
configure:21064: $? = 0
configure:21067: test -z || test ! -s conftest.err
configure:21070: $? = 0
configure:21073: test -s conftest
configure:21076: $? = 0
configure:21232: checking for gethostbyname
configure:21289: gcc -o conftest -g -O2 conftest.c -L/usr/lib -lcurl -L/usr/lib -lgssapi_krb5 -lkrb5 -lk5crypto -lkrb5support -lcom_err -lresolv -lidn -lssl -lcrypto -ldl -lssl -lcrypto -lz >&5
configure:21295: $? = 0
configure:21298: test -z || test ! -s conftest.err
configure:21301: $? = 0
configure:21304: test -s conftest
configure:21307: $? = 0
configure:21319: result: yes
configure:21468: checking for connect
configure:21525: gcc -o conftest -g -O2 conftest.c -L/usr/lib -lcurl -L/usr/lib -lgssapi_krb5 -lkrb5 -lk5crypto -lkrb5support -lcom_err -lresolv -lidn -lssl -lcrypto -ldl -lssl -lcrypto -lz >&5
configure:21531: $? = 0
configure:21534: test -z || test ! -s conftest.err
configure:21537: $? = 0
configure:21540: test -s conftest
configure:21543: $? = 0
configure:21555: result: yes
configure:21629: checking for remove
configure:21686: gcc -o conftest -g -O2 conftest.c -L/usr/lib -lcurl -L/usr/lib -lgssapi_krb5 -lkrb5 -lk5crypto -lkrb5support -lcom_err -lresolv -lidn -lssl -lcrypto -ldl -lssl -lcrypto -lz >&5
configure:21692: $? = 0
configure:21695: test -z || test ! -s conftest.err
configure:21698: $? = 0
configure:21701: test -s conftest
configure:21704: $? = 0
configure:21716: result: yes
configure:21790: checking for shmat
configure:21847: gcc -o conftest -g -O2 conftest.c -L/usr/lib -lcurl -L/usr/lib -lgssapi_krb5 -lkrb5 -lk5crypto -lkrb5support -lcom_err -lresolv -lidn -lssl -lcrypto -ldl -lssl -lcrypto -lz >&5
configure:21853: $? = 0
configure:21856: test -z || test ! -s conftest.err
configure:21859: $? = 0
configure:21862: test -s conftest
configure:21865: $? = 0
configure:21877: result: yes
configure:21960: checking for IceConnectionNumber in -lICE
configure:21990: gcc -o conftest -g -O2 conftest.c -lICE -L/usr/lib -lcurl -L/usr/lib -lgssapi_krb5 -lkrb5 -lk5crypto -lkrb5support -lcom_err -lresolv -lidn -lssl -lcrypto -ldl -lssl -lcrypto -lz >&5
configure:21996: $? = 0
configure:21999: test -z || test ! -s conftest.err
configure:22002: $? = 0
configure:22005: test -s conftest
configure:22008: $? = 0
configure:22021: result: yes
configure:22055: checking for sqrtf in -lm
configure:22085: gcc -o conftest -g -O2 conftest.c -lm -L/usr/lib -lcurl -L/usr/lib -lgssapi_krb5 -lkrb5 -lk5crypto -lkrb5support -lcom_err -lresolv -lidn -lssl -lcrypto -ldl -lssl -lcrypto -lz >&5
conftest.c:47: warning: conflicting types for built-in function 'sqrtf'
configure:22091: $? = 0
configure:22094: test -z || test ! -s conftest.err
configure:22097: $? = 0
configure:22100: test -s conftest
configure:22103: $? = 0
configure:22116: result: yes
configure:22130: checking for socket in -lsocket
configure:22160: gcc -o conftest -g -O2 conftest.c -lsocket -lm -L/usr/lib -lcurl -L/usr/lib -lgssapi_krb5 -lkrb5 -lk5crypto -lkrb5support -lcom_err -lresolv -lidn -lssl -lcrypto -ldl -lssl -lcrypto -lz >&5
/usr/bin/ld: cannot find -lsocket
collect2: ld returned 1 exit status
configure:22166: $? = 1
configure: failed program was:
| /* confdefs.h. */
|
| #define PACKAGE_NAME ""
| #define PACKAGE_TARNAME ""
| #define PACKAGE_VERSION ""
| #define PACKAGE_STRING ""
| #define PACKAGE_BUGREPORT ""
| #define PACKAGE "bzflag"
| #define VERSION "2.0.9"
| #define BZ_BUILD_OS "linux-gnu"
| #define BZ_BUILD_USER "mofo"
| #define BUILD_REGEX 1
| #ifdef __cplusplus
| void exit (int);
| #endif
| #define STDC_HEADERS 1
| #define HAVE_SYS_TYPES_H 1
| #define HAVE_SYS_STAT_H 1
| #define HAVE_STDLIB_H 1
| #define HAVE_STRING_H 1
| #define HAVE_MEMORY_H 1
| #define HAVE_STRINGS_H 1
| #define HAVE_INTTYPES_H 1
| #define HAVE_STDINT_H 1
| #define HAVE_UNISTD_H 1
| #define HAVE_DLFCN_H 1
| #define STDC_HEADERS 1
| #define HAVE_GL_GLX_H 1
| #define HAVE_SDL_SDL_H 1
| #define HAVE_X11_XLIB_H 1
| #define HAVE_LINUX_INPUT_H 1
| #define HAVE_STDINT_H 1
| #define HAVE_SYS_PARAM_H 1
| #define HAVE_UNISTD_H 1
| #define HAVE_VALUES_H 1
| #define HAVE_SOCKLEN_T 1
| #define HAVE_FF_EFFECT_RUMBLE 1
| #define HAVE_FF_EFFECT_DIRECTIONAL 1
| #define HAVE_LIBM 1
| /* end confdefs.h. */
|
| /* Override any gcc2 internal prototype to avoid an error. */
| #ifdef __cplusplus
| extern "C"
| #endif
| /* We use char because int might match the return type of a gcc2
| builtin and then its argument prototype would still apply. */
| char socket ();
| int
| main ()
| {
| socket ();
| ;
| return 0;
| }
configure:22191: result: no
configure:22203: checking for gethostent in -lsocket
configure:22233: gcc -o conftest -g -O2 conftest.c -lsocket -lm -L/usr/lib -lcurl -L/usr/lib -lgssapi_krb5 -lkrb5 -lk5crypto -lkrb5support -lcom_err -lresolv -lidn -lssl -lcrypto -ldl -lssl -lcrypto -lz >&5
/usr/bin/ld: cannot find -lsocket
collect2: ld returned 1 exit status
configure:22239: $? = 1
configure: failed program was:
| /* confdefs.h. */
|
| #define PACKAGE_NAME ""
| #define PACKAGE_TARNAME ""
| #define PACKAGE_VERSION ""
| #define PACKAGE_STRING ""
| #define PACKAGE_BUGREPORT ""
| #define PACKAGE "bzflag"
| #define VERSION "2.0.9"
| #define BZ_BUILD_OS "linux-gnu"
| #define BZ_BUILD_USER "mofo"
| #define BUILD_REGEX 1
| #ifdef __cplusplus
| void exit (int);
| #endif
| #define STDC_HEADERS 1
| #define HAVE_SYS_TYPES_H 1
| #define HAVE_SYS_STAT_H 1
| #define HAVE_STDLIB_H 1
| #define HAVE_STRING_H 1
| #define HAVE_MEMORY_H 1
| #define HAVE_STRINGS_H 1
| #define HAVE_INTTYPES_H 1
| #define HAVE_STDINT_H 1
| #define HAVE_UNISTD_H 1
| #define HAVE_DLFCN_H 1
| #define STDC_HEADERS 1
| #define HAVE_GL_GLX_H 1
| #define HAVE_SDL_SDL_H 1
| #define HAVE_X11_XLIB_H 1
| #define HAVE_LINUX_INPUT_H 1
| #define HAVE_STDINT_H 1
| #define HAVE_SYS_PARAM_H 1
| #define HAVE_UNISTD_H 1
| #define HAVE_VALUES_H 1
| #define HAVE_SOCKLEN_T 1
| #define HAVE_FF_EFFECT_RUMBLE 1
| #define HAVE_FF_EFFECT_DIRECTIONAL 1
| #define HAVE_LIBM 1
| /* end confdefs.h. */
|
| /* Override any gcc2 internal prototype to avoid an error. */
| #ifdef __cplusplus
| extern "C"
| #endif
| /* We use char because int might match the return type of a gcc2
| builtin and then its argument prototype would still apply. */
| char gethostent ();
| int
| main ()
| {
| gethostent ();
| ;
| return 0;
| }
configure:22264: result: no
configure:22275: checking for gethostent in -lbind
configure:22305: gcc -o conftest -g -O2 conftest.c -lbind -lm -L/usr/lib -lcurl -L/usr/lib -lgssapi_krb5 -lkrb5 -lk5crypto -lkrb5support -lcom_err -lresolv -lidn -lssl -lcrypto -ldl -lssl -lcrypto -lz >&5
/usr/bin/ld: cannot find -lbind
collect2: ld returned 1 exit status
configure:22311: $? = 1
configure: failed program was:
| /* confdefs.h. */
|
| #define PACKAGE_NAME ""
| #define PACKAGE_TARNAME ""
| #define PACKAGE_VERSION ""
| #define PACKAGE_STRING ""
| #define PACKAGE_BUGREPORT ""
| #define PACKAGE "bzflag"
| #define VERSION "2.0.9"
| #define BZ_BUILD_OS "linux-gnu"
| #define BZ_BUILD_USER "mofo"
| #define BUILD_REGEX 1
| #ifdef __cplusplus
| void exit (int);
| #endif
| #define STDC_HEADERS 1
| #define HAVE_SYS_TYPES_H 1
| #define HAVE_SYS_STAT_H 1
| #define HAVE_STDLIB_H 1
| #define HAVE_STRING_H 1
| #define HAVE_MEMORY_H 1
| #define HAVE_STRINGS_H 1
| #define HAVE_INTTYPES_H 1
| #define HAVE_STDINT_H 1
| #define HAVE_UNISTD_H 1
| #define HAVE_DLFCN_H 1
| #define STDC_HEADERS 1
| #define HAVE_GL_GLX_H 1
| #define HAVE_SDL_SDL_H 1
| #define HAVE_X11_XLIB_H 1
| #define HAVE_LINUX_INPUT_H 1
| #define HAVE_STDINT_H 1
| #define HAVE_SYS_PARAM_H 1
| #define HAVE_UNISTD_H 1
| #define HAVE_VALUES_H 1
| #define HAVE_SOCKLEN_T 1
| #define HAVE_FF_EFFECT_RUMBLE 1
| #define HAVE_FF_EFFECT_DIRECTIONAL 1
| #define HAVE_LIBM 1
| /* end confdefs.h. */
|
| /* Override any gcc2 internal prototype to avoid an error. */
| #ifdef __cplusplus
| extern "C"
| #endif
| /* We use char because int might match the return type of a gcc2
| builtin and then its argument prototype would still apply. */
| char gethostent ();
| int
| main ()
| {
| gethostent ();
| ;
| return 0;
| }
configure:22336: result: no
configure:22351: checking for acosf in -lm
configure:22381: gcc -o conftest -g -O2 conftest.c -lm -lm -L/usr/lib -lcurl -L/usr/lib -lgssapi_krb5 -lkrb5 -lk5crypto -lkrb5support -lcom_err -lresolv -lidn -lssl -lcrypto -ldl -lssl -lcrypto -lz >&5
conftest.c:48: warning: conflicting types for built-in function 'acosf'
configure:22387: $? = 0
configure:22390: test -z || test ! -s conftest.err
configure:22393: $? = 0
configure:22396: test -s conftest
configure:22399: $? = 0
configure:22412: result: yes
configure:22422: checking for asinf in -lm
configure:22452: gcc -o conftest -g -O2 conftest.c -lm -lm -L/usr/lib -lcurl -L/usr/lib -lgssapi_krb5 -lkrb5 -lk5crypto -lkrb5support -lcom_err -lresolv -lidn -lssl -lcrypto -ldl -lssl -lcrypto -lz >&5
conftest.c:49: warning: conflicting types for built-in function 'asinf'
configure:22458: $? = 0
configure:22461: test -z || test ! -s conftest.err
configure:22464: $? = 0
configure:22467: test -s conftest
configure:22470: $? = 0
configure:22483: result: yes
configure:22493: checking for atan2f in -lm
configure:22523: gcc -o conftest -g -O2 conftest.c -lm -lm -L/usr/lib -lcurl -L/usr/lib -lgssapi_krb5 -lkrb5 -lk5crypto -lkrb5support -lcom_err -lresolv -lidn -lssl -lcrypto -ldl -lssl -lcrypto -lz >&5
conftest.c:50: warning: conflicting types for built-in function 'atan2f'
configure:22529: $? = 0
configure:22532: test -z || test ! -s conftest.err
configure:22535: $? = 0
configure:22538: test -s conftest
configure:22541: $? = 0
configure:22554: result: yes
configure:22564: checking for atanf in -lm
configure:22594: gcc -o conftest -g -O2 conftest.c -lm -lm -L/usr/lib -lcurl -L/usr/lib -lgssapi_krb5 -lkrb5 -lk5crypto -lkrb5support -lcom_err -lresolv -lidn -lssl -lcrypto -ldl -lssl -lcrypto -lz >&5
conftest.c:51: warning: conflicting types for built-in function 'atanf'
configure:22600: $? = 0
configure:22603: test -z || test ! -s conftest.err
configure:22606: $? = 0
configure:22609: test -s conftest
configure:22612: $? = 0
configure:22625: result: yes
configure:22635: checking for cosf in -lm
configure:22665: gcc -o conftest -g -O2 conftest.c -lm -lm -L/usr/lib -lcurl -L/usr/lib -lgssapi_krb5 -lkrb5 -lk5crypto -lkrb5support -lcom_err -lresolv -lidn -lssl -lcrypto -ldl -lssl -lcrypto -lz >&5
conftest.c:52: warning: conflicting types for built-in function 'cosf'
configure:22671: $? = 0
configure:22674: test -z || test ! -s conftest.err
configure:22677: $? = 0
configure:22680: test -s conftest
configure:22683: $? = 0
configure:22696: result: yes
configure:22706: checking for expf in -lm
configure:22736: gcc -o conftest -g -O2 conftest.c -lm -lm -L/usr/lib -lcurl -L/usr/lib -lgssapi_krb5 -lkrb5 -lk5crypto -lkrb5support -lcom_err -lresolv -lidn -lssl -lcrypto -ldl -lssl -lcrypto -lz >&5
conftest.c:53: warning: conflicting types for built-in function 'expf'
configure:22742: $? = 0
configure:22745: test -z || test ! -s conftest.err
configure:22748: $? = 0
configure:22751: test -s conftest
configure:22754: $? = 0
configure:22767: result: yes
configure:22777: checking for fabsf in -lm
configure:22807: gcc -o conftest -g -O2 conftest.c -lm -lm -L/usr/lib -lcurl -L/usr/lib -lgssapi_krb5 -lkrb5 -lk5crypto -lkrb5support -lcom_err -lresolv -lidn -lssl -lcrypto -ldl -lssl -lcrypto -lz >&5
conftest.c:54: warning: conflicting types for built-in function 'fabsf'
configure:22813: $? = 0
configure:22816: test -z || test ! -s conftest.err
configure:22819: $? = 0
configure:22822: test -s conftest
configure:22825: $? = 0
configure:22838: result: yes
configure:22848: checking for floorf in -lm
configure:22878: gcc -o conftest -g -O2 conftest.c -lm -lm -L/usr/lib -lcurl -L/usr/lib -lgssapi_krb5 -lkrb5 -lk5crypto -lkrb5support -lcom_err -lresolv -lidn -lssl -lcrypto -ldl -lssl -lcrypto -lz >&5
conftest.c:55: warning: conflicting types for built-in function 'floorf'
configure:22884: $? = 0
configure:22887: test -z || test ! -s conftest.err
configure:22890: $? = 0
configure:22893: test -s conftest
configure:22896: $? = 0
configure:22909: result: yes
configure:22919: checking for fmodf in -lm
configure:22949: gcc -o conftest -g -O2 conftest.c -lm -lm -L/usr/lib -lcurl -L/usr/lib -lgssapi_krb5 -lkrb5 -lk5crypto -lkrb5support -lcom_err -lresolv -lidn -lssl -lcrypto -ldl -lssl -lcrypto -lz >&5
conftest.c:56: warning: conflicting types for built-in function 'fmodf'
configure:22955: $? = 0
configure:22958: test -z || test ! -s conftest.err
configure:22961: $? = 0
configure:22964: test -s conftest
configure:22967: $? = 0
configure:22980: result: yes
configure:22990: checking for hypotf in -lm
configure:23020: gcc -o conftest -g -O2 conftest.c -lm -lm -L/usr/lib -lcurl -L/usr/lib -lgssapi_krb5 -lkrb5 -lk5crypto -lkrb5support -lcom_err -lresolv -lidn -lssl -lcrypto -ldl -lssl -lcrypto -lz >&5
conftest.c:57: warning: conflicting types for built-in function 'hypotf'
configure:23026: $? = 0
configure:23029: test -z || test ! -s conftest.err
configure:23032: $? = 0
configure:23035: test -s conftest
configure:23038: $? = 0
configure:23051: result: yes
configure:23061: checking for logf in -lm
configure:23091: gcc -o conftest -g -O2 conftest.c -lm -lm -L/usr/lib -lcurl -L/usr/lib -lgssapi_krb5 -lkrb5 -lk5crypto -lkrb5support -lcom_err -lresolv -lidn -lssl -lcrypto -ldl -lssl -lcrypto -lz >&5
conftest.c:58: warning: conflicting types for built-in function 'logf'
configure:23097: $? = 0
configure:23100: test -z || test ! -s conftest.err
configure:23103: $? = 0
configure:23106: test -s conftest
configure:23109: $? = 0
configure:23122: result: yes
configure:23132: checking for log10f in -lm
configure:23162: gcc -o conftest -g -O2 conftest.c -lm -lm -L/usr/lib -lcurl -L/usr/lib -lgssapi_krb5 -lkrb5 -lk5crypto -lkrb5support -lcom_err -lresolv -lidn -lssl -lcrypto -ldl -lssl -lcrypto -lz >&5
conftest.c:59: warning: conflicting types for built-in function 'log10f'
configure:23168: $? = 0
configure:23171: test -z || test ! -s conftest.err
configure:23174: $? = 0
configure:23177: test -s conftest
configure:23180: $? = 0
configure:23193: result: yes
configure:23203: checking for powf in -lm
configure:23233: gcc -o conftest -g -O2 conftest.c -lm -lm -L/usr/lib -lcurl -L/usr/lib -lgssapi_krb5 -lkrb5 -lk5crypto -lkrb5support -lcom_err -lresolv -lidn -lssl -lcrypto -ldl -lssl -lcrypto -lz >&5
conftest.c:60: warning: conflicting types for built-in function 'powf'
configure:23239: $? = 0
configure:23242: test -z || test ! -s conftest.err
configure:23245: $? = 0
configure:23248: test -s conftest
configure:23251: $? = 0
configure:23264: result: yes
configure:23274: checking for sinf in -lm
configure:23304: gcc -o conftest -g -O2 conftest.c -lm -lm -L/usr/lib -lcurl -L/usr/lib -lgssapi_krb5 -lkrb5 -lk5crypto -lkrb5support -lcom_err -lresolv -lidn -lssl -lcrypto -ldl -lssl -lcrypto -lz >&5
conftest.c:61: warning: conflicting types for built-in function 'sinf'
configure:23310: $? = 0
configure:23313: test -z || test ! -s conftest.err
configure:23316: $? = 0
configure:23319: test -s conftest
configure:23322: $? = 0
configure:23335: result: yes
configure:23345: checking for sqrtf in -lm
configure:23406: result: yes
configure:23416: checking for tanf in -lm
configure:23446: gcc -o conftest -g -O2 conftest.c -lm -lm -L/usr/lib -lcurl -L/usr/lib -lgssapi_krb5 -lkrb5 -lk5crypto -lkrb5support -lcom_err -lresolv -lidn -lssl -lcrypto -ldl -lssl -lcrypto -lz >&5
conftest.c:63: warning: conflicting types for built-in function 'tanf'
configure:23452: $? = 0
configure:23455: test -z || test ! -s conftest.err
configure:23458: $? = 0
configure:23461: test -s conftest
configure:23464: $? = 0
configure:23477: result: yes
configure:23499: checking for XextAddDisplay in -lXext
configure:23529: gcc -o conftest -g -O2 conftest.c -lXext -lSM -lICE -lX11 -lm -L/usr/lib -lcurl -L/usr/lib -lgssapi_krb5 -lkrb5 -lk5crypto -lkrb5support -lcom_err -lresolv -lidn -lssl -lcrypto -ldl -lssl -lcrypto -lz >&5
configure:23535: $? = 0
configure:23538: test -z || test ! -s conftest.err
configure:23541: $? = 0
configure:23544: test -s conftest
configure:23547: $? = 0
configure:23560: result: yes
configure:23568: checking for XF86VidModeGetAllModeLines in -lXxf86vm
configure:23598: gcc -o conftest -g -O2 conftest.c -lXxf86vm -lXext -lSM -lICE -lX11 -lm -L/usr/lib -lcurl -L/usr/lib -lgssapi_krb5 -lkrb5 -lk5crypto -lkrb5support -lcom_err -lresolv -lidn -lssl -lcrypto -ldl -lssl -lcrypto -lz >&5
/usr/bin/ld: cannot find -lXxf86vm
collect2: ld returned 1 exit status
configure:23604: $? = 1
configure: failed program was:
| /* confdefs.h. */
|
| #define PACKAGE_NAME ""
| #define PACKAGE_TARNAME ""
| #define PACKAGE_VERSION ""
| #define PACKAGE_STRING ""
| #define PACKAGE_BUGREPORT ""
| #define PACKAGE "bzflag"
| #define VERSION "2.0.9"
| #define BZ_BUILD_OS "linux-gnu"
| #define BZ_BUILD_USER "mofo"
| #define BUILD_REGEX 1
| #ifdef __cplusplus
| void exit (int);
| #endif
| #define STDC_HEADERS 1
| #define HAVE_SYS_TYPES_H 1
| #define HAVE_SYS_STAT_H 1
| #define HAVE_STDLIB_H 1
| #define HAVE_STRING_H 1
| #define HAVE_MEMORY_H 1
| #define HAVE_STRINGS_H 1
| #define HAVE_INTTYPES_H 1
| #define HAVE_STDINT_H 1
| #define HAVE_UNISTD_H 1
| #define HAVE_DLFCN_H 1
| #define STDC_HEADERS 1
| #define HAVE_GL_GLX_H 1
| #define HAVE_SDL_SDL_H 1
| #define HAVE_X11_XLIB_H 1
| #define HAVE_LINUX_INPUT_H 1
| #define HAVE_STDINT_H 1
| #define HAVE_SYS_PARAM_H 1
| #define HAVE_UNISTD_H 1
| #define HAVE_VALUES_H 1
| #define HAVE_SOCKLEN_T 1
| #define HAVE_FF_EFFECT_RUMBLE 1
| #define HAVE_FF_EFFECT_DIRECTIONAL 1
| #define HAVE_LIBM 1
| #define HAVE_ACOSF 1
| #define HAVE_ASINF 1
| #define HAVE_ATAN2F 1
| #define HAVE_ATANF 1
| #define HAVE_COSF 1
| #define HAVE_EXPF 1
| #define HAVE_FABSF 1
| #define HAVE_FLOORF 1
| #define HAVE_FMODF 1
| #define HAVE_HYPOTF 1
| #define HAVE_LOGF 1
| #define HAVE_LOG10F 1
| #define HAVE_POWF 1
| #define HAVE_SINF 1
| #define HAVE_SQRTF 1
| #define HAVE_TANF 1
| /* end confdefs.h. */
|
| /* Override any gcc2 internal prototype to avoid an error. */
| #ifdef __cplusplus
| extern "C"
| #endif
| /* We use char because int might match the return type of a gcc2
| builtin and then its argument prototype would still apply. */
| char XF86VidModeGetAllModeLines ();
| int
| main ()
| {
| XF86VidModeGetAllModeLines ();
| ;
| return 0;
| }
configure:23629: result: no
configure:23635: checking for XListInputDevices in -lXi
configure:23665: gcc -o conftest -g -O2 conftest.c -lXi -lXext -lSM -lICE -lX11 -lm -L/usr/lib -lcurl -L/usr/lib -lgssapi_krb5 -lkrb5 -lk5crypto -lkrb5support -lcom_err -lresolv -lidn -lssl -lcrypto -ldl -lssl -lcrypto -lz >&5
configure:23671: $? = 0
configure:23674: test -z || test ! -s conftest.err
configure:23677: $? = 0
configure:23680: test -s conftest
configure:23683: $? = 0
configure:23696: result: yes
configure:23735: g++ -o conftest conftest.cc -lm -L/usr/lib -lcurl -L/usr/lib -lgssapi_krb5 -lkrb5 -lk5crypto -lkrb5support -lcom_err -lresolv -lidn -lssl -lcrypto -ldl -lssl -lcrypto -lz >&5
./configure: line 23736: g++: command not found
configure:23741: $? = 127
configure: failed program was:
| /* confdefs.h. */
|
| #define PACKAGE_NAME ""
| #define PACKAGE_TARNAME ""
| #define PACKAGE_VERSION ""
| #define PACKAGE_STRING ""
| #define PACKAGE_BUGREPORT ""
| #define PACKAGE "bzflag"
| #define VERSION "2.0.9"
| #define BZ_BUILD_OS "linux-gnu"
| #define BZ_BUILD_USER "mofo"
| #define BUILD_REGEX 1
| #ifdef __cplusplus
| void exit (int);
| #endif
| #define STDC_HEADERS 1
| #define HAVE_SYS_TYPES_H 1
| #define HAVE_SYS_STAT_H 1
| #define HAVE_STDLIB_H 1
| #define HAVE_STRING_H 1
| #define HAVE_MEMORY_H 1
| #define HAVE_STRINGS_H 1
| #define HAVE_INTTYPES_H 1
| #define HAVE_STDINT_H 1
| #define HAVE_UNISTD_H 1
| #define HAVE_DLFCN_H 1
| #define STDC_HEADERS 1
| #define HAVE_GL_GLX_H 1
| #define HAVE_SDL_SDL_H 1
| #define HAVE_X11_XLIB_H 1
| #define HAVE_LINUX_INPUT_H 1
| #define HAVE_STDINT_H 1
| #define HAVE_SYS_PARAM_H 1
| #define HAVE_UNISTD_H 1
| #define HAVE_VALUES_H 1
| #define HAVE_SOCKLEN_T 1
| #define HAVE_FF_EFFECT_RUMBLE 1
| #define HAVE_FF_EFFECT_DIRECTIONAL 1
| #define HAVE_LIBM 1
| #define HAVE_ACOSF 1
| #define HAVE_ASINF 1
| #define HAVE_ATAN2F 1
| #define HAVE_ATANF 1
| #define HAVE_COSF 1
| #define HAVE_EXPF 1
| #define HAVE_FABSF 1
| #define HAVE_FLOORF 1
| #define HAVE_FMODF 1
| #define HAVE_HYPOTF 1
| #define HAVE_LOGF 1
| #define HAVE_LOG10F 1
| #define HAVE_POWF 1
| #define HAVE_SINF 1
| #define HAVE_SQRTF 1
| #define HAVE_TANF 1
| /* end confdefs.h. */
|
| #include <sys/types.h>
| #include <regex.h>
|
| int
| main ()
| {
|
| regcomp(0, 0, 0);
| regexec(0, 0, 0, 0, 0);
|
| ;
| return 0;
| }
configure:23789: g++ -o conftest conftest.cc -framework OpenGL -lXi -lXext -lSM -lICE -lX11 -lm -L/usr/lib -lcurl -L/usr/lib -lgssapi_krb5 -lkrb5 -lk5crypto -lkrb5support -lcom_err -lresolv -lidn -lssl -lcrypto -ldl -lssl -lcrypto -lz >&5
./configure: line 23790: g++: command not found
configure:23795: $? = 127
configure: failed program was:
| /* confdefs.h. */
|
| #define PACKAGE_NAME ""
| #define PACKAGE_TARNAME ""
| #define PACKAGE_VERSION ""
| #define PACKAGE_STRING ""
| #define PACKAGE_BUGREPORT ""
| #define PACKAGE "bzflag"
| #define VERSION "2.0.9"
| #define BZ_BUILD_OS "linux-gnu"
| #define BZ_BUILD_USER "mofo"
| #define BUILD_REGEX 1
| #ifdef __cplusplus
| void exit (int);
| #endif
| #define STDC_HEADERS 1
| #define HAVE_SYS_TYPES_H 1
| #define HAVE_SYS_STAT_H 1
| #define HAVE_STDLIB_H 1
| #define HAVE_STRING_H 1
| #define HAVE_MEMORY_H 1
| #define HAVE_STRINGS_H 1
| #define HAVE_INTTYPES_H 1
| #define HAVE_STDINT_H 1
| #define HAVE_UNISTD_H 1
| #define HAVE_DLFCN_H 1
| #define STDC_HEADERS 1
| #define HAVE_GL_GLX_H 1
| #define HAVE_SDL_SDL_H 1
| #define HAVE_X11_XLIB_H 1
| #define HAVE_LINUX_INPUT_H 1
| #define HAVE_STDINT_H 1
| #define HAVE_SYS_PARAM_H 1
| #define HAVE_UNISTD_H 1
| #define HAVE_VALUES_H 1
| #define HAVE_SOCKLEN_T 1
| #define HAVE_FF_EFFECT_RUMBLE 1
| #define HAVE_FF_EFFECT_DIRECTIONAL 1
| #define HAVE_LIBM 1
| #define HAVE_ACOSF 1
| #define HAVE_ASINF 1
| #define HAVE_ATAN2F 1
| #define HAVE_ATANF 1
| #define HAVE_COSF 1
| #define HAVE_EXPF 1
| #define HAVE_FABSF 1
| #define HAVE_FLOORF 1
| #define HAVE_FMODF 1
| #define HAVE_HYPOTF 1
| #define HAVE_LOGF 1
| #define HAVE_LOG10F 1
| #define HAVE_POWF 1
| #define HAVE_SINF 1
| #define HAVE_SQRTF 1
| #define HAVE_TANF 1
| /* end confdefs.h. */
| #include <OpenGL/gl.h>
| int
| main ()
| {
| glBegin(GL_POINTS)
| ;
| return 0;
| }
configure:23835: g++ -o conftest conftest.cc -lopengl32 -lXi -lXext -lSM -lICE -lX11 -lm -L/usr/lib -lcurl -L/usr/lib -lgssapi_krb5 -lkrb5 -lk5crypto -lkrb5support -lcom_err -lresolv -lidn -lssl -lcrypto -ldl -lssl -lcrypto -lz >&5
./configure: line 23836: g++: command not found
configure:23841: $? = 127
configure: failed program was:
| /* confdefs.h. */
|
| #define PACKAGE_NAME ""
| #define PACKAGE_TARNAME ""
| #define PACKAGE_VERSION ""
| #define PACKAGE_STRING ""
| #define PACKAGE_BUGREPORT ""
| #define PACKAGE "bzflag"
| #define VERSION "2.0.9"
| #define BZ_BUILD_OS "linux-gnu"
| #define BZ_BUILD_USER "mofo"
| #define BUILD_REGEX 1
| #ifdef __cplusplus
| void exit (int);
| #endif
| #define STDC_HEADERS 1
| #define HAVE_SYS_TYPES_H 1
| #define HAVE_SYS_STAT_H 1
| #define HAVE_STDLIB_H 1
| #define HAVE_STRING_H 1
| #define HAVE_MEMORY_H 1
| #define HAVE_STRINGS_H 1
| #define HAVE_INTTYPES_H 1
| #define HAVE_STDINT_H 1
| #define HAVE_UNISTD_H 1
| #define HAVE_DLFCN_H 1
| #define STDC_HEADERS 1
| #define HAVE_GL_GLX_H 1
| #define HAVE_SDL_SDL_H 1
| #define HAVE_X11_XLIB_H 1
| #define HAVE_LINUX_INPUT_H 1
| #define HAVE_STDINT_H 1
| #define HAVE_SYS_PARAM_H 1
| #define HAVE_UNISTD_H 1
| #define HAVE_VALUES_H 1
| #define HAVE_SOCKLEN_T 1
| #define HAVE_FF_EFFECT_RUMBLE 1
| #define HAVE_FF_EFFECT_DIRECTIONAL 1
| #define HAVE_LIBM 1
| #define HAVE_ACOSF 1
| #define HAVE_ASINF 1
| #define HAVE_ATAN2F 1
| #define HAVE_ATANF 1
| #define HAVE_COSF 1
| #define HAVE_EXPF 1
| #define HAVE_FABSF 1
| #define HAVE_FLOORF 1
| #define HAVE_FMODF 1
| #define HAVE_HYPOTF 1
| #define HAVE_LOGF 1
| #define HAVE_LOG10F 1
| #define HAVE_POWF 1
| #define HAVE_SINF 1
| #define HAVE_SQRTF 1
| #define HAVE_TANF 1
| /* end confdefs.h. */
| #include <GL/gl.h>
| int
| main ()
| {
| glBegin(GL_POINTS)
| ;
| return 0;
| }
configure:23835: g++ -o conftest conftest.cc -lGL -lXi -lXext -lSM -lICE -lX11 -lm -L/usr/lib -lcurl -L/usr/lib -lgssapi_krb5 -lkrb5 -lk5crypto -lkrb5support -lcom_err -lresolv -lidn -lssl -lcrypto -ldl -lssl -lcrypto -lz >&5
./configure: line 23836: g++: command not found
configure:23841: $? = 127
configure: failed program was:
| /* confdefs.h. */
|
| #define PACKAGE_NAME ""
| #define PACKAGE_TARNAME ""
| #define PACKAGE_VERSION ""
| #define PACKAGE_STRING ""
| #define PACKAGE_BUGREPORT ""
| #define PACKAGE "bzflag"
| #define VERSION "2.0.9"
| #define BZ_BUILD_OS "linux-gnu"
| #define BZ_BUILD_USER "mofo"
| #define BUILD_REGEX 1
| #ifdef __cplusplus
| void exit (int);
| #endif
| #define STDC_HEADERS 1
| #define HAVE_SYS_TYPES_H 1
| #define HAVE_SYS_STAT_H 1
| #define HAVE_STDLIB_H 1
| #define HAVE_STRING_H 1
| #define HAVE_MEMORY_H 1
| #define HAVE_STRINGS_H 1
| #define HAVE_INTTYPES_H 1
| #define HAVE_STDINT_H 1
| #define HAVE_UNISTD_H 1
| #define HAVE_DLFCN_H 1
| #define STDC_HEADERS 1
| #define HAVE_GL_GLX_H 1
| #define HAVE_SDL_SDL_H 1
| #define HAVE_X11_XLIB_H 1
| #define HAVE_LINUX_INPUT_H 1
| #define HAVE_STDINT_H 1
| #define HAVE_SYS_PARAM_H 1
| #define HAVE_UNISTD_H 1
| #define HAVE_VALUES_H 1
| #define HAVE_SOCKLEN_T 1
| #define HAVE_FF_EFFECT_RUMBLE 1
| #define HAVE_FF_EFFECT_DIRECTIONAL 1
| #define HAVE_LIBM 1
| #define HAVE_ACOSF 1
| #define HAVE_ASINF 1
| #define HAVE_ATAN2F 1
| #define HAVE_ATANF 1
| #define HAVE_COSF 1
| #define HAVE_EXPF 1
| #define HAVE_FABSF 1
| #define HAVE_FLOORF 1
| #define HAVE_FMODF 1
| #define HAVE_HYPOTF 1
| #define HAVE_LOGF 1
| #define HAVE_LOG10F 1
| #define HAVE_POWF 1
| #define HAVE_SINF 1
| #define HAVE_SQRTF 1
| #define HAVE_TANF 1
| /* end confdefs.h. */
| #include <GL/gl.h>
| int
| main ()
| {
| glBegin(GL_POINTS)
| ;
| return 0;
| }
configure:23835: g++ -o conftest conftest.cc -lGL2 -lXi -lXext -lSM -lICE -lX11 -lm -L/usr/lib -lcurl -L/usr/lib -lgssapi_krb5 -lkrb5 -lk5crypto -lkrb5support -lcom_err -lresolv -lidn -lssl -lcrypto -ldl -lssl -lcrypto -lz >&5
./configure: line 23836: g++: command not found
configure:23841: $? = 127
configure: failed program was:
| /* confdefs.h. */
|
| #define PACKAGE_NAME ""
| #define PACKAGE_TARNAME ""
| #define PACKAGE_VERSION ""
| #define PACKAGE_STRING ""
| #define PACKAGE_BUGREPORT ""
| #define PACKAGE "bzflag"
| #define VERSION "2.0.9"
| #define BZ_BUILD_OS "linux-gnu"
| #define BZ_BUILD_USER "mofo"
| #define BUILD_REGEX 1
| #ifdef __cplusplus
| void exit (int);
| #endif
| #define STDC_HEADERS 1
| #define HAVE_SYS_TYPES_H 1
| #define HAVE_SYS_STAT_H 1
| #define HAVE_STDLIB_H 1
| #define HAVE_STRING_H 1
| #define HAVE_MEMORY_H 1
| #define HAVE_STRINGS_H 1
| #define HAVE_INTTYPES_H 1
| #define HAVE_STDINT_H 1
| #define HAVE_UNISTD_H 1
| #define HAVE_DLFCN_H 1
| #define STDC_HEADERS 1
| #define HAVE_GL_GLX_H 1
| #define HAVE_SDL_SDL_H 1
| #define HAVE_X11_XLIB_H 1
| #define HAVE_LINUX_INPUT_H 1
| #define HAVE_STDINT_H 1
| #define HAVE_SYS_PARAM_H 1
| #define HAVE_UNISTD_H 1
| #define HAVE_VALUES_H 1
| #define HAVE_SOCKLEN_T 1
| #define HAVE_FF_EFFECT_RUMBLE 1
| #define HAVE_FF_EFFECT_DIRECTIONAL 1
| #define HAVE_LIBM 1
| #define HAVE_ACOSF 1
| #define HAVE_ASINF 1
| #define HAVE_ATAN2F 1
| #define HAVE_ATANF 1
| #define HAVE_COSF 1
| #define HAVE_EXPF 1
| #define HAVE_FABSF 1
| #define HAVE_FLOORF 1
| #define HAVE_FMODF 1
| #define HAVE_HYPOTF 1
| #define HAVE_LOGF 1
| #define HAVE_LOG10F 1
| #define HAVE_POWF 1
| #define HAVE_SINF 1
| #define HAVE_SQRTF 1
| #define HAVE_TANF 1
| /* end confdefs.h. */
| #include <GL/gl.h>
| int
| main ()
| {
| glBegin(GL_POINTS)
| ;
| return 0;
| }
configure:23977: checking for GLEW library
configure:23998: g++ -o conftest conftest.cc -lGLEW >&5
./configure: line 23999: g++: command not found
configure:24004: $? = 127
configure: failed program was:
| /* confdefs.h. */
|
| #define PACKAGE_NAME ""
| #define PACKAGE_TARNAME ""
| #define PACKAGE_VERSION ""
| #define PACKAGE_STRING ""
| #define PACKAGE_BUGREPORT ""
| #define PACKAGE "bzflag"
| #define VERSION "2.0.9"
| #define BZ_BUILD_OS "linux-gnu"
| #define BZ_BUILD_USER "mofo"
| #define BUILD_REGEX 1
| #ifdef __cplusplus
| void exit (int);
| #endif
| #define STDC_HEADERS 1
| #define HAVE_SYS_TYPES_H 1
| #define HAVE_SYS_STAT_H 1
| #define HAVE_STDLIB_H 1
| #define HAVE_STRING_H 1
| #define HAVE_MEMORY_H 1
| #define HAVE_STRINGS_H 1
| #define HAVE_INTTYPES_H 1
| #define HAVE_STDINT_H 1
| #define HAVE_UNISTD_H 1
| #define HAVE_DLFCN_H 1
| #define STDC_HEADERS 1
| #define HAVE_GL_GLX_H 1
| #define HAVE_SDL_SDL_H 1
| #define HAVE_X11_XLIB_H 1
| #define HAVE_LINUX_INPUT_H 1
| #define HAVE_STDINT_H 1
| #define HAVE_SYS_PARAM_H 1
| #define HAVE_UNISTD_H 1
| #define HAVE_VALUES_H 1
| #define HAVE_SOCKLEN_T 1
| #define HAVE_FF_EFFECT_RUMBLE 1
| #define HAVE_FF_EFFECT_DIRECTIONAL 1
| #define HAVE_LIBM 1
| #define HAVE_ACOSF 1
| #define HAVE_ASINF 1
| #define HAVE_ATAN2F 1
| #define HAVE_ATANF 1
| #define HAVE_COSF 1
| #define HAVE_EXPF 1
| #define HAVE_FABSF 1
| #define HAVE_FLOORF 1
| #define HAVE_FMODF 1
| #define HAVE_HYPOTF 1
| #define HAVE_LOGF 1
| #define HAVE_LOG10F 1
| #define HAVE_POWF 1
| #define HAVE_SINF 1
| #define HAVE_SQRTF 1
| #define HAVE_TANF 1
| /* end confdefs.h. */
| #include <GL/glew.h>
| int
| main ()
| {
| glewInit()
| ;
| return 0;
| }
configure:24036: result: no
configure:24302: checking for ares_init in -lcares
configure:24332: g++ -o conftest conftest.cc -lcares -lm -L/usr/lib -lcurl -L/usr/lib -lgssapi_krb5 -lkrb5 -lk5crypto -lkrb5support -lcom_err -lresolv -lidn -lssl -lcrypto -ldl -lssl -lcrypto -lz >&5
./configure: line 24333: g++: command not found
configure:24338: $? = 127
configure: failed program was:
| /* confdefs.h. */
|
| #define PACKAGE_NAME ""
| #define PACKAGE_TARNAME ""
| #define PACKAGE_VERSION ""
| #define PACKAGE_STRING ""
| #define PACKAGE_BUGREPORT ""
| #define PACKAGE "bzflag"
| #define VERSION "2.0.9"
| #define BZ_BUILD_OS "linux-gnu"
| #define BZ_BUILD_USER "mofo"
| #define BUILD_REGEX 1
| #ifdef __cplusplus
| void exit (int);
| #endif
| #define STDC_HEADERS 1
| #define HAVE_SYS_TYPES_H 1
| #define HAVE_SYS_STAT_H 1
| #define HAVE_STDLIB_H 1
| #define HAVE_STRING_H 1
| #define HAVE_MEMORY_H 1
| #define HAVE_STRINGS_H 1
| #define HAVE_INTTYPES_H 1
| #define HAVE_STDINT_H 1
| #define HAVE_UNISTD_H 1
| #define HAVE_DLFCN_H 1
| #define STDC_HEADERS 1
| #define HAVE_GL_GLX_H 1
| #define HAVE_SDL_SDL_H 1
| #define HAVE_X11_XLIB_H 1
| #define HAVE_LINUX_INPUT_H 1
| #define HAVE_STDINT_H 1
| #define HAVE_SYS_PARAM_H 1
| #define HAVE_UNISTD_H 1
| #define HAVE_VALUES_H 1
| #define HAVE_SOCKLEN_T 1
| #define HAVE_FF_EFFECT_RUMBLE 1
| #define HAVE_FF_EFFECT_DIRECTIONAL 1
| #define HAVE_LIBM 1
| #define HAVE_ACOSF 1
| #define HAVE_ASINF 1
| #define HAVE_ATAN2F 1
| #define HAVE_ATANF 1
| #define HAVE_COSF 1
| #define HAVE_EXPF 1
| #define HAVE_FABSF 1
| #define HAVE_FLOORF 1
| #define HAVE_FMODF 1
| #define HAVE_HYPOTF 1
| #define HAVE_LOGF 1
| #define HAVE_LOG10F 1
| #define HAVE_POWF 1
| #define HAVE_SINF 1
| #define HAVE_SQRTF 1
| #define HAVE_TANF 1
| /* end confdefs.h. */
|
| /* Override any gcc2 internal prototype to avoid an error. */
| #ifdef __cplusplus
| extern "C"
| #endif
| /* We use char because int might match the return type of a gcc2
| builtin and then its argument prototype would still apply. */
| char ares_init ();
| int
| main ()
| {
| ares_init ();
| ;
| return 0;
| }
configure:24363: result: no
configure:24382: WARNING: using an internal c-ares lib.
configure:24384: WARNING: Consider installing an updated library at system level
configure:24386: WARNING: link is http://daniel.haxx.se/projects/c-ares/
configure:24407: checking for working ncurses
configure:24432: g++ -o conftest conftest.cc -lm -L/usr/lib -lcurl -L/usr/lib -lgssapi_krb5 -lkrb5 -lk5crypto -lkrb5support -lcom_err -lresolv -lidn -lssl -lcrypto -ldl -lssl -lcrypto -lz -lncurses >&5
./configure: line 24433: g++: command not found
configure:24438: $? = 127
configure: failed program was:
|
| /* confdefs.h. */
|
| #define PACKAGE_NAME ""
| #define PACKAGE_TARNAME ""
| #define PACKAGE_VERSION ""
| #define PACKAGE_STRING ""
| #define PACKAGE_BUGREPORT ""
| #define PACKAGE "bzflag"
| #define VERSION "2.0.9"
| #define BZ_BUILD_OS "linux-gnu"
| #define BZ_BUILD_USER "mofo"
| #define BUILD_REGEX 1
| #ifdef __cplusplus
| void exit (int);
| #endif
| #define STDC_HEADERS 1
| #define HAVE_SYS_TYPES_H 1
| #define HAVE_SYS_STAT_H 1
| #define HAVE_STDLIB_H 1
| #define HAVE_STRING_H 1
| #define HAVE_MEMORY_H 1
| #define HAVE_STRINGS_H 1
| #define HAVE_INTTYPES_H 1
| #define HAVE_STDINT_H 1
| #define HAVE_UNISTD_H 1
| #define HAVE_DLFCN_H 1
| #define STDC_HEADERS 1
| #define HAVE_GL_GLX_H 1
| #define HAVE_SDL_SDL_H 1
| #define HAVE_X11_XLIB_H 1
| #define HAVE_LINUX_INPUT_H 1
| #define HAVE_STDINT_H 1
| #define HAVE_SYS_PARAM_H 1
| #define HAVE_UNISTD_H 1
| #define HAVE_VALUES_H 1
| #define HAVE_SOCKLEN_T 1
| #define HAVE_FF_EFFECT_RUMBLE 1
| #define HAVE_FF_EFFECT_DIRECTIONAL 1
| #define HAVE_LIBM 1
| #define HAVE_ACOSF 1
| #define HAVE_ASINF 1
| #define HAVE_ATAN2F 1
| #define HAVE_ATANF 1
| #define HAVE_COSF 1
| #define HAVE_EXPF 1
| #define HAVE_FABSF 1
| #define HAVE_FLOORF 1
| #define HAVE_FMODF 1
| #define HAVE_HYPOTF 1
| #define HAVE_LOGF 1
| #define HAVE_LOG10F 1
| #define HAVE_POWF 1
| #define HAVE_SINF 1
| #define HAVE_SQRTF 1
| #define HAVE_TANF 1
| /* end confdefs.h. */
| #include <ncurses.h>
|
| int
| main ()
| {
| chtype a; int b=A_STANDOUT, c=KEY_LEFT; initscr();
|
| ;
| return 0;
| }
configure:24462: result: no
configure:24476: checking for working curses
configure:24501: g++ -o conftest conftest.cc -lm -L/usr/lib -lcurl -L/usr/lib -lgssapi_krb5 -lkrb5 -lk5crypto -lkrb5support -lcom_err -lresolv -lidn -lssl -lcrypto -ldl -lssl -lcrypto -lz -lcurses >&5
./configure: line 24502: g++: command not found
configure:24507: $? = 127
configure: failed program was:
|
| /* confdefs.h. */
|
| #define PACKAGE_NAME ""
| #define PACKAGE_TARNAME ""
| #define PACKAGE_VERSION ""
| #define PACKAGE_STRING ""
| #define PACKAGE_BUGREPORT ""
| #define PACKAGE "bzflag"
| #define VERSION "2.0.9"
| #define BZ_BUILD_OS "linux-gnu"
| #define BZ_BUILD_USER "mofo"
| #define BUILD_REGEX 1
| #ifdef __cplusplus
| void exit (int);
| #endif
| #define STDC_HEADERS 1
| #define HAVE_SYS_TYPES_H 1
| #define HAVE_SYS_STAT_H 1
| #define HAVE_STDLIB_H 1
| #define HAVE_STRING_H 1
| #define HAVE_MEMORY_H 1
| #define HAVE_STRINGS_H 1
| #define HAVE_INTTYPES_H 1
| #define HAVE_STDINT_H 1
| #define HAVE_UNISTD_H 1
| #define HAVE_DLFCN_H 1
| #define STDC_HEADERS 1
| #define HAVE_GL_GLX_H 1
| #define HAVE_SDL_SDL_H 1
| #define HAVE_X11_XLIB_H 1
| #define HAVE_LINUX_INPUT_H 1
| #define HAVE_STDINT_H 1
| #define HAVE_SYS_PARAM_H 1
| #define HAVE_UNISTD_H 1
| #define HAVE_VALUES_H 1
| #define HAVE_SOCKLEN_T 1
| #define HAVE_FF_EFFECT_RUMBLE 1
| #define HAVE_FF_EFFECT_DIRECTIONAL 1
| #define HAVE_LIBM 1
| #define HAVE_ACOSF 1
| #define HAVE_ASINF 1
| #define HAVE_ATAN2F 1
| #define HAVE_ATANF 1
| #define HAVE_COSF 1
| #define HAVE_EXPF 1
| #define HAVE_FABSF 1
| #define HAVE_FLOORF 1
| #define HAVE_FMODF 1
| #define HAVE_HYPOTF 1
| #define HAVE_LOGF 1
| #define HAVE_LOG10F 1
| #define HAVE_POWF 1
| #define HAVE_SINF 1
| #define HAVE_SQRTF 1
| #define HAVE_TANF 1
| /* end confdefs.h. */
| #include <curses.h>
|
| int
| main ()
| {
| chtype a; int b=A_STANDOUT, c=KEY_LEFT; initscr();
|
| ;
| return 0;
| }
configure:24531: result: no
configure:24545: checking for working PDcurses
configure:24570: g++ -o conftest conftest.cc -lm -L/usr/lib -lcurl -L/usr/lib -lgssapi_krb5 -lkrb5 -lk5crypto -lkrb5support -lcom_err -lresolv -lidn -lssl -lcrypto -ldl -lssl -lcrypto -lz -lpdcurses >&5
./configure: line 24571: g++: command not found
configure:24576: $? = 127
configure: failed program was:
|
| /* confdefs.h. */
|
| #define PACKAGE_NAME ""
| #define PACKAGE_TARNAME ""
| #define PACKAGE_VERSION ""
| #define PACKAGE_STRING ""
| #define PACKAGE_BUGREPORT ""
| #define PACKAGE "bzflag"
| #define VERSION "2.0.9"
| #define BZ_BUILD_OS "linux-gnu"
| #define BZ_BUILD_USER "mofo"
| #define BUILD_REGEX 1
| #ifdef __cplusplus
| void exit (int);
| #endif
| #define STDC_HEADERS 1
| #define HAVE_SYS_TYPES_H 1
| #define HAVE_SYS_STAT_H 1
| #define HAVE_STDLIB_H 1
| #define HAVE_STRING_H 1
| #define HAVE_MEMORY_H 1
| #define HAVE_STRINGS_H 1
| #define HAVE_INTTYPES_H 1
| #define HAVE_STDINT_H 1
| #define HAVE_UNISTD_H 1
| #define HAVE_DLFCN_H 1
| #define STDC_HEADERS 1
| #define HAVE_GL_GLX_H 1
| #define HAVE_SDL_SDL_H 1
| #define HAVE_X11_XLIB_H 1
| #define HAVE_LINUX_INPUT_H 1
| #define HAVE_STDINT_H 1
| #define HAVE_SYS_PARAM_H 1
| #define HAVE_UNISTD_H 1
| #define HAVE_VALUES_H 1
| #define HAVE_SOCKLEN_T 1
| #define HAVE_FF_EFFECT_RUMBLE 1
| #define HAVE_FF_EFFECT_DIRECTIONAL 1
| #define HAVE_LIBM 1
| #define HAVE_ACOSF 1
| #define HAVE_ASINF 1
| #define HAVE_ATAN2F 1
| #define HAVE_ATANF 1
| #define HAVE_COSF 1
| #define HAVE_EXPF 1
| #define HAVE_FABSF 1
| #define HAVE_FLOORF 1
| #define HAVE_FMODF 1
| #define HAVE_HYPOTF 1
| #define HAVE_LOGF 1
| #define HAVE_LOG10F 1
| #define HAVE_POWF 1
| #define HAVE_SINF 1
| #define HAVE_SQRTF 1
| #define HAVE_TANF 1
| /* end confdefs.h. */
| #include <curses.h>
|
| int
| main ()
| {
| chtype a; int b=A_STANDOUT, c=KEY_LEFT; initscr();
|
| ;
| return 0;
| }
configure:24600: result: no
configure:24615: checking for working XCurses
configure:24640: g++ -o conftest conftest.cc -lm -L/usr/lib -lcurl -L/usr/lib -lgssapi_krb5 -lkrb5 -lk5crypto -lkrb5support -lcom_err -lresolv -lidn -lssl -lcrypto -ldl -lssl -lcrypto -lz -lXCurses -L -lXaw -lXmu -lXt -lX11 -lSM -lICE -lXext >&5
./configure: line 24641: g++: command not found
configure:24646: $? = 127
configure: failed program was:
|
| /* confdefs.h. */
|
| #define PACKAGE_NAME ""
| #define PACKAGE_TARNAME ""
| #define PACKAGE_VERSION ""
| #define PACKAGE_STRING ""
| #define PACKAGE_BUGREPORT ""
| #define PACKAGE "bzflag"
| #define VERSION "2.0.9"
| #define BZ_BUILD_OS "linux-gnu"
| #define BZ_BUILD_USER "mofo"
| #define BUILD_REGEX 1
| #ifdef __cplusplus
| void exit (int);
| #endif
| #define STDC_HEADERS 1
| #define HAVE_SYS_TYPES_H 1
| #define HAVE_SYS_STAT_H 1
| #define HAVE_STDLIB_H 1
| #define HAVE_STRING_H 1
| #define HAVE_MEMORY_H 1
| #define HAVE_STRINGS_H 1
| #define HAVE_INTTYPES_H 1
| #define HAVE_STDINT_H 1
| #define HAVE_UNISTD_H 1
| #define HAVE_DLFCN_H 1
| #define STDC_HEADERS 1
| #define HAVE_GL_GLX_H 1
| #define HAVE_SDL_SDL_H 1
| #define HAVE_X11_XLIB_H 1
| #define HAVE_LINUX_INPUT_H 1
| #define HAVE_STDINT_H 1
| #define HAVE_SYS_PARAM_H 1
| #define HAVE_UNISTD_H 1
| #define HAVE_VALUES_H 1
| #define HAVE_SOCKLEN_T 1
| #define HAVE_FF_EFFECT_RUMBLE 1
| #define HAVE_FF_EFFECT_DIRECTIONAL 1
| #define HAVE_LIBM 1
| #define HAVE_ACOSF 1
| #define HAVE_ASINF 1
| #define HAVE_ATAN2F 1
| #define HAVE_ATANF 1
| #define HAVE_COSF 1
| #define HAVE_EXPF 1
| #define HAVE_FABSF 1
| #define HAVE_FLOORF 1
| #define HAVE_FMODF 1
| #define HAVE_HYPOTF 1
| #define HAVE_LOGF 1
| #define HAVE_LOG10F 1
| #define HAVE_POWF 1
| #define HAVE_SINF 1
| #define HAVE_SQRTF 1
| #define HAVE_TANF 1
| /* end confdefs.h. */
| #include <xcurses.h>
|
| int
| main ()
| {
| chtype a; int b=A_STANDOUT, c=KEY_LEFT; initscr();
|
| ;
| return 0;
| }
configure:24670: result: no
configure:24753: checking for SDL framework
configure:24774: gcc -o conftest -g -O2 -framework SDL conftest.c -lXi -lXext -lSM -lICE -lX11 -lm -L/usr/lib -lcurl -L/usr/lib -lgssapi_krb5 -lkrb5 -lk5crypto -lkrb5support -lcom_err -lresolv -lidn -lssl -lcrypto -ldl -lssl -lcrypto -lz >&5
gcc: SDL: No such file or directory
cc1: error: unrecognized command line option "-framework"
configure:24780: $? = 1
configure: failed program was:
| /* confdefs.h. */
|
| #define PACKAGE_NAME ""
| #define PACKAGE_TARNAME ""
| #define PACKAGE_VERSION ""
| #define PACKAGE_STRING ""
| #define PACKAGE_BUGREPORT ""
| #define PACKAGE "bzflag"
| #define VERSION "2.0.9"
| #define BZ_BUILD_OS "linux-gnu"
| #define BZ_BUILD_USER "mofo"
| #define BUILD_REGEX 1
| #ifdef __cplusplus
| void exit (int);
| #endif
| #define STDC_HEADERS 1
| #define HAVE_SYS_TYPES_H 1
| #define HAVE_SYS_STAT_H 1
| #define HAVE_STDLIB_H 1
| #define HAVE_STRING_H 1
| #define HAVE_MEMORY_H 1
| #define HAVE_STRINGS_H 1
| #define HAVE_INTTYPES_H 1
| #define HAVE_STDINT_H 1
| #define HAVE_UNISTD_H 1
| #define HAVE_DLFCN_H 1
| #define STDC_HEADERS 1
| #define HAVE_GL_GLX_H 1
| #define HAVE_SDL_SDL_H 1
| #define HAVE_X11_XLIB_H 1
| #define HAVE_LINUX_INPUT_H 1
| #define HAVE_STDINT_H 1
| #define HAVE_SYS_PARAM_H 1
| #define HAVE_UNISTD_H 1
| #define HAVE_VALUES_H 1
| #define HAVE_SOCKLEN_T 1
| #define HAVE_FF_EFFECT_RUMBLE 1
| #define HAVE_FF_EFFECT_DIRECTIONAL 1
| #define HAVE_LIBM 1
| #define HAVE_ACOSF 1
| #define HAVE_ASINF 1
| #define HAVE_ATAN2F 1
| #define HAVE_ATANF 1
| #define HAVE_COSF 1
| #define HAVE_EXPF 1
| #define HAVE_FABSF 1
| #define HAVE_FLOORF 1
| #define HAVE_FMODF 1
| #define HAVE_HYPOTF 1
| #define HAVE_LOGF 1
| #define HAVE_LOG10F 1
| #define HAVE_POWF 1
| #define HAVE_SINF 1
| #define HAVE_SQRTF 1
| #define HAVE_TANF 1
| /* end confdefs.h. */
| #include <SDL/SDL_version.h>
| int
| main ()
| {
|
| ;
| return 0;
| }
configure:24803: result: no
configure:24852: checking for sdl-config
configure:24870: found /usr/bin/sdl-config
configure:24883: result: /usr/bin/sdl-config
configure:24891: checking for SDL - version >= 1.2.5
configure:24983: gcc -o conftest -g -O2 -I/usr/include/SDL -D_REENTRANT conftest.c -lXi -lXext -lSM -lICE -lX11 -lm -L/usr/lib -lcurl -L/usr/lib -lgssapi_krb5 -lkrb5 -lk5crypto -lkrb5support -lcom_err -lresolv -lidn -lssl -lcrypto -ldl -lssl -lcrypto -lz -L/usr/lib -lSDL -lpthread >&5
configure:24986: $? = 0
configure:24988: ./conftest
configure:24991: $? = 0
configure:25010: result: yes
configure:25140: checking for SDL_image library
configure:25161: g++ -o conftest conftest.cc -lSDL_image >&5
./configure: line 25162: g++: command not found
configure:25167: $? = 127
configure: failed program was:
| /* confdefs.h. */
|
| #define PACKAGE_NAME ""
| #define PACKAGE_TARNAME ""
| #define PACKAGE_VERSION ""
| #define PACKAGE_STRING ""
| #define PACKAGE_BUGREPORT ""
| #define PACKAGE "bzflag"
| #define VERSION "2.0.9"
| #define BZ_BUILD_OS "linux-gnu"
| #define BZ_BUILD_USER "mofo"
| #define BUILD_REGEX 1
| #ifdef __cplusplus
| void exit (int);
| #endif
| #define STDC_HEADERS 1
| #define HAVE_SYS_TYPES_H 1
| #define HAVE_SYS_STAT_H 1
| #define HAVE_STDLIB_H 1
| #define HAVE_STRING_H 1
| #define HAVE_MEMORY_H 1
| #define HAVE_STRINGS_H 1
| #define HAVE_INTTYPES_H 1
| #define HAVE_STDINT_H 1
| #define HAVE_UNISTD_H 1
| #define HAVE_DLFCN_H 1
| #define STDC_HEADERS 1
| #define HAVE_GL_GLX_H 1
| #define HAVE_SDL_SDL_H 1
| #define HAVE_X11_XLIB_H 1
| #define HAVE_LINUX_INPUT_H 1
| #define HAVE_STDINT_H 1
| #define HAVE_SYS_PARAM_H 1
| #define HAVE_UNISTD_H 1
| #define HAVE_VALUES_H 1
| #define HAVE_SOCKLEN_T 1
| #define HAVE_FF_EFFECT_RUMBLE 1
| #define HAVE_FF_EFFECT_DIRECTIONAL 1
| #define HAVE_LIBM 1
| #define HAVE_ACOSF 1
| #define HAVE_ASINF 1
| #define HAVE_ATAN2F 1
| #define HAVE_ATANF 1
| #define HAVE_COSF 1
| #define HAVE_EXPF 1
| #define HAVE_FABSF 1
| #define HAVE_FLOORF 1
| #define HAVE_FMODF 1
| #define HAVE_HYPOTF 1
| #define HAVE_LOGF 1
| #define HAVE_LOG10F 1
| #define HAVE_POWF 1
| #define HAVE_SINF 1
| #define HAVE_SQRTF 1
| #define HAVE_TANF 1
| #define HAVE_SDL 1
| /* end confdefs.h. */
| #include <SDL/SDL_image.h>
| int
| main ()
| {
| IMG_Load(NULL)
| ;
| return 0;
| }
configure:25199: result: no
configure:25240: WARNING: Client build has been requested, but GL is not fully available (missing gl.h)
... disabling client generation
configure:25477: checking if the compiler understands -Wl,-search_paths_first -mdynamic-no-pic
configure:25498: g++ -o conftest -ffast-math -fno-exceptions -fsigned-char -Wall -W -Wshadow -mtune=i686 -Wl,-search_paths_first -mdynamic-no-pic conftest.cc -lm -L/usr/lib -lcurl -L/usr/lib -lgssapi_krb5 -lkrb5 -lk5crypto -lkrb5support -lcom_err -lresolv -lidn -lssl -lcrypto -ldl -lssl -lcrypto -lz >&5
./configure: line 25499: g++: command not found
configure:25504: $? = 127
configure: failed program was:
| /* confdefs.h. */
|
| #define PACKAGE_NAME ""
| #define PACKAGE_TARNAME ""
| #define PACKAGE_VERSION ""
| #define PACKAGE_STRING ""
| #define PACKAGE_BUGREPORT ""
| #define PACKAGE "bzflag"
| #define VERSION "2.0.9"
| #define BZ_BUILD_OS "linux-gnu"
| #define BZ_BUILD_USER "mofo"
| #define BUILD_REGEX 1
| #ifdef __cplusplus
| void exit (int);
| #endif
| #define STDC_HEADERS 1
| #define HAVE_SYS_TYPES_H 1
| #define HAVE_SYS_STAT_H 1
| #define HAVE_STDLIB_H 1
| #define HAVE_STRING_H 1
| #define HAVE_MEMORY_H 1
| #define HAVE_STRINGS_H 1
| #define HAVE_INTTYPES_H 1
| #define HAVE_STDINT_H 1
| #define HAVE_UNISTD_H 1
| #define HAVE_DLFCN_H 1
| #define STDC_HEADERS 1
| #define HAVE_GL_GLX_H 1
| #define HAVE_SDL_SDL_H 1
| #define HAVE_X11_XLIB_H 1
| #define HAVE_LINUX_INPUT_H 1
| #define HAVE_STDINT_H 1
| #define HAVE_SYS_PARAM_H 1
| #define HAVE_UNISTD_H 1
| #define HAVE_VALUES_H 1
| #define HAVE_SOCKLEN_T 1
| #define HAVE_FF_EFFECT_RUMBLE 1
| #define HAVE_FF_EFFECT_DIRECTIONAL 1
| #define HAVE_LIBM 1
| #define HAVE_ACOSF 1
| #define HAVE_ASINF 1
| #define HAVE_ATAN2F 1
| #define HAVE_ATANF 1
| #define HAVE_COSF 1
| #define HAVE_EXPF 1
| #define HAVE_FABSF 1
| #define HAVE_FLOORF 1
| #define HAVE_FMODF 1
| #define HAVE_HYPOTF 1
| #define HAVE_LOGF 1
| #define HAVE_LOG10F 1
| #define HAVE_POWF 1
| #define HAVE_SINF 1
| #define HAVE_SQRTF 1
| #define HAVE_TANF 1
| #define HAVE_SDL 1
| #define ROBOT 1
| #define SNAPPING 1
| #define INSTALL_DATA_DIR "/usr/local/share/bzflag"
| #define HALF_RATE_AUDIO 1
| #define XF86VIDMODE_EXT 1
| #define NDEBUG 1
| /* end confdefs.h. */
|
| int
| main ()
| {
|
| ;
| return 0;
| }
configure:25527: result: no
configure:25567: checking for CGLGetCurrentContext
configure:25624: g++ -o conftest -ffast-math -fno-exceptions -fsigned-char -Wall -W -Wshadow -mtune=i686 conftest.cc -lm -L/usr/lib -lcurl -L/usr/lib -lgssapi_krb5 -lkrb5 -lk5crypto -lkrb5support -lcom_err -lresolv -lidn -lssl -lcrypto -ldl -lssl -lcrypto -lz >&5
./configure: line 25625: g++: command not found
configure:25630: $? = 127
configure: failed program was:
| /* confdefs.h. */
|
| #define PACKAGE_NAME ""
| #define PACKAGE_TARNAME ""
| #define PACKAGE_VERSION ""
| #define PACKAGE_STRING ""
| #define PACKAGE_BUGREPORT ""
| #define PACKAGE "bzflag"
| #define VERSION "2.0.9"
| #define BZ_BUILD_OS "linux-gnu"
| #define BZ_BUILD_USER "mofo"
| #define BUILD_REGEX 1
| #ifdef __cplusplus
| void exit (int);
| #endif
| #define STDC_HEADERS 1
| #define HAVE_SYS_TYPES_H 1
| #define HAVE_SYS_STAT_H 1
| #define HAVE_STDLIB_H 1
| #define HAVE_STRING_H 1
| #define HAVE_MEMORY_H 1
| #define HAVE_STRINGS_H 1
| #define HAVE_INTTYPES_H 1
| #define HAVE_STDINT_H 1
| #define HAVE_UNISTD_H 1
| #define HAVE_DLFCN_H 1
| #define STDC_HEADERS 1
| #define HAVE_GL_GLX_H 1
| #define HAVE_SDL_SDL_H 1
| #define HAVE_X11_XLIB_H 1
| #define HAVE_LINUX_INPUT_H 1
| #define HAVE_STDINT_H 1
| #define HAVE_SYS_PARAM_H 1
| #define HAVE_UNISTD_H 1
| #define HAVE_VALUES_H 1
| #define HAVE_SOCKLEN_T 1
| #define HAVE_FF_EFFECT_RUMBLE 1
| #define HAVE_FF_EFFECT_DIRECTIONAL 1
| #define HAVE_LIBM 1
| #define HAVE_ACOSF 1
| #define HAVE_ASINF 1
| #define HAVE_ATAN2F 1
| #define HAVE_ATANF 1
| #define HAVE_COSF 1
| #define HAVE_EXPF 1
| #define HAVE_FABSF 1
| #define HAVE_FLOORF 1
| #define HAVE_FMODF 1
| #define HAVE_HYPOTF 1
| #define HAVE_LOGF 1
| #define HAVE_LOG10F 1
| #define HAVE_POWF 1
| #define HAVE_SINF 1
| #define HAVE_SQRTF 1
| #define HAVE_TANF 1
| #define HAVE_SDL 1
| #define ROBOT 1
| #define SNAPPING 1
| #define INSTALL_DATA_DIR "/usr/local/share/bzflag"
| #define HALF_RATE_AUDIO 1
| #define XF86VIDMODE_EXT 1
| #define NDEBUG 1
| /* end confdefs.h. */
| /* Define CGLGetCurrentContext to an innocuous variant, in case <limits.h> declares CGLGetCurrentContext.
| For example, HP-UX 11i <limits.h> declares gettimeofday. */
| #define CGLGetCurrentContext innocuous_CGLGetCurrentContext
|
| /* System header to define __stub macros and hopefully few prototypes,
| which can conflict with char CGLGetCurrentContext (); below.
| Prefer <limits.h> to <assert.h> if __STDC__ is defined, since
| <limits.h> exists even on freestanding compilers. */
|
| #ifdef __STDC__
| # include <limits.h>
| #else
| # include <assert.h>
| #endif
|
| #undef CGLGetCurrentContext
|
| /* Override any gcc2 internal prototype to avoid an error. */
| #ifdef __cplusplus
| extern "C"
| {
| #endif
| /* We use char because int might match the return type of a gcc2
| builtin and then its argument prototype would still apply. */
| char CGLGetCurrentContext ();
| /* The GNU C library defines this for functions which it implements
| to always fail with ENOSYS. Some functions are actually named
| something starting with __ and the normal name is an alias. */
| #if defined (__stub_CGLGetCurrentContext) || defined (__stub___CGLGetCurrentContext)
| choke me
| #else
| char (*f) () = CGLGetCurrentContext;
| #endif
| #ifdef __cplusplus
| }
| #endif
|
| int
| main ()
| {
| return f != CGLGetCurrentContext;
| ;
| return 0;
| }
configure:25654: result: no
configure:25567: checking for Sleep
configure:25624: g++ -o conftest -ffast-math -fno-exceptions -fsigned-char -Wall -W -Wshadow -mtune=i686 conftest.cc -lm -L/usr/lib -lcurl -L/usr/lib -lgssapi_krb5 -lkrb5 -lk5crypto -lkrb5support -lcom_err -lresolv -lidn -lssl -lcrypto -ldl -lssl -lcrypto -lz >&5
./configure: line 25625: g++: command not found
configure:25630: $? = 127
configure: failed program was:
| /* confdefs.h. */
|
| #define PACKAGE_NAME ""
| #define PACKAGE_TARNAME ""
| #define PACKAGE_VERSION ""
| #define PACKAGE_STRING ""
| #define PACKAGE_BUGREPORT ""
| #define PACKAGE "bzflag"
| #define VERSION "2.0.9"
| #define BZ_BUILD_OS "linux-gnu"
| #define BZ_BUILD_USER "mofo"
| #define BUILD_REGEX 1
| #ifdef __cplusplus
| void exit (int);
| #endif
| #define STDC_HEADERS 1
| #define HAVE_SYS_TYPES_H 1
| #define HAVE_SYS_STAT_H 1
| #define HAVE_STDLIB_H 1
| #define HAVE_STRING_H 1
| #define HAVE_MEMORY_H 1
| #define HAVE_STRINGS_H 1
| #define HAVE_INTTYPES_H 1
| #define HAVE_STDINT_H 1
| #define HAVE_UNISTD_H 1
| #define HAVE_DLFCN_H 1
| #define STDC_HEADERS 1
| #define HAVE_GL_GLX_H 1
| #define HAVE_SDL_SDL_H 1
| #define HAVE_X11_XLIB_H 1
| #define HAVE_LINUX_INPUT_H 1
| #define HAVE_STDINT_H 1
| #define HAVE_SYS_PARAM_H 1
| #define HAVE_UNISTD_H 1
| #define HAVE_VALUES_H 1
| #define HAVE_SOCKLEN_T 1
| #define HAVE_FF_EFFECT_RUMBLE 1
| #define HAVE_FF_EFFECT_DIRECTIONAL 1
| #define HAVE_LIBM 1
| #define HAVE_ACOSF 1
| #define HAVE_ASINF 1
| #define HAVE_ATAN2F 1
| #define HAVE_ATANF 1
| #define HAVE_COSF 1
| #define HAVE_EXPF 1
| #define HAVE_FABSF 1
| #define HAVE_FLOORF 1
| #define HAVE_FMODF 1
| #define HAVE_HYPOTF 1
| #define HAVE_LOGF 1
| #define HAVE_LOG10F 1
| #define HAVE_POWF 1
| #define HAVE_SINF 1
| #define HAVE_SQRTF 1
| #define HAVE_TANF 1
| #define HAVE_SDL 1
| #define ROBOT 1
| #define SNAPPING 1
| #define INSTALL_DATA_DIR "/usr/local/share/bzflag"
| #define HALF_RATE_AUDIO 1
| #define XF86VIDMODE_EXT 1
| #define NDEBUG 1
| /* end confdefs.h. */
| /* Define Sleep to an innocuous variant, in case <limits.h> declares Sleep.
| For example, HP-UX 11i <limits.h> declares gettimeofday. */
| #define Sleep innocuous_Sleep
|
| /* System header to define __stub macros and hopefully few prototypes,
| which can conflict with char Sleep (); below.
| Prefer <limits.h> to <assert.h> if __STDC__ is defined, since
| <limits.h> exists even on freestanding compilers. */
|
| #ifdef __STDC__
| # include <limits.h>
| #else
| # include <assert.h>
| #endif
|
| #undef Sleep
|
| /* Override any gcc2 internal prototype to avoid an error. */
| #ifdef __cplusplus
| extern "C"
| {
| #endif
| /* We use char because int might match the return type of a gcc2
| builtin and then its argument prototype would still apply. */
| char Sleep ();
| /* The GNU C library defines this for functions which it implements
| to always fail with ENOSYS. Some functions are actually named
| something starting with __ and the normal name is an alias. */
| #if defined (__stub_Sleep) || defined (__stub___Sleep)
| choke me
| #else
| char (*f) () = Sleep;
| #endif
| #ifdef __cplusplus
| }
| #endif
|
| int
| main ()
| {
| return f != Sleep;
| ;
| return 0;
| }
configure:25654: result: no
configure:25567: checking for WaitForSingleObject
configure:25624: g++ -o conftest -ffast-math -fno-exceptions -fsigned-char -Wall -W -Wshadow -mtune=i686 conftest.cc -lm -L/usr/lib -lcurl -L/usr/lib -lgssapi_krb5 -lkrb5 -lk5crypto -lkrb5support -lcom_err -lresolv -lidn -lssl -lcrypto -ldl -lssl -lcrypto -lz >&5
./configure: line 25625: g++: command not found
configure:25630: $? = 127
configure: failed program was:
| /* confdefs.h. */
|
| #define PACKAGE_NAME ""
| #define PACKAGE_TARNAME ""
| #define PACKAGE_VERSION ""
| #define PACKAGE_STRING ""
| #define PACKAGE_BUGREPORT ""
| #define PACKAGE "bzflag"
| #define VERSION "2.0.9"
| #define BZ_BUILD_OS "linux-gnu"
| #define BZ_BUILD_USER "mofo"
| #define BUILD_REGEX 1
| #ifdef __cplusplus
| void exit (int);
| #endif
| #define STDC_HEADERS 1
| #define HAVE_SYS_TYPES_H 1
| #define HAVE_SYS_STAT_H 1
| #define HAVE_STDLIB_H 1
| #define HAVE_STRING_H 1
| #define HAVE_MEMORY_H 1
| #define HAVE_STRINGS_H 1
| #define HAVE_INTTYPES_H 1
| #define HAVE_STDINT_H 1
| #define HAVE_UNISTD_H 1
| #define HAVE_DLFCN_H 1
| #define STDC_HEADERS 1
| #define HAVE_GL_GLX_H 1
| #define HAVE_SDL_SDL_H 1
| #define HAVE_X11_XLIB_H 1
| #define HAVE_LINUX_INPUT_H 1
| #define HAVE_STDINT_H 1
| #define HAVE_SYS_PARAM_H 1
| #define HAVE_UNISTD_H 1
| #define HAVE_VALUES_H 1
| #define HAVE_SOCKLEN_T 1
| #define HAVE_FF_EFFECT_RUMBLE 1
| #define HAVE_FF_EFFECT_DIRECTIONAL 1
| #define HAVE_LIBM 1
| #define HAVE_ACOSF 1
| #define HAVE_ASINF 1
| #define HAVE_ATAN2F 1
| #define HAVE_ATANF 1
| #define HAVE_COSF 1
| #define HAVE_EXPF 1
| #define HAVE_FABSF 1
| #define HAVE_FLOORF 1
| #define HAVE_FMODF 1
| #define HAVE_HYPOTF 1
| #define HAVE_LOGF 1
| #define HAVE_LOG10F 1
| #define HAVE_POWF 1
| #define HAVE_SINF 1
| #define HAVE_SQRTF 1
| #define HAVE_TANF 1
| #define HAVE_SDL 1
| #define ROBOT 1
| #define SNAPPING 1
| #define INSTALL_DATA_DIR "/usr/local/share/bzflag"
| #define HALF_RATE_AUDIO 1
| #define XF86VIDMODE_EXT 1
| #define NDEBUG 1
| /* end confdefs.h. */
| /* Define WaitForSingleObject to an innocuous variant, in case <limits.h> declares WaitForSingleObject.
| For example, HP-UX 11i <limits.h> declares gettimeofday. */
| #define WaitForSingleObject innocuous_WaitForSingleObject
|
| /* System header to define __stub macros and hopefully few prototypes,
| which can conflict with char WaitForSingleObject (); below.
| Prefer <limits.h> to <assert.h> if __STDC__ is defined, since
| <limits.h> exists even on freestanding compilers. */
|
| #ifdef __STDC__
| # include <limits.h>
| #else
| # include <assert.h>
| #endif
|
| #undef WaitForSingleObject
|
| /* Override any gcc2 internal prototype to avoid an error. */
| #ifdef __cplusplus
| extern "C"
| {
| #endif
| /* We use char because int might match the return type of a gcc2
| builtin and then its argument prototype would still apply. */
| char WaitForSingleObject ();
| /* The GNU C library defines this for functions which it implements
| to always fail with ENOSYS. Some functions are actually named
| something starting with __ and the normal name is an alias. */
| #if defined (__stub_WaitForSingleObject) || defined (__stub___WaitForSingleObject)
| choke me
| #else
| char (*f) () = WaitForSingleObject;
| #endif
| #ifdef __cplusplus
| }
| #endif
|
| int
| main ()
| {
| return f != WaitForSingleObject;
| ;
| return 0;
| }
configure:25654: result: no
configure:25567: checking for _stricmp
configure:25624: g++ -o conftest -ffast-math -fno-exceptions -fsigned-char -Wall -W -Wshadow -mtune=i686 conftest.cc -lm -L/usr/lib -lcurl -L/usr/lib -lgssapi_krb5 -lkrb5 -lk5crypto -lkrb5support -lcom_err -lresolv -lidn -lssl -lcrypto -ldl -lssl -lcrypto -lz >&5
./configure: line 25625: g++: command not found
configure:25630: $? = 127
configure: failed program was:
| /* confdefs.h. */
|
| #define PACKAGE_NAME ""
| #define PACKAGE_TARNAME ""
| #define PACKAGE_VERSION ""
| #define PACKAGE_STRING ""
| #define PACKAGE_BUGREPORT ""
| #define PACKAGE "bzflag"
| #define VERSION "2.0.9"
| #define BZ_BUILD_OS "linux-gnu"
| #define BZ_BUILD_USER "mofo"
| #define BUILD_REGEX 1
| #ifdef __cplusplus
| void exit (int);
| #endif
| #define STDC_HEADERS 1
| #define HAVE_SYS_TYPES_H 1
| #define HAVE_SYS_STAT_H 1
| #define HAVE_STDLIB_H 1
| #define HAVE_STRING_H 1
| #define HAVE_MEMORY_H 1
| #define HAVE_STRINGS_H 1
| #define HAVE_INTTYPES_H 1
| #define HAVE_STDINT_H 1
| #define HAVE_UNISTD_H 1
| #define HAVE_DLFCN_H 1
| #define STDC_HEADERS 1
| #define HAVE_GL_GLX_H 1
| #define HAVE_SDL_SDL_H 1
| #define HAVE_X11_XLIB_H 1
| #define HAVE_LINUX_INPUT_H 1
| #define HAVE_STDINT_H 1
| #define HAVE_SYS_PARAM_H 1
| #define HAVE_UNISTD_H 1
| #define HAVE_VALUES_H 1
| #define HAVE_SOCKLEN_T 1
| #define HAVE_FF_EFFECT_RUMBLE 1
| #define HAVE_FF_EFFECT_DIRECTIONAL 1
| #define HAVE_LIBM 1
| #define HAVE_ACOSF 1
| #define HAVE_ASINF 1
| #define HAVE_ATAN2F 1
| #define HAVE_ATANF 1
| #define HAVE_COSF 1
| #define HAVE_EXPF 1
| #define HAVE_FABSF 1
| #define HAVE_FLOORF 1
| #define HAVE_FMODF 1
| #define HAVE_HYPOTF 1
| #define HAVE_LOGF 1
| #define HAVE_LOG10F 1
| #define HAVE_POWF 1
| #define HAVE_SINF 1
| #define HAVE_SQRTF 1
| #define HAVE_TANF 1
| #define HAVE_SDL 1
| #define ROBOT 1
| #define SNAPPING 1
| #define INSTALL_DATA_DIR "/usr/local/share/bzflag"
| #define HALF_RATE_AUDIO 1
| #define XF86VIDMODE_EXT 1
| #define NDEBUG 1
| /* end confdefs.h. */
| /* Define _stricmp to an innocuous variant, in case <limits.h> declares _stricmp.
| For example, HP-UX 11i <limits.h> declares gettimeofday. */
| #define _stricmp innocuous__stricmp
|
| /* System header to define __stub macros and hopefully few prototypes,
| which can conflict with char _stricmp (); below.
| Prefer <limits.h> to <assert.h> if __STDC__ is defined, since
| <limits.h> exists even on freestanding compilers. */
|
| #ifdef __STDC__
| # include <limits.h>
| #else
| # include <assert.h>
| #endif
|
| #undef _stricmp
|
| /* Override any gcc2 internal prototype to avoid an error. */
| #ifdef __cplusplus
| extern "C"
| {
| #endif
| /* We use char because int might match the return type of a gcc2
| builtin and then its argument prototype would still apply. */
| char _stricmp ();
| /* The GNU C library defines this for functions which it implements
| to always fail with ENOSYS. Some functions are actually named
| something starting with __ and the normal name is an alias. */
| #if defined (__stub__stricmp) || defined (__stub____stricmp)
| choke me
| #else
| char (*f) () = _stricmp;
| #endif
| #ifdef __cplusplus
| }
| #endif
|
| int
| main ()
| {
| return f != _stricmp;
| ;
| return 0;
| }
configure:25654: result: no
configure:25567: checking for _strnicmp
configure:25624: g++ -o conftest -ffast-math -fno-exceptions -fsigned-char -Wall -W -Wshadow -mtune=i686 conftest.cc -lm -L/usr/lib -lcurl -L/usr/lib -lgssapi_krb5 -lkrb5 -lk5crypto -lkrb5support -lcom_err -lresolv -lidn -lssl -lcrypto -ldl -lssl -lcrypto -lz >&5
./configure: line 25625: g++: command not found
configure:25630: $? = 127
configure: failed program was:
| /* confdefs.h. */
|
| #define PACKAGE_NAME ""
| #define PACKAGE_TARNAME ""
| #define PACKAGE_VERSION ""
| #define PACKAGE_STRING ""
| #define PACKAGE_BUGREPORT ""
| #define PACKAGE "bzflag"
| #define VERSION "2.0.9"
| #define BZ_BUILD_OS "linux-gnu"
| #define BZ_BUILD_USER "mofo"
| #define BUILD_REGEX 1
| #ifdef __cplusplus
| void exit (int);
| #endif
| #define STDC_HEADERS 1
| #define HAVE_SYS_TYPES_H 1
| #define HAVE_SYS_STAT_H 1
| #define HAVE_STDLIB_H 1
| #define HAVE_STRING_H 1
| #define HAVE_MEMORY_H 1
| #define HAVE_STRINGS_H 1
| #define HAVE_INTTYPES_H 1
| #define HAVE_STDINT_H 1
| #define HAVE_UNISTD_H 1
| #define HAVE_DLFCN_H 1
| #define STDC_HEADERS 1
| #define HAVE_GL_GLX_H 1
| #define HAVE_SDL_SDL_H 1
| #define HAVE_X11_XLIB_H 1
| #define HAVE_LINUX_INPUT_H 1
| #define HAVE_STDINT_H 1
| #define HAVE_SYS_PARAM_H 1
| #define HAVE_UNISTD_H 1
| #define HAVE_VALUES_H 1
| #define HAVE_SOCKLEN_T 1
| #define HAVE_FF_EFFECT_RUMBLE 1
| #define HAVE_FF_EFFECT_DIRECTIONAL 1
| #define HAVE_LIBM 1
| #define HAVE_ACOSF 1
| #define HAVE_ASINF 1
| #define HAVE_ATAN2F 1
| #define HAVE_ATANF 1
| #define HAVE_COSF 1
| #define HAVE_EXPF 1
| #define HAVE_FABSF 1
| #define HAVE_FLOORF 1
| #define HAVE_FMODF 1
| #define HAVE_HYPOTF 1
| #define HAVE_LOGF 1
| #define HAVE_LOG10F 1
| #define HAVE_POWF 1
| #define HAVE_SINF 1
| #define HAVE_SQRTF 1
| #define HAVE_TANF 1
| #define HAVE_SDL 1
| #define ROBOT 1
| #define SNAPPING 1
| #define INSTALL_DATA_DIR "/usr/local/share/bzflag"
| #define HALF_RATE_AUDIO 1
| #define XF86VIDMODE_EXT 1
| #define NDEBUG 1
| /* end confdefs.h. */
| /* Define _strnicmp to an innocuous variant, in case <limits.h> declares _strnicmp.
| For example, HP-UX 11i <limits.h> declares gettimeofday. */
| #define _strnicmp innocuous__strnicmp
|
| /* System header to define __stub macros and hopefully few prototypes,
| which can conflict with char _strnicmp (); below.
| Prefer <limits.h> to <assert.h> if __STDC__ is defined, since
| <limits.h> exists even on freestanding compilers. */
|
| #ifdef __STDC__
| # include <limits.h>
| #else
| # include <assert.h>
| #endif
|
| #undef _strnicmp
|
| /* Override any gcc2 internal prototype to avoid an error. */
| #ifdef __cplusplus
| extern "C"
| {
| #endif
| /* We use char because int might match the return type of a gcc2
| builtin and then its argument prototype would still apply. */
| char _strnicmp ();
| /* The GNU C library defines this for functions which it implements
| to always fail with ENOSYS. Some functions are actually named
| something starting with __ and the normal name is an alias. */
| #if defined (__stub__strnicmp) || defined (__stub____strnicmp)
| choke me
| #else
| char (*f) () = _strnicmp;
| #endif
| #ifdef __cplusplus
| }
| #endif
|
| int
| main ()
| {
| return f != _strnicmp;
| ;
| return 0;
| }
configure:25654: result: no
configure:25567: checking for _vsnprintf
configure:25624: g++ -o conftest -ffast-math -fno-exceptions -fsigned-char -Wall -W -Wshadow -mtune=i686 conftest.cc -lm -L/usr/lib -lcurl -L/usr/lib -lgssapi_krb5 -lkrb5 -lk5crypto -lkrb5support -lcom_err -lresolv -lidn -lssl -lcrypto -ldl -lssl -lcrypto -lz >&5
./configure: line 25625: g++: command not found
configure:25630: $? = 127
configure: failed program was:
| /* confdefs.h. */
|
| #define PACKAGE_NAME ""
| #define PACKAGE_TARNAME ""
| #define PACKAGE_VERSION ""
| #define PACKAGE_STRING ""
| #define PACKAGE_BUGREPORT ""
| #define PACKAGE "bzflag"
| #define VERSION "2.0.9"
| #define BZ_BUILD_OS "linux-gnu"
| #define BZ_BUILD_USER "mofo"
| #define BUILD_REGEX 1
| #ifdef __cplusplus
| void exit (int);
| #endif
| #define STDC_HEADERS 1
| #define HAVE_SYS_TYPES_H 1
| #define HAVE_SYS_STAT_H 1
| #define HAVE_STDLIB_H 1
| #define HAVE_STRING_H 1
| #define HAVE_MEMORY_H 1
| #define HAVE_STRINGS_H 1
| #define HAVE_INTTYPES_H 1
| #define HAVE_STDINT_H 1
| #define HAVE_UNISTD_H 1
| #define HAVE_DLFCN_H 1
| #define STDC_HEADERS 1
| #define HAVE_GL_GLX_H 1
| #define HAVE_SDL_SDL_H 1
| #define HAVE_X11_XLIB_H 1
| #define HAVE_LINUX_INPUT_H 1
| #define HAVE_STDINT_H 1
| #define HAVE_SYS_PARAM_H 1
| #define HAVE_UNISTD_H 1
| #define HAVE_VALUES_H 1
| #define HAVE_SOCKLEN_T 1
| #define HAVE_FF_EFFECT_RUMBLE 1
| #define HAVE_FF_EFFECT_DIRECTIONAL 1
| #define HAVE_LIBM 1
| #define HAVE_ACOSF 1
| #define HAVE_ASINF 1
| #define HAVE_ATAN2F 1
| #define HAVE_ATANF 1
| #define HAVE_COSF 1
| #define HAVE_EXPF 1
| #define HAVE_FABSF 1
| #define HAVE_FLOORF 1
| #define HAVE_FMODF 1
| #define HAVE_HYPOTF 1
| #define HAVE_LOGF 1
| #define HAVE_LOG10F 1
| #define HAVE_POWF 1
| #define HAVE_SINF 1
| #define HAVE_SQRTF 1
| #define HAVE_TANF 1
| #define HAVE_SDL 1
| #define ROBOT 1
| #define SNAPPING 1
| #define INSTALL_DATA_DIR "/usr/local/share/bzflag"
| #define HALF_RATE_AUDIO 1
| #define XF86VIDMODE_EXT 1
| #define NDEBUG 1
| /* end confdefs.h. */
| /* Define _vsnprintf to an innocuous variant, in case <limits.h> declares _vsnprintf.
| For example, HP-UX 11i <limits.h> declares gettimeofday. */
| #define _vsnprintf innocuous__vsnprintf
|
| /* System header to define __stub macros and hopefully few prototypes,
| which can conflict with char _vsnprintf (); below.
| Prefer <limits.h> to <assert.h> if __STDC__ is defined, since
| <limits.h> exists even on freestanding compilers. */
|
| #ifdef __STDC__
| # include <limits.h>
| #else
| # include <assert.h>
| #endif
|
| #undef _vsnprintf
|
| /* Override any gcc2 internal prototype to avoid an error. */
| #ifdef __cplusplus
| extern "C"
| {
| #endif
| /* We use char because int might match the return type of a gcc2
| builtin and then its argument prototype would still apply. */
| char _vsnprintf ();
| /* The GNU C library defines this for functions which it implements
| to always fail with ENOSYS. Some functions are actually named
| something starting with __ and the normal name is an alias. */
| #if defined (__stub__vsnprintf) || defined (__stub____vsnprintf)
| choke me
| #else
| char (*f) () = _vsnprintf;
| #endif
| #ifdef __cplusplus
| }
| #endif
|
| int
| main ()
| {
| return f != _vsnprintf;
| ;
| return 0;
| }
configure:25654: result: no
configure:25567: checking for atexit
configure:25624: g++ -o conftest -ffast-math -fno-exceptions -fsigned-char -Wall -W -Wshadow -mtune=i686 conftest.cc -lm -L/usr/lib -lcurl -L/usr/lib -lgssapi_krb5 -lkrb5 -lk5crypto -lkrb5support -lcom_err -lresolv -lidn -lssl -lcrypto -ldl -lssl -lcrypto -lz >&5
./configure: line 25625: g++: command not found
configure:25630: $? = 127
configure: failed program was:
| /* confdefs.h. */
|
| #define PACKAGE_NAME ""
| #define PACKAGE_TARNAME ""
| #define PACKAGE_VERSION ""
| #define PACKAGE_STRING ""
| #define PACKAGE_BUGREPORT ""
| #define PACKAGE "bzflag"
| #define VERSION "2.0.9"
| #define BZ_BUILD_OS "linux-gnu"
| #define BZ_BUILD_USER "mofo"
| #define BUILD_REGEX 1
| #ifdef __cplusplus
| void exit (int);
| #endif
| #define STDC_HEADERS 1
| #define HAVE_SYS_TYPES_H 1
| #define HAVE_SYS_STAT_H 1
| #define HAVE_STDLIB_H 1
| #define HAVE_STRING_H 1
| #define HAVE_MEMORY_H 1
| #define HAVE_STRINGS_H 1
| #define HAVE_INTTYPES_H 1
| #define HAVE_STDINT_H 1
| #define HAVE_UNISTD_H 1
| #define HAVE_DLFCN_H 1
| #define STDC_HEADERS 1
| #define HAVE_GL_GLX_H 1
| #define HAVE_SDL_SDL_H 1
| #define HAVE_X11_XLIB_H 1
| #define HAVE_LINUX_INPUT_H 1
| #define HAVE_STDINT_H 1
| #define HAVE_SYS_PARAM_H 1
| #define HAVE_UNISTD_H 1
| #define HAVE_VALUES_H 1
| #define HAVE_SOCKLEN_T 1
| #define HAVE_FF_EFFECT_RUMBLE 1
| #define HAVE_FF_EFFECT_DIRECTIONAL 1
| #define HAVE_LIBM 1
| #define HAVE_ACOSF 1
| #define HAVE_ASINF 1
| #define HAVE_ATAN2F 1
| #define HAVE_ATANF 1
| #define HAVE_COSF 1
| #define HAVE_EXPF 1
| #define HAVE_FABSF 1
| #define HAVE_FLOORF 1
| #define HAVE_FMODF 1
| #define HAVE_HYPOTF 1
| #define HAVE_LOGF 1
| #define HAVE_LOG10F 1
| #define HAVE_POWF 1
| #define HAVE_SINF 1
| #define HAVE_SQRTF 1
| #define HAVE_TANF 1
| #define HAVE_SDL 1
| #define ROBOT 1
| #define SNAPPING 1
| #define INSTALL_DATA_DIR "/usr/local/share/bzflag"
| #define HALF_RATE_AUDIO 1
| #define XF86VIDMODE_EXT 1
| #define NDEBUG 1
| /* end confdefs.h. */
| /* Define atexit to an innocuous variant, in case <limits.h> declares atexit.
| For example, HP-UX 11i <limits.h> declares gettimeofday. */
| #define atexit innocuous_atexit
|
| /* System header to define __stub macros and hopefully few prototypes,
| which can conflict with char atexit (); below.
| Prefer <limits.h> to <assert.h> if __STDC__ is defined, since
| <limits.h> exists even on freestanding compilers. */
|
| #ifdef __STDC__
| # include <limits.h>
| #else
| # include <assert.h>
| #endif
|
| #undef atexit
|
| /* Override any gcc2 internal prototype to avoid an error. */
| #ifdef __cplusplus
| extern "C"
| {
| #endif
| /* We use char because int might match the return type of a gcc2
| builtin and then its argument prototype would still apply. */
| char atexit ();
| /* The GNU C library defines this for functions which it implements
| to always fail with ENOSYS. Some functions are actually named
| something starting with __ and the normal name is an alias. */
| #if defined (__stub_atexit) || defined (__stub___atexit)
| choke me
| #else
| char (*f) () = atexit;
| #endif
| #ifdef __cplusplus
| }
| #endif
|
| int
| main ()
| {
| return f != atexit;
| ;
| return 0;
| }
configure:25654: result: no
configure:25567: checking for getrlimit
configure:25624: g++ -o conftest -ffast-math -fno-exceptions -fsigned-char -Wall -W -Wshadow -mtune=i686 conftest.cc -lm -L/usr/lib -lcurl -L/usr/lib -lgssapi_krb5 -lkrb5 -lk5crypto -lkrb5support -lcom_err -lresolv -lidn -lssl -lcrypto -ldl -lssl -lcrypto -lz >&5
./configure: line 25625: g++: command not found
configure:25630: $? = 127
configure: failed program was:
| /* confdefs.h. */
|
| #define PACKAGE_NAME ""
| #define PACKAGE_TARNAME ""
| #define PACKAGE_VERSION ""
| #define PACKAGE_STRING ""
| #define PACKAGE_BUGREPORT ""
| #define PACKAGE "bzflag"
| #define VERSION "2.0.9"
| #define BZ_BUILD_OS "linux-gnu"
| #define BZ_BUILD_USER "mofo"
| #define BUILD_REGEX 1
| #ifdef __cplusplus
| void exit (int);
| #endif
| #define STDC_HEADERS 1
| #define HAVE_SYS_TYPES_H 1
| #define HAVE_SYS_STAT_H 1
| #define HAVE_STDLIB_H 1
| #define HAVE_STRING_H 1
| #define HAVE_MEMORY_H 1
| #define HAVE_STRINGS_H 1
| #define HAVE_INTTYPES_H 1
| #define HAVE_STDINT_H 1
| #define HAVE_UNISTD_H 1
| #define HAVE_DLFCN_H 1
| #define STDC_HEADERS 1
| #define HAVE_GL_GLX_H 1
| #define HAVE_SDL_SDL_H 1
| #define HAVE_X11_XLIB_H 1
| #define HAVE_LINUX_INPUT_H 1
| #define HAVE_STDINT_H 1
| #define HAVE_SYS_PARAM_H 1
| #define HAVE_UNISTD_H 1
| #define HAVE_VALUES_H 1
| #define HAVE_SOCKLEN_T 1
| #define HAVE_FF_EFFECT_RUMBLE 1
| #define HAVE_FF_EFFECT_DIRECTIONAL 1
| #define HAVE_LIBM 1
| #define HAVE_ACOSF 1
| #define HAVE_ASINF 1
| #define HAVE_ATAN2F 1
| #define HAVE_ATANF 1
| #define HAVE_COSF 1
| #define HAVE_EXPF 1
| #define HAVE_FABSF 1
| #define HAVE_FLOORF 1
| #define HAVE_FMODF 1
| #define HAVE_HYPOTF 1
| #define HAVE_LOGF 1
| #define HAVE_LOG10F 1
| #define HAVE_POWF 1
| #define HAVE_SINF 1
| #define HAVE_SQRTF 1
| #define HAVE_TANF 1
| #define HAVE_SDL 1
| #define ROBOT 1
| #define SNAPPING 1
| #define INSTALL_DATA_DIR "/usr/local/share/bzflag"
| #define HALF_RATE_AUDIO 1
| #define XF86VIDMODE_EXT 1
| #define NDEBUG 1
| /* end confdefs.h. */
| /* Define getrlimit to an innocuous variant, in case <limits.h> declares getrlimit.
| For example, HP-UX 11i <limits.h> declares gettimeofday. */
| #define getrlimit innocuous_getrlimit
|
| /* System header to define __stub macros and hopefully few prototypes,
| which can conflict with char getrlimit (); below.
| Prefer <limits.h> to <assert.h> if __STDC__ is defined, since
| <limits.h> exists even on freestanding compilers. */
|
| #ifdef __STDC__
| # include <limits.h>
| #else
| # include <assert.h>
| #endif
|
| #undef getrlimit
|
| /* Override any gcc2 internal prototype to avoid an error. */
| #ifdef __cplusplus
| extern "C"
| {
| #endif
| /* We use char because int might match the return type of a gcc2
| builtin and then its argument prototype would still apply. */
| char getrlimit ();
| /* The GNU C library defines this for functions which it implements
| to always fail with ENOSYS. Some functions are actually named
| something starting with __ and the normal name is an alias. */
| #if defined (__stub_getrlimit) || defined (__stub___getrlimit)
| choke me
| #else
| char (*f) () = getrlimit;
| #endif
| #ifdef __cplusplus
| }
| #endif
|
| int
| main ()
| {
| return f != getrlimit;
| ;
| return 0;
| }
configure:25654: result: no
configure:25567: checking for glXGetCurrentContext
configure:25624: g++ -o conftest -ffast-math -fno-exceptions -fsigned-char -Wall -W -Wshadow -mtune=i686 conftest.cc -lm -L/usr/lib -lcurl -L/usr/lib -lgssapi_krb5 -lkrb5 -lk5crypto -lkrb5support -lcom_err -lresolv -lidn -lssl -lcrypto -ldl -lssl -lcrypto -lz >&5
./configure: line 25625: g++: command not found
configure:25630: $? = 127
configure: failed program was:
| /* confdefs.h. */
|
| #define PACKAGE_NAME ""
| #define PACKAGE_TARNAME ""
| #define PACKAGE_VERSION ""
| #define PACKAGE_STRING ""
| #define PACKAGE_BUGREPORT ""
| #define PACKAGE "bzflag"
| #define VERSION "2.0.9"
| #define BZ_BUILD_OS "linux-gnu"
| #define BZ_BUILD_USER "mofo"
| #define BUILD_REGEX 1
| #ifdef __cplusplus
| void exit (int);
| #endif
| #define STDC_HEADERS 1
| #define HAVE_SYS_TYPES_H 1
| #define HAVE_SYS_STAT_H 1
| #define HAVE_STDLIB_H 1
| #define HAVE_STRING_H 1
| #define HAVE_MEMORY_H 1
| #define HAVE_STRINGS_H 1
| #define HAVE_INTTYPES_H 1
| #define HAVE_STDINT_H 1
| #define HAVE_UNISTD_H 1
| #define HAVE_DLFCN_H 1
| #define STDC_HEADERS 1
| #define HAVE_GL_GLX_H 1
| #define HAVE_SDL_SDL_H 1
| #define HAVE_X11_XLIB_H 1
| #define HAVE_LINUX_INPUT_H 1
| #define HAVE_STDINT_H 1
| #define HAVE_SYS_PARAM_H 1
| #define HAVE_UNISTD_H 1
| #define HAVE_VALUES_H 1
| #define HAVE_SOCKLEN_T 1
| #define HAVE_FF_EFFECT_RUMBLE 1
| #define HAVE_FF_EFFECT_DIRECTIONAL 1
| #define HAVE_LIBM 1
| #define HAVE_ACOSF 1
| #define HAVE_ASINF 1
| #define HAVE_ATAN2F 1
| #define HAVE_ATANF 1
| #define HAVE_COSF 1
| #define HAVE_EXPF 1
| #define HAVE_FABSF 1
| #define HAVE_FLOORF 1
| #define HAVE_FMODF 1
| #define HAVE_HYPOTF 1
| #define HAVE_LOGF 1
| #define HAVE_LOG10F 1
| #define HAVE_POWF 1
| #define HAVE_SINF 1
| #define HAVE_SQRTF 1
| #define HAVE_TANF 1
| #define HAVE_SDL 1
| #define ROBOT 1
| #define SNAPPING 1
| #define INSTALL_DATA_DIR "/usr/local/share/bzflag"
| #define HALF_RATE_AUDIO 1
| #define XF86VIDMODE_EXT 1
| #define NDEBUG 1
| /* end confdefs.h. */
| /* Define glXGetCurrentContext to an innocuous variant, in case <limits.h> declares glXGetCurrentContext.
| For example, HP-UX 11i <limits.h> declares gettimeofday. */
| #define glXGetCurrentContext innocuous_glXGetCurrentContext
|
| /* System header to define __stub macros and hopefully few prototypes,
| which can conflict with char glXGetCurrentContext (); below.
| Prefer <limits.h> to <assert.h> if __STDC__ is defined, since
| <limits.h> exists even on freestanding compilers. */
|
| #ifdef __STDC__
| # include <limits.h>
| #else
| # include <assert.h>
| #endif
|
| #undef glXGetCurrentContext
|
| /* Override any gcc2 internal prototype to avoid an error. */
| #ifdef __cplusplus
| extern "C"
| {
| #endif
| /* We use char because int might match the return type of a gcc2
| builtin and then its argument prototype would still apply. */
| char glXGetCurrentContext ();
| /* The GNU C library defines this for functions which it implements
| to always fail with ENOSYS. Some functions are actually named
| something starting with __ and the normal name is an alias. */
| #if defined (__stub_glXGetCurrentContext) || defined (__stub___glXGetCurrentContext)
| choke me
| #else
| char (*f) () = glXGetCurrentContext;
| #endif
| #ifdef __cplusplus
| }
| #endif
|
| int
| main ()
| {
| return f != glXGetCurrentContext;
| ;
| return 0;
| }
configure:25654: result: no
configure:25567: checking for select
configure:25624: g++ -o conftest -ffast-math -fno-exceptions -fsigned-char -Wall -W -Wshadow -mtune=i686 conftest.cc -lm -L/usr/lib -lcurl -L/usr/lib -lgssapi_krb5 -lkrb5 -lk5crypto -lkrb5support -lcom_err -lresolv -lidn -lssl -lcrypto -ldl -lssl -lcrypto -lz >&5
./configure: line 25625: g++: command not found
configure:25630: $? = 127
configure: failed program was:
| /* confdefs.h. */
|
| #define PACKAGE_NAME ""
| #define PACKAGE_TARNAME ""
| #define PACKAGE_VERSION ""
| #define PACKAGE_STRING ""
| #define PACKAGE_BUGREPORT ""
| #define PACKAGE "bzflag"
| #define VERSION "2.0.9"
| #define BZ_BUILD_OS "linux-gnu"
| #define BZ_BUILD_USER "mofo"
| #define BUILD_REGEX 1
| #ifdef __cplusplus
| void exit (int);
| #endif
| #define STDC_HEADERS 1
| #define HAVE_SYS_TYPES_H 1
| #define HAVE_SYS_STAT_H 1
| #define HAVE_STDLIB_H 1
| #define HAVE_STRING_H 1
| #define HAVE_MEMORY_H 1
| #define HAVE_STRINGS_H 1
| #define HAVE_INTTYPES_H 1
| #define HAVE_STDINT_H 1
| #define HAVE_UNISTD_H 1
| #define HAVE_DLFCN_H 1
| #define STDC_HEADERS 1
| #define HAVE_GL_GLX_H 1
| #define HAVE_SDL_SDL_H 1
| #define HAVE_X11_XLIB_H 1
| #define HAVE_LINUX_INPUT_H 1
| #define HAVE_STDINT_H 1
| #define HAVE_SYS_PARAM_H 1
| #define HAVE_UNISTD_H 1
| #define HAVE_VALUES_H 1
| #define HAVE_SOCKLEN_T 1
| #define HAVE_FF_EFFECT_RUMBLE 1
| #define HAVE_FF_EFFECT_DIRECTIONAL 1
| #define HAVE_LIBM 1
| #define HAVE_ACOSF 1
| #define HAVE_ASINF 1
| #define HAVE_ATAN2F 1
| #define HAVE_ATANF 1
| #define HAVE_COSF 1
| #define HAVE_EXPF 1
| #define HAVE_FABSF 1
| #define HAVE_FLOORF 1
| #define HAVE_FMODF 1
| #define HAVE_HYPOTF 1
| #define HAVE_LOGF 1
| #define HAVE_LOG10F 1
| #define HAVE_POWF 1
| #define HAVE_SINF 1
| #define HAVE_SQRTF 1
| #define HAVE_TANF 1
| #define HAVE_SDL 1
| #define ROBOT 1
| #define SNAPPING 1
| #define INSTALL_DATA_DIR "/usr/local/share/bzflag"
| #define HALF_RATE_AUDIO 1
| #define XF86VIDMODE_EXT 1
| #define NDEBUG 1
| /* end confdefs.h. */
| /* Define select to an innocuous variant, in case <limits.h> declares select.
| For example, HP-UX 11i <limits.h> declares gettimeofday. */
| #define select innocuous_select
|
| /* System header to define __stub macros and hopefully few prototypes,
| which can conflict with char select (); below.
| Prefer <limits.h> to <assert.h> if __STDC__ is defined, since
| <limits.h> exists even on freestanding compilers. */
|
| #ifdef __STDC__
| # include <limits.h>
| #else
| # include <assert.h>
| #endif
|
| #undef select
|
| /* Override any gcc2 internal prototype to avoid an error. */
| #ifdef __cplusplus
| extern "C"
| {
| #endif
| /* We use char because int might match the return type of a gcc2
| builtin and then its argument prototype would still apply. */
| char select ();
| /* The GNU C library defines this for functions which it implements
| to always fail with ENOSYS. Some functions are actually named
| something starting with __ and the normal name is an alias. */
| #if defined (__stub_select) || defined (__stub___select)
| choke me
| #else
| char (*f) () = select;
| #endif
| #ifdef __cplusplus
| }
| #endif
|
| int
| main ()
| {
| return f != select;
| ;
| return 0;
| }
configure:25654: result: no
configure:25567: checking for snooze
configure:25624: g++ -o conftest -ffast-math -fno-exceptions -fsigned-char -Wall -W -Wshadow -mtune=i686 conftest.cc -lm -L/usr/lib -lcurl -L/usr/lib -lgssapi_krb5 -lkrb5 -lk5crypto -lkrb5support -lcom_err -lresolv -lidn -lssl -lcrypto -ldl -lssl -lcrypto -lz >&5
./configure: line 25625: g++: command not found
configure:25630: $? = 127
configure: failed program was:
| /* confdefs.h. */
|
| #define PACKAGE_NAME ""
| #define PACKAGE_TARNAME ""
| #define PACKAGE_VERSION ""
| #define PACKAGE_STRING ""
| #define PACKAGE_BUGREPORT ""
| #define PACKAGE "bzflag"
| #define VERSION "2.0.9"
| #define BZ_BUILD_OS "linux-gnu"
| #define BZ_BUILD_USER "mofo"
| #define BUILD_REGEX 1
| #ifdef __cplusplus
| void exit (int);
| #endif
| #define STDC_HEADERS 1
| #define HAVE_SYS_TYPES_H 1
| #define HAVE_SYS_STAT_H 1
| #define HAVE_STDLIB_H 1
| #define HAVE_STRING_H 1
| #define HAVE_MEMORY_H 1
| #define HAVE_STRINGS_H 1
| #define HAVE_INTTYPES_H 1
| #define HAVE_STDINT_H 1
| #define HAVE_UNISTD_H 1
| #define HAVE_DLFCN_H 1
| #define STDC_HEADERS 1
| #define HAVE_GL_GLX_H 1
| #define HAVE_SDL_SDL_H 1
| #define HAVE_X11_XLIB_H 1
| #define HAVE_LINUX_INPUT_H 1
| #define HAVE_STDINT_H 1
| #define HAVE_SYS_PARAM_H 1
| #define HAVE_UNISTD_H 1
| #define HAVE_VALUES_H 1
| #define HAVE_SOCKLEN_T 1
| #define HAVE_FF_EFFECT_RUMBLE 1
| #define HAVE_FF_EFFECT_DIRECTIONAL 1
| #define HAVE_LIBM 1
| #define HAVE_ACOSF 1
| #define HAVE_ASINF 1
| #define HAVE_ATAN2F 1
| #define HAVE_ATANF 1
| #define HAVE_COSF 1
| #define HAVE_EXPF 1
| #define HAVE_FABSF 1
| #define HAVE_FLOORF 1
| #define HAVE_FMODF 1
| #define HAVE_HYPOTF 1
| #define HAVE_LOGF 1
| #define HAVE_LOG10F 1
| #define HAVE_POWF 1
| #define HAVE_SINF 1
| #define HAVE_SQRTF 1
| #define HAVE_TANF 1
| #define HAVE_SDL 1
| #define ROBOT 1
| #define SNAPPING 1
| #define INSTALL_DATA_DIR "/usr/local/share/bzflag"
| #define HALF_RATE_AUDIO 1
| #define XF86VIDMODE_EXT 1
| #define NDEBUG 1
| /* end confdefs.h. */
| /* Define snooze to an innocuous variant, in case <limits.h> declares snooze.
| For example, HP-UX 11i <limits.h> declares gettimeofday. */
| #define snooze innocuous_snooze
|
| /* System header to define __stub macros and hopefully few prototypes,
| which can conflict with char snooze (); below.
| Prefer <limits.h> to <assert.h> if __STDC__ is defined, since
| <limits.h> exists even on freestanding compilers. */
|
| #ifdef __STDC__
| # include <limits.h>
| #else
| # include <assert.h>
| #endif
|
| #undef snooze
|
| /* Override any gcc2 internal prototype to avoid an error. */
| #ifdef __cplusplus
| extern "C"
| {
| #endif
| /* We use char because int might match the return type of a gcc2
| builtin and then its argument prototype would still apply. */
| char snooze ();
| /* The GNU C library defines this for functions which it implements
| to always fail with ENOSYS. Some functions are actually named
| something starting with __ and the normal name is an alias. */
| #if defined (__stub_snooze) || defined (__stub___snooze)
| choke me
| #else
| char (*f) () = snooze;
| #endif
| #ifdef __cplusplus
| }
| #endif
|
| int
| main ()
| {
| return f != snooze;
| ;
| return 0;
| }
configure:25654: result: no
configure:25567: checking for usleep
configure:25624: g++ -o conftest -ffast-math -fno-exceptions -fsigned-char -Wall -W -Wshadow -mtune=i686 conftest.cc -lm -L/usr/lib -lcurl -L/usr/lib -lgssapi_krb5 -lkrb5 -lk5crypto -lkrb5support -lcom_err -lresolv -lidn -lssl -lcrypto -ldl -lssl -lcrypto -lz >&5
./configure: line 25625: g++: command not found
configure:25630: $? = 127
configure: failed program was:
| /* confdefs.h. */
|
| #define PACKAGE_NAME ""
| #define PACKAGE_TARNAME ""
| #define PACKAGE_VERSION ""
| #define PACKAGE_STRING ""
| #define PACKAGE_BUGREPORT ""
| #define PACKAGE "bzflag"
| #define VERSION "2.0.9"
| #define BZ_BUILD_OS "linux-gnu"
| #define BZ_BUILD_USER "mofo"
| #define BUILD_REGEX 1
| #ifdef __cplusplus
| void exit (int);
| #endif
| #define STDC_HEADERS 1
| #define HAVE_SYS_TYPES_H 1
| #define HAVE_SYS_STAT_H 1
| #define HAVE_STDLIB_H 1
| #define HAVE_STRING_H 1
| #define HAVE_MEMORY_H 1
| #define HAVE_STRINGS_H 1
| #define HAVE_INTTYPES_H 1
| #define HAVE_STDINT_H 1
| #define HAVE_UNISTD_H 1
| #define HAVE_DLFCN_H 1
| #define STDC_HEADERS 1
| #define HAVE_GL_GLX_H 1
| #define HAVE_SDL_SDL_H 1
| #define HAVE_X11_XLIB_H 1
| #define HAVE_LINUX_INPUT_H 1
| #define HAVE_STDINT_H 1
| #define HAVE_SYS_PARAM_H 1
| #define HAVE_UNISTD_H 1
| #define HAVE_VALUES_H 1
| #define HAVE_SOCKLEN_T 1
| #define HAVE_FF_EFFECT_RUMBLE 1
| #define HAVE_FF_EFFECT_DIRECTIONAL 1
| #define HAVE_LIBM 1
| #define HAVE_ACOSF 1
| #define HAVE_ASINF 1
| #define HAVE_ATAN2F 1
| #define HAVE_ATANF 1
| #define HAVE_COSF 1
| #define HAVE_EXPF 1
| #define HAVE_FABSF 1
| #define HAVE_FLOORF 1
| #define HAVE_FMODF 1
| #define HAVE_HYPOTF 1
| #define HAVE_LOGF 1
| #define HAVE_LOG10F 1
| #define HAVE_POWF 1
| #define HAVE_SINF 1
| #define HAVE_SQRTF 1
| #define HAVE_TANF 1
| #define HAVE_SDL 1
| #define ROBOT 1
| #define SNAPPING 1
| #define INSTALL_DATA_DIR "/usr/local/share/bzflag"
| #define HALF_RATE_AUDIO 1
| #define XF86VIDMODE_EXT 1
| #define NDEBUG 1
| /* end confdefs.h. */
| /* Define usleep to an innocuous variant, in case <limits.h> declares usleep.
| For example, HP-UX 11i <limits.h> declares gettimeofday. */
| #define usleep innocuous_usleep
|
| /* System header to define __stub macros and hopefully few prototypes,
| which can conflict with char usleep (); below.
| Prefer <limits.h> to <assert.h> if __STDC__ is defined, since
| <limits.h> exists even on freestanding compilers. */
|
| #ifdef __STDC__
| # include <limits.h>
| #else
| # include <assert.h>
| #endif
|
| #undef usleep
|
| /* Override any gcc2 internal prototype to avoid an error. */
| #ifdef __cplusplus
| extern "C"
| {
| #endif
| /* We use char because int might match the return type of a gcc2
| builtin and then its argument prototype would still apply. */
| char usleep ();
| /* The GNU C library defines this for functions which it implements
| to always fail with ENOSYS. Some functions are actually named
| something starting with __ and the normal name is an alias. */
| #if defined (__stub_usleep) || defined (__stub___usleep)
| choke me
| #else
| char (*f) () = usleep;
| #endif
| #ifdef __cplusplus
| }
| #endif
|
| int
| main ()
| {
| return f != usleep;
| ;
| return 0;
| }
configure:25654: result: no
configure:25567: checking for vsnprintf
configure:25624: g++ -o conftest -ffast-math -fno-exceptions -fsigned-char -Wall -W -Wshadow -mtune=i686 conftest.cc -lm -L/usr/lib -lcurl -L/usr/lib -lgssapi_krb5 -lkrb5 -lk5crypto -lkrb5support -lcom_err -lresolv -lidn -lssl -lcrypto -ldl -lssl -lcrypto -lz >&5
./configure: line 25625: g++: command not found
configure:25630: $? = 127
configure: failed program was:
| /* confdefs.h. */
|
| #define PACKAGE_NAME ""
| #define PACKAGE_TARNAME ""
| #define PACKAGE_VERSION ""
| #define PACKAGE_STRING ""
| #define PACKAGE_BUGREPORT ""
| #define PACKAGE "bzflag"
| #define VERSION "2.0.9"
| #define BZ_BUILD_OS "linux-gnu"
| #define BZ_BUILD_USER "mofo"
| #define BUILD_REGEX 1
| #ifdef __cplusplus
| void exit (int);
| #endif
| #define STDC_HEADERS 1
| #define HAVE_SYS_TYPES_H 1
| #define HAVE_SYS_STAT_H 1
| #define HAVE_STDLIB_H 1
| #define HAVE_STRING_H 1
| #define HAVE_MEMORY_H 1
| #define HAVE_STRINGS_H 1
| #define HAVE_INTTYPES_H 1
| #define HAVE_STDINT_H 1
| #define HAVE_UNISTD_H 1
| #define HAVE_DLFCN_H 1
| #define STDC_HEADERS 1
| #define HAVE_GL_GLX_H 1
| #define HAVE_SDL_SDL_H 1
| #define HAVE_X11_XLIB_H 1
| #define HAVE_LINUX_INPUT_H 1
| #define HAVE_STDINT_H 1
| #define HAVE_SYS_PARAM_H 1
| #define HAVE_UNISTD_H 1
| #define HAVE_VALUES_H 1
| #define HAVE_SOCKLEN_T 1
| #define HAVE_FF_EFFECT_RUMBLE 1
| #define HAVE_FF_EFFECT_DIRECTIONAL 1
| #define HAVE_LIBM 1
| #define HAVE_ACOSF 1
| #define HAVE_ASINF 1
| #define HAVE_ATAN2F 1
| #define HAVE_ATANF 1
| #define HAVE_COSF 1
| #define HAVE_EXPF 1
| #define HAVE_FABSF 1
| #define HAVE_FLOORF 1
| #define HAVE_FMODF 1
| #define HAVE_HYPOTF 1
| #define HAVE_LOGF 1
| #define HAVE_LOG10F 1
| #define HAVE_POWF 1
| #define HAVE_SINF 1
| #define HAVE_SQRTF 1
| #define HAVE_TANF 1
| #define HAVE_SDL 1
| #define ROBOT 1
| #define SNAPPING 1
| #define INSTALL_DATA_DIR "/usr/local/share/bzflag"
| #define HALF_RATE_AUDIO 1
| #define XF86VIDMODE_EXT 1
| #define NDEBUG 1
| /* end confdefs.h. */
| /* Define vsnprintf to an innocuous variant, in case <limits.h> declares vsnprintf.
| For example, HP-UX 11i <limits.h> declares gettimeofday. */
| #define vsnprintf innocuous_vsnprintf
|
| /* System header to define __stub macros and hopefully few prototypes,
| which can conflict with char vsnprintf (); below.
| Prefer <limits.h> to <assert.h> if __STDC__ is defined, since
| <limits.h> exists even on freestanding compilers. */
|
| #ifdef __STDC__
| # include <limits.h>
| #else
| # include <assert.h>
| #endif
|
| #undef vsnprintf
|
| /* Override any gcc2 internal prototype to avoid an error. */
| #ifdef __cplusplus
| extern "C"
| {
| #endif
| /* We use char because int might match the return type of a gcc2
| builtin and then its argument prototype would still apply. */
| char vsnprintf ();
| /* The GNU C library defines this for functions which it implements
| to always fail with ENOSYS. Some functions are actually named
| something starting with __ and the normal name is an alias. */
| #if defined (__stub_vsnprintf) || defined (__stub___vsnprintf)
| choke me
| #else
| char (*f) () = vsnprintf;
| #endif
| #ifdef __cplusplus
| }
| #endif
|
| int
| main ()
| {
| return f != vsnprintf;
| ;
| return 0;
| }
configure:25654: result: no
configure:25567: checking for wglGetCurrentContext
configure:25624: g++ -o conftest -ffast-math -fno-exceptions -fsigned-char -Wall -W -Wshadow -mtune=i686 conftest.cc -lm -L/usr/lib -lcurl -L/usr/lib -lgssapi_krb5 -lkrb5 -lk5crypto -lkrb5support -lcom_err -lresolv -lidn -lssl -lcrypto -ldl -lssl -lcrypto -lz >&5
./configure: line 25625: g++: command not found
configure:25630: $? = 127
configure: failed program was:
| /* confdefs.h. */
|
| #define PACKAGE_NAME ""
| #define PACKAGE_TARNAME ""
| #define PACKAGE_VERSION ""
| #define PACKAGE_STRING ""
| #define PACKAGE_BUGREPORT ""
| #define PACKAGE "bzflag"
| #define VERSION "2.0.9"
| #define BZ_BUILD_OS "linux-gnu"
| #define BZ_BUILD_USER "mofo"
| #define BUILD_REGEX 1
| #ifdef __cplusplus
| void exit (int);
| #endif
| #define STDC_HEADERS 1
| #define HAVE_SYS_TYPES_H 1
| #define HAVE_SYS_STAT_H 1
| #define HAVE_STDLIB_H 1
| #define HAVE_STRING_H 1
| #define HAVE_MEMORY_H 1
| #define HAVE_STRINGS_H 1
| #define HAVE_INTTYPES_H 1
| #define HAVE_STDINT_H 1
| #define HAVE_UNISTD_H 1
| #define HAVE_DLFCN_H 1
| #define STDC_HEADERS 1
| #define HAVE_GL_GLX_H 1
| #define HAVE_SDL_SDL_H 1
| #define HAVE_X11_XLIB_H 1
| #define HAVE_LINUX_INPUT_H 1
| #define HAVE_STDINT_H 1
| #define HAVE_SYS_PARAM_H 1
| #define HAVE_UNISTD_H 1
| #define HAVE_VALUES_H 1
| #define HAVE_SOCKLEN_T 1
| #define HAVE_FF_EFFECT_RUMBLE 1
| #define HAVE_FF_EFFECT_DIRECTIONAL 1
| #define HAVE_LIBM 1
| #define HAVE_ACOSF 1
| #define HAVE_ASINF 1
| #define HAVE_ATAN2F 1
| #define HAVE_ATANF 1
| #define HAVE_COSF 1
| #define HAVE_EXPF 1
| #define HAVE_FABSF 1
| #define HAVE_FLOORF 1
| #define HAVE_FMODF 1
| #define HAVE_HYPOTF 1
| #define HAVE_LOGF 1
| #define HAVE_LOG10F 1
| #define HAVE_POWF 1
| #define HAVE_SINF 1
| #define HAVE_SQRTF 1
| #define HAVE_TANF 1
| #define HAVE_SDL 1
| #define ROBOT 1
| #define SNAPPING 1
| #define INSTALL_DATA_DIR "/usr/local/share/bzflag"
| #define HALF_RATE_AUDIO 1
| #define XF86VIDMODE_EXT 1
| #define NDEBUG 1
| /* end confdefs.h. */
| /* Define wglGetCurrentContext to an innocuous variant, in case <limits.h> declares wglGetCurrentContext.
| For example, HP-UX 11i <limits.h> declares gettimeofday. */
| #define wglGetCurrentContext innocuous_wglGetCurrentContext
|
| /* System header to define __stub macros and hopefully few prototypes,
| which can conflict with char wglGetCurrentContext (); below.
| Prefer <limits.h> to <assert.h> if __STDC__ is defined, since
| <limits.h> exists even on freestanding compilers. */
|
| #ifdef __STDC__
| # include <limits.h>
| #else
| # include <assert.h>
| #endif
|
| #undef wglGetCurrentContext
|
| /* Override any gcc2 internal prototype to avoid an error. */
| #ifdef __cplusplus
| extern "C"
| {
| #endif
| /* We use char because int might match the return type of a gcc2
| builtin and then its argument prototype would still apply. */
| char wglGetCurrentContext ();
| /* The GNU C library defines this for functions which it implements
| to always fail with ENOSYS. Some functions are actually named
| something starting with __ and the normal name is an alias. */
| #if defined (__stub_wglGetCurrentContext) || defined (__stub___wglGetCurrentContext)
| choke me
| #else
| char (*f) () = wglGetCurrentContext;
| #endif
| #ifdef __cplusplus
| }
| #endif
|
| int
| main ()
| {
| return f != wglGetCurrentContext;
| ;
| return 0;
| }
configure:25654: result: no
configure:25673: checking for isnan
configure:25700: g++ -c -ffast-math -fno-exceptions -fsigned-char -Wall -W -Wshadow -mtune=i686 conftest.cc >&5
./configure: line 25701: g++: command not found
configure:25706: $? = 127
configure: failed program was:
| /* confdefs.h. */
|
| #define PACKAGE_NAME ""
| #define PACKAGE_TARNAME ""
| #define PACKAGE_VERSION ""
| #define PACKAGE_STRING ""
| #define PACKAGE_BUGREPORT ""
| #define PACKAGE "bzflag"
| #define VERSION "2.0.9"
| #define BZ_BUILD_OS "linux-gnu"
| #define BZ_BUILD_USER "mofo"
| #define BUILD_REGEX 1
| #ifdef __cplusplus
| void exit (int);
| #endif
| #define STDC_HEADERS 1
| #define HAVE_SYS_TYPES_H 1
| #define HAVE_SYS_STAT_H 1
| #define HAVE_STDLIB_H 1
| #define HAVE_STRING_H 1
| #define HAVE_MEMORY_H 1
| #define HAVE_STRINGS_H 1
| #define HAVE_INTTYPES_H 1
| #define HAVE_STDINT_H 1
| #define HAVE_UNISTD_H 1
| #define HAVE_DLFCN_H 1
| #define STDC_HEADERS 1
| #define HAVE_GL_GLX_H 1
| #define HAVE_SDL_SDL_H 1
| #define HAVE_X11_XLIB_H 1
| #define HAVE_LINUX_INPUT_H 1
| #define HAVE_STDINT_H 1
| #define HAVE_SYS_PARAM_H 1
| #define HAVE_UNISTD_H 1
| #define HAVE_VALUES_H 1
| #define HAVE_SOCKLEN_T 1
| #define HAVE_FF_EFFECT_RUMBLE 1
| #define HAVE_FF_EFFECT_DIRECTIONAL 1
| #define HAVE_LIBM 1
| #define HAVE_ACOSF 1
| #define HAVE_ASINF 1
| #define HAVE_ATAN2F 1
| #define HAVE_ATANF 1
| #define HAVE_COSF 1
| #define HAVE_EXPF 1
| #define HAVE_FABSF 1
| #define HAVE_FLOORF 1
| #define HAVE_FMODF 1
| #define HAVE_HYPOTF 1
| #define HAVE_LOGF 1
| #define HAVE_LOG10F 1
| #define HAVE_POWF 1
| #define HAVE_SINF 1
| #define HAVE_SQRTF 1
| #define HAVE_TANF 1
| #define HAVE_SDL 1
| #define ROBOT 1
| #define SNAPPING 1
| #define INSTALL_DATA_DIR "/usr/local/share/bzflag"
| #define HALF_RATE_AUDIO 1
| #define XF86VIDMODE_EXT 1
| #define NDEBUG 1
| /* end confdefs.h. */
|
| #ifdef HAVE_CMATH
| # include <cmath>
| #endif
|
| int
| main ()
| {
|
| float f = 0.0f;
| std::isnan(f);
|
| ;
| return 0;
| }
configure:25757: g++ -c -ffast-math -fno-exceptions -fsigned-char -Wall -W -Wshadow -mtune=i686 conftest.cc >&5
./configure: line 25758: g++: command not found
configure:25763: $? = 127
configure: failed program was:
| /* confdefs.h. */
|
| #define PACKAGE_NAME ""
| #define PACKAGE_TARNAME ""
| #define PACKAGE_VERSION ""
| #define PACKAGE_STRING ""
| #define PACKAGE_BUGREPORT ""
| #define PACKAGE "bzflag"
| #define VERSION "2.0.9"
| #define BZ_BUILD_OS "linux-gnu"
| #define BZ_BUILD_USER "mofo"
| #define BUILD_REGEX 1
| #ifdef __cplusplus
| void exit (int);
| #endif
| #define STDC_HEADERS 1
| #define HAVE_SYS_TYPES_H 1
| #define HAVE_SYS_STAT_H 1
| #define HAVE_STDLIB_H 1
| #define HAVE_STRING_H 1
| #define HAVE_MEMORY_H 1
| #define HAVE_STRINGS_H 1
| #define HAVE_INTTYPES_H 1
| #define HAVE_STDINT_H 1
| #define HAVE_UNISTD_H 1
| #define HAVE_DLFCN_H 1
| #define STDC_HEADERS 1
| #define HAVE_GL_GLX_H 1
| #define HAVE_SDL_SDL_H 1
| #define HAVE_X11_XLIB_H 1
| #define HAVE_LINUX_INPUT_H 1
| #define HAVE_STDINT_H 1
| #define HAVE_SYS_PARAM_H 1
| #define HAVE_UNISTD_H 1
| #define HAVE_VALUES_H 1
| #define HAVE_SOCKLEN_T 1
| #define HAVE_FF_EFFECT_RUMBLE 1
| #define HAVE_FF_EFFECT_DIRECTIONAL 1
| #define HAVE_LIBM 1
| #define HAVE_ACOSF 1
| #define HAVE_ASINF 1
| #define HAVE_ATAN2F 1
| #define HAVE_ATANF 1
| #define HAVE_COSF 1
| #define HAVE_EXPF 1
| #define HAVE_FABSF 1
| #define HAVE_FLOORF 1
| #define HAVE_FMODF 1
| #define HAVE_HYPOTF 1
| #define HAVE_LOGF 1
| #define HAVE_LOG10F 1
| #define HAVE_POWF 1
| #define HAVE_SINF 1
| #define HAVE_SQRTF 1
| #define HAVE_TANF 1
| #define HAVE_SDL 1
| #define ROBOT 1
| #define SNAPPING 1
| #define INSTALL_DATA_DIR "/usr/local/share/bzflag"
| #define HALF_RATE_AUDIO 1
| #define XF86VIDMODE_EXT 1
| #define NDEBUG 1
| /* end confdefs.h. */
|
| #include <cmath>
| #include <math.h>
|
| int
| main ()
| {
|
| float f = 0.0f;
| isnan(f);
|
| ;
| return 0;
| }
configure:25793: result: no
configure:25824: g++ -c -ffast-math -fno-exceptions -fsigned-char -Wall -W -Wshadow -mtune=i686 conftest.cc >&5
./configure: line 25825: g++: command not found
configure:25830: $? = 127
configure: failed program was:
| /* confdefs.h. */
|
| #define PACKAGE_NAME ""
| #define PACKAGE_TARNAME ""
| #define PACKAGE_VERSION ""
| #define PACKAGE_STRING ""
| #define PACKAGE_BUGREPORT ""
| #define PACKAGE "bzflag"
| #define VERSION "2.0.9"
| #define BZ_BUILD_OS "linux-gnu"
| #define BZ_BUILD_USER "mofo"
| #define BUILD_REGEX 1
| #ifdef __cplusplus
| void exit (int);
| #endif
| #define STDC_HEADERS 1
| #define HAVE_SYS_TYPES_H 1
| #define HAVE_SYS_STAT_H 1
| #define HAVE_STDLIB_H 1
| #define HAVE_STRING_H 1
| #define HAVE_MEMORY_H 1
| #define HAVE_STRINGS_H 1
| #define HAVE_INTTYPES_H 1
| #define HAVE_STDINT_H 1
| #define HAVE_UNISTD_H 1
| #define HAVE_DLFCN_H 1
| #define STDC_HEADERS 1
| #define HAVE_GL_GLX_H 1
| #define HAVE_SDL_SDL_H 1
| #define HAVE_X11_XLIB_H 1
| #define HAVE_LINUX_INPUT_H 1
| #define HAVE_STDINT_H 1
| #define HAVE_SYS_PARAM_H 1
| #define HAVE_UNISTD_H 1
| #define HAVE_VALUES_H 1
| #define HAVE_SOCKLEN_T 1
| #define HAVE_FF_EFFECT_RUMBLE 1
| #define HAVE_FF_EFFECT_DIRECTIONAL 1
| #define HAVE_LIBM 1
| #define HAVE_ACOSF 1
| #define HAVE_ASINF 1
| #define HAVE_ATAN2F 1
| #define HAVE_ATANF 1
| #define HAVE_COSF 1
| #define HAVE_EXPF 1
| #define HAVE_FABSF 1
| #define HAVE_FLOORF 1
| #define HAVE_FMODF 1
| #define HAVE_HYPOTF 1
| #define HAVE_LOGF 1
| #define HAVE_LOG10F 1
| #define HAVE_POWF 1
| #define HAVE_SINF 1
| #define HAVE_SQRTF 1
| #define HAVE_TANF 1
| #define HAVE_SDL 1
| #define ROBOT 1
| #define SNAPPING 1
| #define INSTALL_DATA_DIR "/usr/local/share/bzflag"
| #define HALF_RATE_AUDIO 1
| #define XF86VIDMODE_EXT 1
| #define NDEBUG 1
| /* end confdefs.h. */
|
| #include <algorithm>
|
| int
| main ()
| {
|
| int i = std::min(0, 1); i = i;
|
| ;
| return 0;
| }
configure:25876: g++ -c -ffast-math -fno-exceptions -fsigned-char -Wall -W -Wshadow -mtune=i686 conftest.cc >&5
./configure: line 25877: g++: command not found
configure:25882: $? = 127
configure: failed program was:
| /* confdefs.h. */
|
| #define PACKAGE_NAME ""
| #define PACKAGE_TARNAME ""
| #define PACKAGE_VERSION ""
| #define PACKAGE_STRING ""
| #define PACKAGE_BUGREPORT ""
| #define PACKAGE "bzflag"
| #define VERSION "2.0.9"
| #define BZ_BUILD_OS "linux-gnu"
| #define BZ_BUILD_USER "mofo"
| #define BUILD_REGEX 1
| #ifdef __cplusplus
| void exit (int);
| #endif
| #define STDC_HEADERS 1
| #define HAVE_SYS_TYPES_H 1
| #define HAVE_SYS_STAT_H 1
| #define HAVE_STDLIB_H 1
| #define HAVE_STRING_H 1
| #define HAVE_MEMORY_H 1
| #define HAVE_STRINGS_H 1
| #define HAVE_INTTYPES_H 1
| #define HAVE_STDINT_H 1
| #define HAVE_UNISTD_H 1
| #define HAVE_DLFCN_H 1
| #define STDC_HEADERS 1
| #define HAVE_GL_GLX_H 1
| #define HAVE_SDL_SDL_H 1
| #define HAVE_X11_XLIB_H 1
| #define HAVE_LINUX_INPUT_H 1
| #define HAVE_STDINT_H 1
| #define HAVE_SYS_PARAM_H 1
| #define HAVE_UNISTD_H 1
| #define HAVE_VALUES_H 1
| #define HAVE_SOCKLEN_T 1
| #define HAVE_FF_EFFECT_RUMBLE 1
| #define HAVE_FF_EFFECT_DIRECTIONAL 1
| #define HAVE_LIBM 1
| #define HAVE_ACOSF 1
| #define HAVE_ASINF 1
| #define HAVE_ATAN2F 1
| #define HAVE_ATANF 1
| #define HAVE_COSF 1
| #define HAVE_EXPF 1
| #define HAVE_FABSF 1
| #define HAVE_FLOORF 1
| #define HAVE_FMODF 1
| #define HAVE_HYPOTF 1
| #define HAVE_LOGF 1
| #define HAVE_LOG10F 1
| #define HAVE_POWF 1
| #define HAVE_SINF 1
| #define HAVE_SQRTF 1
| #define HAVE_TANF 1
| #define HAVE_SDL 1
| #define ROBOT 1
| #define SNAPPING 1
| #define INSTALL_DATA_DIR "/usr/local/share/bzflag"
| #define HALF_RATE_AUDIO 1
| #define XF86VIDMODE_EXT 1
| #define NDEBUG 1
| /* end confdefs.h. */
|
| #include <algorithm>
|
| int
| main ()
| {
|
| int i = std::max(0, 1); i = i;
|
| ;
| return 0;
| }
configure:25929: g++ -c -ffast-math -fno-exceptions -fsigned-char -Wall -W -Wshadow -mtune=i686 conftest.cc >&5
./configure: line 25930: g++: command not found
configure:25935: $? = 127
configure: failed program was:
| /* confdefs.h. */
|
| #define PACKAGE_NAME ""
| #define PACKAGE_TARNAME ""
| #define PACKAGE_VERSION ""
| #define PACKAGE_STRING ""
| #define PACKAGE_BUGREPORT ""
| #define PACKAGE "bzflag"
| #define VERSION "2.0.9"
| #define BZ_BUILD_OS "linux-gnu"
| #define BZ_BUILD_USER "mofo"
| #define BUILD_REGEX 1
| #ifdef __cplusplus
| void exit (int);
| #endif
| #define STDC_HEADERS 1
| #define HAVE_SYS_TYPES_H 1
| #define HAVE_SYS_STAT_H 1
| #define HAVE_STDLIB_H 1
| #define HAVE_STRING_H 1
| #define HAVE_MEMORY_H 1
| #define HAVE_STRINGS_H 1
| #define HAVE_INTTYPES_H 1
| #define HAVE_STDINT_H 1
| #define HAVE_UNISTD_H 1
| #define HAVE_DLFCN_H 1
| #define STDC_HEADERS 1
| #define HAVE_GL_GLX_H 1
| #define HAVE_SDL_SDL_H 1
| #define HAVE_X11_XLIB_H 1
| #define HAVE_LINUX_INPUT_H 1
| #define HAVE_STDINT_H 1
| #define HAVE_SYS_PARAM_H 1
| #define HAVE_UNISTD_H 1
| #define HAVE_VALUES_H 1
| #define HAVE_SOCKLEN_T 1
| #define HAVE_FF_EFFECT_RUMBLE 1
| #define HAVE_FF_EFFECT_DIRECTIONAL 1
| #define HAVE_LIBM 1
| #define HAVE_ACOSF 1
| #define HAVE_ASINF 1
| #define HAVE_ATAN2F 1
| #define HAVE_ATANF 1
| #define HAVE_COSF 1
| #define HAVE_EXPF 1
| #define HAVE_FABSF 1
| #define HAVE_FLOORF 1
| #define HAVE_FMODF 1
| #define HAVE_HYPOTF 1
| #define HAVE_LOGF 1
| #define HAVE_LOG10F 1
| #define HAVE_POWF 1
| #define HAVE_SINF 1
| #define HAVE_SQRTF 1
| #define HAVE_TANF 1
| #define HAVE_SDL 1
| #define ROBOT 1
| #define SNAPPING 1
| #define INSTALL_DATA_DIR "/usr/local/share/bzflag"
| #define HALF_RATE_AUDIO 1
| #define XF86VIDMODE_EXT 1
| #define NDEBUG 1
| /* end confdefs.h. */
|
| #include <algorithm>
|
| int
| main ()
| {
|
| char array[] = "test";
| int i = std::count(array, array + 5, 't'); i = i;
|
| ;
| return 0;
| }
configure:26283: creating ./config.status
## ---------------------- ##
## Running config.status. ##
## ---------------------- ##
This file was extended by config.status, which was
generated by GNU Autoconf 2.59. Invocation command line was
CONFIG_FILES =
CONFIG_HEADERS =
CONFIG_LINKS =
CONFIG_COMMANDS =
$ ./config.status
on Planet-MoFo
config.status:909: creating bzflag.info
config.status:909: creating BZFlag.xcode/Makefile
config.status:909: creating Dev-C++/Makefile
config.status:909: creating Makefile
config.status:909: creating bzflag.lsm
config.status:909: creating bzflag.spec
config.status:909: creating data/Makefile
config.status:909: creating data/fonts/Makefile
config.status:909: creating data/l10n/Makefile
config.status:909: creating debian/Makefile
config.status:909: creating doc/Makefile
config.status:909: creating doc/faq/Makefile
config.status:909: creating doc/guide/Commands/Makefile
config.status:909: creating doc/guide/Flags/Makefile
config.status:909: creating doc/guide/Geometry/Makefile
config.status:909: creating doc/guide/Installation/Makefile
config.status:909: creating doc/guide/Makefile
config.status:909: creating doc/guide/Tactics/Makefile
config.status:909: creating doc/howto/Makefile
config.status:909: creating doc/man/Makefile
config.status:909: creating include/Makefile
config.status:909: creating m4/Makefile
config.status:909: creating man/Makefile
config.status:909: creating man/bzadmin.6
config.status:909: creating man/bzflag.6
config.status:909: creating man/bzfs.6
config.status:909: creating man/bzw.5
config.status:909: creating misc/Makefile
config.status:909: creating package/Makefile
config.status:909: creating package/irix/Makefile
config.status:909: creating package/linux/Makefile
config.status:909: creating package/rpm/Makefile
config.status:909: creating package/win32/Makefile
config.status:909: creating package/win32/nsis/Makefile
config.status:909: creating plugins/Makefile
config.status:909: creating plugins/RogueGenocide/Makefile
config.status:909: creating plugins/SAMPLE_PLUGIN/Makefile
config.status:909: creating plugins/airspawn/Makefile
config.status:909: creating plugins/chathistory/Makefile
config.status:909: creating plugins/hiddenAdmin/Makefile
config.status:909: creating plugins/killall/Makefile
config.status:909: creating plugins/logDetail/Makefile
config.status:909: creating plugins/playHistoryTracker/Makefile
config.status:909: creating plugins/python/Makefile
config.status:909: creating plugins/recordmatch/Makefile
config.status:909: creating plugins/shockwaveDeath/Makefile
config.status:909: creating plugins/vocaliser/Makefile
config.status:909: creating plugins/HoldTheFlag/Makefile
config.status:909: creating plugins/nagware/Makefile
config.status:909: creating plugins/doc/Makefile
config.status:909: creating plugins/vc71/Makefile
config.status:909: creating src/3D/Makefile
config.status:909: creating src/Makefile
config.status:909: creating src/bzadmin/Makefile
config.status:909: creating src/bzflag/Makefile
config.status:909: creating src/bzfs/Makefile
config.status:909: creating src/c-ares/Makefile
config.status:909: creating src/common/Makefile
config.status:909: creating src/date/Makefile
config.status:909: creating src/game/Makefile
config.status:909: creating src/geometry/Makefile
config.status:909: creating src/geometry/models/Makefile
config.status:909: creating src/geometry/models/tank/Makefile
config.status:909: creating src/mediafile/Makefile
config.status:909: creating src/net/Makefile
config.status:909: creating src/obstacle/Makefile
config.status:909: creating src/ogl/Makefile
config.status:909: creating src/platform/MacOSX/BZFlag-Info.plist
config.status:909: creating src/platform/MacOSX/Makefile
config.status:909: creating src/platform/Makefile
config.status:909: creating src/regex/Makefile
config.status:909: creating src/scene/Makefile
config.status:909: creating src/zlib/Makefile
config.status:909: creating tools/Makefile
config.status:909: creating tools/TextTool-W32/Makefile
config.status:909: creating tools/TextTool-W32/res/Makefile
config.status:909: creating tools/bzwtransform/Makefile
config.status:909: creating tools/modeltool/Makefile
config.status:909: creating tools/modeltool/vc71/Makefile
config.status:909: creating win32/Makefile
config.status:909: creating win32/VC71/Makefile
config.status:909: creating win32/VC8/Makefile
config.status:975: creating include/config.h
config.status:1179: include/config.h is unchanged
config.status:1359: executing depfiles commands
configure:27758: result:
configure:27760: result: BZFlag-2.0.9.20060614 with the following:
configure:27763: result: no curses!
configure:27773: result: SDL
configure:27780: result: bzadmin
configure:27784: result: no bzflag client binary!
## ---------------- ##
## Cache variables. ##
## ---------------- ##
ac_cv_build=i686-pc-linux-gnu
ac_cv_build_alias=i686-pc-linux-gnu
ac_cv_c_bigendian=no
ac_cv_c_compiler_gnu=yes
ac_cv_c_const=yes
ac_cv_cxx_compiler_gnu=no
ac_cv_env_CC_set=
ac_cv_env_CC_value=
ac_cv_env_CFLAGS_set=
ac_cv_env_CFLAGS_value=
ac_cv_env_CPPFLAGS_set=
ac_cv_env_CPPFLAGS_value=
ac_cv_env_CPP_set=
ac_cv_env_CPP_value=
ac_cv_env_CXXCPP_set=
ac_cv_env_CXXCPP_value=
ac_cv_env_CXXFLAGS_set=
ac_cv_env_CXXFLAGS_value=
ac_cv_env_CXX_set=
ac_cv_env_CXX_value=
ac_cv_env_F77_set=
ac_cv_env_F77_value=
ac_cv_env_FFLAGS_set=
ac_cv_env_FFLAGS_value=
ac_cv_env_LDFLAGS_set=
ac_cv_env_LDFLAGS_value=
ac_cv_env_build_alias_set=
ac_cv_env_build_alias_value=
ac_cv_env_host_alias_set=
ac_cv_env_host_alias_value=
ac_cv_env_target_alias_set=
ac_cv_env_target_alias_value=
ac_cv_exeext=
ac_cv_f77_compiler_gnu=no
ac_cv_func_CGLGetCurrentContext=no
ac_cv_func_Sleep=no
ac_cv_func_WaitForSingleObject=no
ac_cv_func__stricmp=no
ac_cv_func__strnicmp=no
ac_cv_func__vsnprintf=no
ac_cv_func_atexit=no
ac_cv_func_connect=yes
ac_cv_func_dlopen=no
ac_cv_func_gethostbyname=yes
ac_cv_func_getrlimit=no
ac_cv_func_glXGetCurrentContext=no
ac_cv_func_remove=yes
ac_cv_func_select=no
ac_cv_func_shl_load=no
ac_cv_func_shmat=yes
ac_cv_func_snooze=no
ac_cv_func_usleep=no
ac_cv_func_vsnprintf=no
ac_cv_func_wglGetCurrentContext=no
ac_cv_have_x='have_x=yes ac_x_includes= ac_x_libraries='
ac_cv_header_GL_glx_h=yes
ac_cv_header_SDL_SDL_h=yes
ac_cv_header_X11_Xlib_h=yes
ac_cv_header_bstring_h=no
ac_cv_header_cstdio=no
ac_cv_header_cstdlib=no
ac_cv_header_cstring=no
ac_cv_header_dlfcn_h=yes
ac_cv_header_dsound_h=no
ac_cv_header_inttypes_h=yes
ac_cv_header_linux_input_h=yes
ac_cv_header_memory_h=yes
ac_cv_header_stdc=yes
ac_cv_header_stdint_h=yes
ac_cv_header_stdlib_h=yes
ac_cv_header_string_h=yes
ac_cv_header_strings_h=yes
ac_cv_header_sys_param_h=yes
ac_cv_header_sys_stat_h=yes
ac_cv_header_sys_types_h=yes
ac_cv_header_unistd_h=yes
ac_cv_header_values_h=yes
ac_cv_host=i686-pc-linux-gnu
ac_cv_host_alias=i686-pc-linux-gnu
ac_cv_lib_ICE_IceConnectionNumber=yes
ac_cv_lib_Xext_XextAddDisplay=yes
ac_cv_lib_Xi_XListInputDevices=yes
ac_cv_lib_Xxf86vm_XF86VidModeGetAllModeLines=no
ac_cv_lib_bind_gethostent=no
ac_cv_lib_cares_ares_init=no
ac_cv_lib_dl_dlopen=yes
ac_cv_lib_dld_shl_load=no
ac_cv_lib_m_acosf=yes
ac_cv_lib_m_asinf=yes
ac_cv_lib_m_atan2f=yes
ac_cv_lib_m_atanf=yes
ac_cv_lib_m_cosf=yes
ac_cv_lib_m_expf=yes
ac_cv_lib_m_fabsf=yes
ac_cv_lib_m_floorf=yes
ac_cv_lib_m_fmodf=yes
ac_cv_lib_m_hypotf=yes
ac_cv_lib_m_log10f=yes
ac_cv_lib_m_logf=yes
ac_cv_lib_m_powf=yes
ac_cv_lib_m_sinf=yes
ac_cv_lib_m_sqrtf=yes
ac_cv_lib_m_tanf=yes
ac_cv_lib_socket_gethostent=no
ac_cv_lib_socket_socket=no
ac_cv_lib_z_compress=yes
ac_cv_objext=o
ac_cv_path_SDL_CONFIG=/usr/bin/sdl-config
ac_cv_path_install='/usr/bin/install -c'
ac_cv_prog_AR=ar
ac_cv_prog_AWK=mawk
ac_cv_prog_CPP='gcc -E'
ac_cv_prog_HASPOD2MAN=yes
ac_cv_prog_HASWHOAMI=yes
ac_cv_prog_ac_ct_AR=ar
ac_cv_prog_ac_ct_CC=gcc
ac_cv_prog_ac_ct_RANLIB=ranlib
ac_cv_prog_ac_ct_STRIP=strip
ac_cv_prog_ac_ct_WINDRES=:
ac_cv_prog_cc_g=yes
ac_cv_prog_cc_stdc=
ac_cv_prog_cxx_g=no
ac_cv_prog_egrep='grep -E'
ac_cv_prog_f77_g=no
ac_cv_prog_make_make_set=no
ac_cv_search_glBegin=no
ac_cv_search_gluScaleImage=no
ac_cv_target=i686-pc-linux-gnu
ac_cv_target_alias=i686-pc-linux-gnu
ac_cv_type_socklen_t=yes
am_cv_CC_dependencies_compiler_type=none
am_cv_CXX_dependencies_compiler_type=none
lt_cv_deplibs_check_method=pass_all
lt_cv_dlopen=dlopen
lt_cv_dlopen_libs=-ldl
lt_cv_dlopen_self=yes
lt_cv_dlopen_self_static=no
lt_cv_file_magic_cmd='$MAGIC_CMD'
lt_cv_file_magic_test_file=
lt_cv_ld_reload_flag=-r
lt_cv_objdir=.libs
lt_cv_path_LD=/usr/bin/ld
lt_cv_path_NM='/usr/bin/nm -B'
lt_cv_path_SED=/bin/sed
lt_cv_prog_compiler_c_o=yes
lt_cv_prog_compiler_rtti_exceptions=no
lt_cv_prog_gnu_ld=yes
lt_cv_sys_global_symbol_pipe='sed -n -e '\''s/^.*[ ]\([ABCDGIRSTW][ABCDGIRSTW]*\)[ ][ ]*\([_A-Za-z][_A-Za-z0-9]*\)$/\1 \2 \2/p'\'''
lt_cv_sys_global_symbol_to_c_name_address='sed -n -e '\''s/^: \([^ ]*\) $/ {\"\1\", (lt_ptr) 0},/p'\'' -e '\''s/^[BCDEGRST] \([^ ]*\) \([^ ]*\)$/ {"\2", (lt_ptr) \&\2},/p'\'''
lt_cv_sys_global_symbol_to_cdecl='sed -n -e '\''s/^. .* \(.*\)$/extern int \1;/p'\'''
lt_cv_sys_max_cmd_len=32768
lt_lt_cv_prog_compiler_c_o='"yes"'
lt_lt_cv_sys_global_symbol_pipe='"sed -n -e '\''s/^.*[ ]\\([ABCDGIRSTW][ABCDGIRSTW]*\\)[ ][ ]*\\([_A-Za-z][_A-Za-z0-9]*\\)\$/\\1 \\2 \\2/p'\''"'
lt_lt_cv_sys_global_symbol_to_c_name_address='"sed -n -e '\''s/^: \\([^ ]*\\) \$/ {\\\"\\1\\\", (lt_ptr) 0},/p'\'' -e '\''s/^[BCDEGRST] \\([^ ]*\\) \\([^ ]*\\)\$/ {\"\\2\", (lt_ptr) \\&\\2},/p'\''"'
lt_lt_cv_sys_global_symbol_to_cdecl='"sed -n -e '\''s/^. .* \\(.*\\)\$/extern int \\1;/p'\''"'
mp_cv_curses=no
mp_cv_ncurses=no
mp_cv_pdcurses=no
mp_cv_xcurses=no
my_cv_curl_vers=7.15.1
## ----------------- ##
## Output variables. ##
## ----------------- ##
ACLOCAL='${SHELL} /home/mofo/bzflag/misc/missing --run aclocal-1.9'
AMDEPBACKSLASH='\'
AMDEP_FALSE='#'
AMDEP_TRUE=''
AMTAR='${SHELL} /home/mofo/bzflag/misc/missing --run tar'
AR='ar'
AR_FLAGS='cru'
AUTOCONF='${SHELL} /home/mofo/bzflag/misc/missing --run autoconf'
AUTOHEADER='${SHELL} /home/mofo/bzflag/misc/missing --run autoheader'
AUTOMAKE='${SHELL} /home/mofo/bzflag/misc/missing --run automake-1.9'
AWK='mawk'
BEOS_FALSE=''
BEOS_TRUE='#'
BUGGY_MIPSPRO_FALSE=''
BUGGY_MIPSPRO_TRUE='#'
BUILDCARES_FALSE='#'
BUILDCARES_TRUE=''
BUILDZLIB_FALSE=''
BUILDZLIB_TRUE='#'
BUILD_PLUGINS_FALSE=''
BUILD_PLUGINS_TRUE='#'
BUILD_REGEX_FALSE='#'
BUILD_REGEX_TRUE=''
BZADMIN_INCLUDED_FALSE='#'
BZADMIN_INCLUDED_TRUE=''
BZFLAG_DATE='2006-06-14'
BZFLAG_VERSION='2.0.9'
CC='gcc'
CCACHE=''
CCDEPMODE='depmode=none'
CFLAGS='-g -O2'
CLIENT_INCLUDED_FALSE=''
CLIENT_INCLUDED_TRUE='#'
CONFIG=''
CPP='gcc -E'
CPPFLAGS=' -Wall -W -Wshadow -mtune=i686'
CURL_CFLAGS=''
CURSES_LIB=''
CXX='g++'
CXXCPP=''
CXXDEPMODE='depmode=none'
CXXFLAGS=' -ffast-math -fno-exceptions -fsigned-char'
CYGPATH_W='echo'
DEBUG_FALSE=''
DEBUG_TRUE='#'
DEFS='-DHAVE_CONFIG_H'
DEPDIR='.deps'
ECHO='echo'
ECHO_C=''
ECHO_N='-n'
ECHO_T=''
EGREP='grep -E'
EXEEXT=''
F77=''
FFLAGS=''
GLEW_LIBS=''
GLIBS='-lXi -lXext -lSM -lICE -lX11 '
HASPOD2MAN='yes'
HASPOD2MAN_FALSE='#'
HASPOD2MAN_TRUE=''
HASWHOAMI='yes'
HAVE_CURSES_FALSE=''
HAVE_CURSES_TRUE='#'
HAVE_KRB5_FALSE=''
HAVE_KRB5_TRUE='#'
HAVE_SDL_FALSE='#'
HAVE_SDL_TRUE=''
INSTALL_DATA='${INSTALL} -m 644'
INSTALL_DATA_DIR='/usr/local/share/bzflag'
INSTALL_PROGRAM='${INSTALL}'
INSTALL_SCRIPT='${INSTALL}'
INSTALL_STRIP_PROGRAM='${SHELL} $(install_sh) -c -s'
IRIX_FALSE=''
IRIX_TRUE='#'
KRB5_CFLAGS=''
KRB5_CONFIG='no'
KRB5_LIBS=''
LDFLAGS=' '
LIBDIR='$(top_srcdir)/lib'
LIBOBJS=''
LIBS='-lm -L/usr/lib -lcurl -L/usr/lib -lgssapi_krb5 -lkrb5 -lk5crypto -lkrb5support -lcom_err -lresolv -lidn -lssl -lcrypto -ldl -lssl -lcrypto -lz '
LIBTOOL='$(SHELL) $(top_builddir)/libtool'
LIBTOOL_DEPS='misc/ltmain.sh'
LINUX_FALSE='#'
LINUX_TRUE=''
LN_S='ln -s'
LTLIBOBJS=''
MACOS_FALSE=''
MACOS_TRUE='#'
MAJOR_VERSION='2'
MAKEINFO='${SHELL} /home/mofo/bzflag/misc/missing --run makeinfo'
MINOR_VERSION='0'
OBJEXT='o'
PACKAGE='bzflag'
PACKAGE_BUGREPORT=''
PACKAGE_NAME=''
PACKAGE_STRING=''
PACKAGE_TARNAME=''
PACKAGE_VERSION=''
PATH_SEPARATOR=':'
PC_FALSE='#'
PC_TRUE=''
PPC_FALSE=''
PPC_TRUE='#'
RANLIB='ranlib'
SDL_CFLAGS='-I/usr/include/SDL -D_REENTRANT'
SDL_CONFIG='/usr/bin/sdl-config'
SDL_IMAGE_LIBS=''
SDL_LIBS='-L/usr/lib -lSDL -lpthread'
SET_MAKE='MAKE=make'
SHELL='/bin/sh'
SOLARIS_FALSE=''
SOLARIS_TRUE='#'
STRIP='strip'
VERSION='2.0.9'
WIN32_FALSE=''
WIN32_TRUE='#'
WINDRES=':'
WINPORT=''
X_CFLAGS=''
X_EXTRA_LIBS=''
X_LIBS=''
X_PRE_LIBS=' -lSM -lICE'
ac_ct_AR='ar'
ac_ct_CC='gcc'
ac_ct_CXX='g++'
ac_ct_F77=''
ac_ct_RANLIB='ranlib'
ac_ct_STRIP='strip'
ac_ct_WINDRES=':'
am__fastdepCC_FALSE=''
am__fastdepCC_TRUE='#'
am__fastdepCXX_FALSE=''
am__fastdepCXX_TRUE='#'
am__include='#'
am__leading_dot='.'
am__quote=''
am__tar='${AMTAR} chof - "$$tardir"'
am__untar='${AMTAR} xf -'
bindir='${exec_prefix}/bin'
build='i686-pc-linux-gnu'
build_alias=''
build_cpu='i686'
build_os='linux-gnu'
build_vendor='pc'
datadir='${prefix}/share'
desktopdir='/usr/local/share/applications'
exec_prefix='${prefix}'
host='i686-pc-linux-gnu'
host_alias=''
host_cpu='i686'
host_os='linux-gnu'
host_vendor='pc'
includedir='${prefix}/include'
infodir='${prefix}/info'
install_sh='/home/mofo/bzflag/misc/install-sh'
libdir='${exec_prefix}/lib'
libexecdir='${exec_prefix}/libexec'
localstatedir='${prefix}/var'
mandir='${prefix}/man'
mkdir_p='mkdir -p --'
oldincludedir='/usr/include'
prefix='/usr/local'
program_transform_name='s,x,x,'
sbindir='${exec_prefix}/sbin'
sharedstatedir='${prefix}/com'
sysconfdir='${prefix}/etc'
target='i686-pc-linux-gnu'
target_alias=''
target_cpu='i686'
target_os='linux-gnu'
target_vendor='pc'
## ----------- ##
## confdefs.h. ##
## ----------- ##
#define BUILD_REGEX 1
#define BZ_BUILD_OS "linux-gnu"
#define BZ_BUILD_USER "mofo"
#define HALF_RATE_AUDIO 1
#define HAVE_ACOSF 1
#define HAVE_ASINF 1
#define HAVE_ATAN2F 1
#define HAVE_ATANF 1
#define HAVE_COSF 1
#define HAVE_DLFCN_H 1
#define HAVE_EXPF 1
#define HAVE_FABSF 1
#define HAVE_FF_EFFECT_DIRECTIONAL 1
#define HAVE_FF_EFFECT_RUMBLE 1
#define HAVE_FLOORF 1
#define HAVE_FMODF 1
#define HAVE_GL_GLX_H 1
#define HAVE_HYPOTF 1
#define HAVE_INTTYPES_H 1
#define HAVE_LIBM 1
#define HAVE_LINUX_INPUT_H 1
#define HAVE_LOG10F 1
#define HAVE_LOGF 1
#define HAVE_MEMORY_H 1
#define HAVE_POWF 1
#define HAVE_SDL 1
#define HAVE_SDL_SDL_H 1
#define HAVE_SINF 1
#define HAVE_SOCKLEN_T 1
#define HAVE_SQRTF 1
#define HAVE_STDINT_H 1
#define HAVE_STDINT_H 1
#define HAVE_STDLIB_H 1
#define HAVE_STRINGS_H 1
#define HAVE_STRING_H 1
#define HAVE_SYS_PARAM_H 1
#define HAVE_SYS_STAT_H 1
#define HAVE_SYS_TYPES_H 1
#define HAVE_TANF 1
#define HAVE_UNISTD_H 1
#define HAVE_UNISTD_H 1
#define HAVE_VALUES_H 1
#define HAVE_X11_XLIB_H 1
#define INSTALL_DATA_DIR "/usr/local/share/bzflag"
#define NDEBUG 1
#define PACKAGE "bzflag"
#define PACKAGE_BUGREPORT ""
#define PACKAGE_NAME ""
#define PACKAGE_STRING ""
#define PACKAGE_TARNAME ""
#define PACKAGE_VERSION ""
#define ROBOT 1
#define SNAPPING 1
#define STDC_HEADERS 1
#define STDC_HEADERS 1
#define VERSION "2.0.9"
#define XF86VIDMODE_EXT 1
#endif
#ifdef __cplusplus
void exit (int);
configure: exit 0