hecking for c++... c++
checking whether the C++ compiler (c++ ) works... yes
checking whether the C++ compiler (c++ ) is a cross-compiler... no
checking whether we are using GNU C++... yes
checking whether c++ accepts -g... yes
checking for gtk-config... /usr/bin/gtk-config
checking for GTK - version >= 1.2.0... yes
./configure: line 1479: gnome-config: command not found
updating cache ./config.cache
creating ./config.status
creating Makefile
creating macros/Makefile
creating src/Makefile
creating src/lib/Makefile
creating src/pixmaps/Makefile
creating src/gui/Makefile
creating config.h
dh_testdir
# Add here commands to compile the package.
/usr/bin/make
make[1]: Entering directory `/tmp/buildd/euchre-0.7'
/usr/bin/make all-recursive
make[2]: Entering directory `/tmp/buildd/euchre-0.7'
Making all in macros
make[3]: Entering directory `/tmp/buildd/euchre-0.7/macros'
make[3]: Nothing to be done for `all'.
make[3]: Leaving directory `/tmp/buildd/euchre-0.7/macros'
Making all in src
make[3]: Entering directory `/tmp/buildd/euchre-0.7/src'
Making all in lib
make[4]: Entering directory `/tmp/buildd/euchre-0.7/src/lib'
c++ -DHAVE_CONFIG_H -I. -I. -I../.. -I/usr/include/gtk-1.2 -I/usr/include/glib-1.2 -I/usr/lib/glib/include -g -O2 -c Card.cpp
In file included from /usr/lib/gcc/i486-linux-gnu/4.0.3/../../../../include/c++/4.0.3/backward/iostream.h:31,
from Card.cpp:24:
/usr/lib/gcc/i486-linux-gnu/4.0.3/../../../../include/c++/4.0.3/backward/backward_warning.h:32:2: warning: #warning This file includes at least one deprecated or antiquated header. Please consider using one of the 32 headers found in section 17.4.1.2 of the C++ standard. Examples include substituting the <X> header for the <X.h> header for C++ includes, or <iostream> instead of the deprecated header <iostream.h>. To disable this warning use -Wno-deprecated.
Card.hpp:27: error: using typedef-name 'std::ostream' after 'class'
/usr/lib/gcc/i486-linux-gnu/4.0.3/../../../../include/c++/4.0.3/iosfwd:138: error: 'std::ostream' has a previous declaration here
make[4]: *** [Card.o] Error 1
make[4]: Leaving directory `/tmp/buildd/euchre-0.7/src/lib'
make[3]: *** [all-recursive] Error 1
make[3]: Leaving directory `/tmp/buildd/euchre-0.7/src'
make[2]: *** [all-recursive] Error 1
make[2]: Leaving directory `/tmp/buildd/euchre-0.7'
make[1]: *** [all-recursive-am] Error 2
make[1]: Leaving directory `/tmp/buildd/euchre-0.7'
make: *** [build-stamp] Error 2
pbuilder: Failed autobuilding of package
-> Aborting with an error
-> unmounting dev/pts filesystem
-> unmounting proc filesystem
-> cleaning the build env
-> removing directory /var/cache/pbuilder/build//2039 and its subdirectories
ryan@rkavanagh:~/deb/euchre-0.7$