All pastes #64561 Raw Edit

spca5xx

public text v1 · immutable
#64561 ·published 2006-06-11 22:02 UTC
rendered paste body
make[2]: Entering directory `/home/matr1x/mythtv-0.19/programs/mythtv'
g++ -Wl,--enable-new-dtags -Wl,--as-needed -Wl,--enable-new-dtags -Wl,--as-needed -o mythtv main.o    -L/usr/lib/qt3-gcc4.1/lib -L../../libs/libmyth -L../../libs/libmythtv -L../../libs/libavutil -L../../libs/libavcodec -L../../libs/libavformat -lmythtv-0.19 -lmythavformat-0.19 -lmythavutil-0.19 -lmythavcodec-0.19 -lmyth-0.19 -lfreetype -lmp3lame -lasound -L/usr/lib -ldl -lartsc -lpthread -lgmodule-2.0 -ldl -lgthread-2.0 -lglib-2.0 -ldvdnav -L/usr/lib -L/usr/lib -lXinerama -lXv -lX11 -lXext -lXxf86vm -lXrandr -lqt-mt -lXext -lX11 -lm -lpthread
main.o: In function `main':
main.cpp:(.text+0xd5): undefined reference to `MythContext::MythContext(QString const&)'
main.cpp:(.text+0x112): undefined reference to `MythContext::Init(bool)'
main.cpp:(.text+0x120): undefined reference to `print_verbose_messages'
main.cpp:(.text+0x305): undefined reference to `MythContext::verbose_mutex'
main.cpp:(.text+0x356): undefined reference to `MythContext::verbose_mutex'
main.cpp:(.text+0x42b): undefined reference to `MythContext::GetSetting(QString const&, QString const&)'
main.cpp:(.text+0x48b): undefined reference to `MythContext::FindThemeDir(QString const&)'
main.cpp:(.text+0x505): undefined reference to `print_verbose_messages'
main.cpp:(.text+0x58c): undefined reference to `MythContext::LoadQtConfig()'
main.cpp:(.text+0x5dd): undefined reference to `MythContext::GetSetting(QString const&, QString const&)'
main.cpp:(.text+0x63f): undefined reference to `print_verbose_messages'
main.cpp:(.text+0x875): undefined reference to `MythContext::verbose_mutex'
main.cpp:(.text+0x8c5): undefined reference to `MythContext::verbose_mutex'
main.cpp:(.text+0x91e): undefined reference to `print_verbose_messages'
main.cpp:(.text+0x950): undefined reference to `MythMainWindow::MythMainWindow(QWidget*, char const*, bool, unsigned int)'
main.cpp:(.text+0x958): undefined reference to `MythMainWindow::Init()'
main.cpp:(.text+0x96a): undefined reference to `MythContext::SetMainWindow(MythMainWindow*)'
main.cpp:(.text+0x96f): undefined reference to `TV::InitKeys()'
main.cpp:(.text+0x985): undefined reference to `TV::TV()'
main.cpp:(.text+0x996): undefined reference to `TV::Init(bool)'
main.cpp:(.text+0x9a4): undefined reference to `print_verbose_messages'
main.cpp:(.text+0xb73): undefined reference to `MythContext::verbose_mutex'
main.cpp:(.text+0xbc3): undefined reference to `MythContext::verbose_mutex'
main.cpp:(.text+0xc3e): undefined reference to `ProgramInfo::ProgramInfo()'
main.cpp:(.text+0xcaf): undefined reference to `TV::Playback(ProgramInfo*)'
main.cpp:(.text+0xd0d): undefined reference to `TV::GetState() const'
main.cpp:(.text+0xd6a): undefined reference to `TV::LiveTV(bool, bool)'
main.cpp:(.text+0xd8c): undefined reference to `MythContext::addPrivRequest(MythPrivRequest::Type, void*)'
main.cpp:(.text+0xf6b): undefined reference to `MythContext::verbose_mutex'
main.cpp:(.text+0xfbb): undefined reference to `MythContext::verbose_mutex'
main.o: In function `run_priv_thread(void*)':
main.cpp:(.text+0x16e4): undefined reference to `MythContext::waitPrivRequest() const'
main.cpp:(.text+0x16fa): undefined reference to `MythContext::popPrivRequest()'
main.cpp:(.text+0x1751): undefined reference to `print_verbose_messages'
main.cpp:(.text+0x1772): undefined reference to `MythContext::popPrivRequest()'
main.cpp:(.text+0x1796): undefined reference to `print_verbose_messages'
main.cpp:(.text+0x192c): undefined reference to `MythContext::verbose_mutex'
main.cpp:(.text+0x1978): undefined reference to `MythContext::verbose_mutex'
main.cpp:(.text+0x1990): undefined reference to `print_verbose_messages'
main.cpp:(.text+0x1b2a): undefined reference to `MythContext::verbose_mutex'
main.cpp:(.text+0x1b76): undefined reference to `MythContext::verbose_mutex'
main.cpp:(.text+0x1d43): undefined reference to `MythContext::verbose_mutex'
main.cpp:(.text+0x1d8f): undefined reference to `MythContext::verbose_mutex'
collect2: ld returned 1 exit status
make[2]: *** [mythtv] Error 1
make[2]: Leaving directory `/home/matr1x/mythtv-0.19/programs/mythtv'
make[1]: *** [sub-mythtv] Error 2
make[1]: Leaving directory `/home/matr1x/mythtv-0.19/programs'
make: *** [sub-programs] Error 2