All pastes #64381 Raw Edit

Mine

public text v1 · immutable
#64381 ·published 2006-06-11 16:35 UTC
rendered paste body
if gcc -DHAVE_CONFIG_H -I. -I. -I.. -I.. -I../include -I../src/named-manager -I../src/vpn-manager -I../src/dhcp-manager -I../utils -I../libnm-util -I/usr/include/dbus-1.0 -I/usr/lib64/dbus-1.0/include -I/usr/include/glib-2.0 -I/usr/lib64/glib-2.0/include   -DDBUS_VERSION_MAJOR=0 -DDBUS_VERSION_MINOR=61 -DDBUS_VERSION_MICRO=0 -pthread -I/usr/include/glib-2.0 -I/usr/lib64/glib-2.0/include   -DDBUS_API_SUBJECT_TO_CHANGE -I/usr/include/hal -I/usr/include/dbus-1.0 -I/usr/lib64/dbus-1.0/include    -O2 -fPIC   -DWPA_SUPPLICANT_BIN=\"/usr/sbin/wpa_supplicant\" -DDBUS_API_SUBJECT_TO_CHANGE -DG_DISABLE_DEPRECATED -DBINDIR=\"/usr/local/bin\" -DSBINDIR=\"/usr/local/sbin\" -DLIBEXECDIR=\"/usr/local/libexec\" -DDATADIR=\"/usr/local/share\" -DSYSCONFDIR=\"/usr/local/etc\" -DLOCALSTATEDIR=\"/usr/local/var\" -DNM_RUN_DIR=\"/usr/local/var/run/NetworkManager\" -DGNOMELOCALEDIR=\"/usr/local/share/locale\" -DARP_DEBUG   -g -O2 -MT NetworkManager-NetworkManagerSystem.o -MD -MP -MF ".deps/NetworkManager-NetworkManagerSystem.Tpo" -c -o NetworkManager-NetworkManagerSystem.o `test -f 'NetworkManagerSystem.c' || echo './'`NetworkManagerSystem.c; \
        then mv -f ".deps/NetworkManager-NetworkManagerSystem.Tpo" ".deps/NetworkManager-NetworkManagerSystem.Po"; else rm -f ".deps/NetworkManager-NetworkManagerSystem.Tpo"; exit 1; fi
In file included from /usr/include/asm-x86_64/div64.h:1,
                 from /usr/include/asm/div64.h:5,
                 from /usr/include/linux/calc64.h:5,
                 from /usr/include/linux/jiffies.h:4,
                 from /usr/include/net/dst.h:14,
                 from /usr/include/net/route.h:27,
                 from NetworkManagerSystem.c:30:
/usr/include/asm-generic/div64.h:53:3: #error do_div() does not yet support the C64
In file included from /usr/include/asm-x86_64/vsyscall.h:4,
                 from /usr/include/asm/vsyscall.h:5,
                 from /usr/include/asm-x86_64/timex.h:11,
                 from /usr/include/asm/timex.h:5,
                 from /usr/include/linux/timex.h:59,
                 from /usr/include/linux/jiffies.h:8,
                 from /usr/include/net/dst.h:14,
                 from /usr/include/net/route.h:27,
                 from NetworkManagerSystem.c:30:
/usr/include/linux/seqlock.h:33: error: parse error before "spinlock_t"
/usr/include/linux/seqlock.h:47: error: parse error before '*' token
/usr/include/linux/seqlock.h: In function `write_seqlock':
/usr/include/linux/seqlock.h:49: error: `sl' undeclared (first use in this function)
/usr/include/linux/seqlock.h:49: error: (Each undeclared identifier is reported only once
/usr/include/linux/seqlock.h:49: error: for each function it appears in.)
/usr/include/linux/seqlock.h: At top level:
/usr/include/linux/seqlock.h:54: error: parse error before '*' token
/usr/include/linux/seqlock.h: In function `write_sequnlock':
/usr/include/linux/seqlock.h:57: error: `sl' undeclared (first use in this function)
/usr/include/linux/seqlock.h: At top level:
/usr/include/linux/seqlock.h:61: error: parse error before '*' token
/usr/include/linux/seqlock.h: In function `write_tryseqlock':
/usr/include/linux/seqlock.h:63: error: `sl' undeclared (first use in this function)
/usr/include/linux/seqlock.h: At top level:
/usr/include/linux/seqlock.h:73: error: parse error before '*' token
/usr/include/linux/seqlock.h: In function `read_seqbegin':
/usr/include/linux/seqlock.h:75: error: `sl' undeclared (first use in this function)
/usr/include/linux/seqlock.h: At top level:
/usr/include/linux/seqlock.h:88: error: parse error before '*' token
/usr/include/linux/seqlock.h: In function `read_seqretry':
/usr/include/linux/seqlock.h:91: error: `iv' undeclared (first use in this function)
/usr/include/linux/seqlock.h:91: error: `sl' undeclared (first use in this function)
In file included from /usr/include/asm/system.h:5,
                 from /usr/include/asm-x86_64/timex.h:12,
                 from /usr/include/asm/timex.h:5,
                 from /usr/include/linux/timex.h:59,
                 from /usr/include/linux/jiffies.h:8,
                 from /usr/include/net/dst.h:14,
                 from /usr/include/net/route.h:27,
                 from NetworkManagerSystem.c:30:
/usr/include/asm-x86_64/system.h: In function `__cmpxchg':
/usr/include/asm-x86_64/system.h:73: error: `LOCK_PREFIX' undeclared (first use in this function)
/usr/include/asm-x86_64/system.h:73: error: parse error before string constant
/usr/include/asm-x86_64/system.h:79: error: parse error before string constant
/usr/include/asm-x86_64/system.h:85: error: parse error before string constant
/usr/include/asm-x86_64/system.h:91: error: parse error before string constant
In file included from /usr/include/asm/processor.h:5,
                 from /usr/include/asm-x86_64/timex.h:13,
                 from /usr/include/asm/timex.h:5,
                 from /usr/include/linux/timex.h:59,
                 from /usr/include/linux/jiffies.h:8,
                 from /usr/include/net/dst.h:14,
                 from /usr/include/net/route.h:27,
                 from NetworkManagerSystem.c:30:
/usr/include/asm-x86_64/processor.h: At top level:
/usr/include/asm-x86_64/processor.h:221: error: conflicting types for '____cacheline_aligned'
/usr/include/asm-x86_64/processor.h:67: error: previous declaration of '____cacheline_aligned' was here
/usr/include/asm-x86_64/processor.h:224: error: parse error before "init_tss"
/usr/include/asm-x86_64/processor.h: In function `prefetchw':
/usr/include/asm-x86_64/processor.h:403: error: called object is not a function
In file included from /usr/include/asm/timex.h:5,
                 from /usr/include/linux/timex.h:59,
                 from /usr/include/linux/jiffies.h:8,
                 from /usr/include/net/dst.h:14,
                 from /usr/include/net/route.h:27,
                 from NetworkManagerSystem.c:30:
/usr/include/asm-x86_64/timex.h: At top level:
/usr/include/asm-x86_64/timex.h:28: error: syntax error before "cycles_t"
/usr/include/asm-x86_64/timex.h: In function `get_cycles_sync':
/usr/include/asm-x86_64/timex.h:35: error: called object is not a function
/usr/include/asm-x86_64/timex.h:35: error: called object is not a function
/usr/include/asm-x86_64/timex.h:35: error: parse error before ':' token
In file included from /usr/include/net/dst.h:14,
                 from /usr/include/net/route.h:27,
                 from NetworkManagerSystem.c:30:
/usr/include/linux/jiffies.h:250:47: division by zero in #if
In file included from /usr/include/net/dst.h:14,
                 from /usr/include/net/route.h:27,
                 from NetworkManagerSystem.c:30:
/usr/include/linux/jiffies.h: In function `jiffies_to_msecs':
/usr/include/linux/jiffies.h:253: error: `MSEC_PER_SEC' undeclared (first use in this function)
/usr/include/linux/jiffies.h:261:47: division by zero in #if
/usr/include/linux/jiffies.h: In function `jiffies_to_usecs':
/usr/include/linux/jiffies.h:264: error: `USEC_PER_SEC' undeclared (first use in this function)
/usr/include/linux/jiffies.h:274:47: division by zero in #if
/usr/include/linux/jiffies.h: In function `msecs_to_jiffies':
/usr/include/linux/jiffies.h:277: error: `MSEC_PER_SEC' undeclared (first use in this function)
/usr/include/linux/jiffies.h:287:47: division by zero in #if
/usr/include/linux/jiffies.h: In function `usecs_to_jiffies':
/usr/include/linux/jiffies.h:290: error: `USEC_PER_SEC' undeclared (first use in this function)
/usr/include/linux/jiffies.h: In function `timespec_to_jiffies':
/usr/include/linux/jiffies.h:311: error: `NSEC_PER_SEC' undeclared (first use in this function)
/usr/include/linux/jiffies.h: In function `jiffies_to_timespec':
/usr/include/linux/jiffies.h:329: error: `NSEC_PER_SEC' undeclared (first use in this function)
/usr/include/linux/jiffies.h: In function `timeval_to_jiffies':
/usr/include/linux/jiffies.h:350: error: `NSEC_PER_SEC' undeclared (first use in this function)
/usr/include/linux/jiffies.h:355: error: `NSEC_PER_USEC' undeclared (first use in this function)
/usr/include/linux/jiffies.h: In function `jiffies_to_timeval':
/usr/include/linux/jiffies.h:369: error: `NSEC_PER_SEC' undeclared (first use in this function)
/usr/include/linux/jiffies.h:370: error: `NSEC_PER_USEC' undeclared (first use in this function)
/usr/include/linux/jiffies.h: At top level:
/usr/include/linux/jiffies.h:377: error: parse error before "jiffies_to_clock_t"
/usr/include/linux/jiffies.h:379:41: division by zero in #if
/usr/include/linux/jiffies.h:379:42: division by zero in #if
/usr/include/linux/jiffies.h: In function `jiffies_to_clock_t':
/usr/include/linux/jiffies.h:383: error: `NSEC_PER_SEC' undeclared (first use in this function)
/usr/include/linux/jiffies.h:383: error: `USER_HZ' undeclared (first use in this function)
/usr/include/linux/jiffies.h:390:18: division by zero in #if
/usr/include/linux/jiffies.h: In function `clock_t_to_jiffies':
/usr/include/linux/jiffies.h:398: error: `USER_HZ' undeclared (first use in this function)
/usr/include/linux/jiffies.h:410:41: division by zero in #if
/usr/include/linux/jiffies.h:410:42: division by zero in #if
/usr/include/linux/jiffies.h: In function `jiffies_64_to_clock_t':
/usr/include/linux/jiffies.h:419: error: `NSEC_PER_SEC' undeclared (first use in this function)
/usr/include/linux/jiffies.h:419: error: `USER_HZ' undeclared (first use in this function)
/usr/include/linux/jiffies.h:426:28: division by zero in #if
/usr/include/linux/jiffies.h: In function `nsec_to_clock_t':
/usr/include/linux/jiffies.h:427: error: `NSEC_PER_SEC' undeclared (first use in this function)
/usr/include/linux/jiffies.h:427: error: `USER_HZ' undeclared (first use in this function)
In file included from /usr/include/net/route.h:27,
                 from NetworkManagerSystem.c:30:
/usr/include/net/dst.h: At top level:
/usr/include/net/dst.h:41: error: parse error before "atomic_t"
/usr/include/net/dst.h:80: error: parse error before '}' token
/usr/include/net/dst.h:98: error: parse error before "atomic_t"
/usr/include/net/dst.h:100: error: parse error before '}' token
In file included from /usr/include/net/route.h:28,
                 from NetworkManagerSystem.c:30:
/usr/include/net/inetpeer.h:37: error: parse error before "inet_peer_unused_lock"
/usr/include/net/inetpeer.h:53: error: parse error before "inet_peer_idlock"
In file included from /usr/include/net/flow.h:10,
                 from /usr/include/net/route.h:29,
                 from NetworkManagerSystem.c:30:
/usr/include/linux/in6.h:31: error: redefinition of `struct in6_addr'
/usr/include/linux/in6.h:54: error: redefinition of `struct sockaddr_in6'
/usr/include/linux/in6.h:62: error: redefinition of `struct ipv6_mreq'
In file included from /usr/include/net/route.h:29,
                 from NetworkManagerSystem.c:30:
/usr/include/net/flow.h:81: error: `BITS_PER_LONG' undeclared here (not in a function)
/usr/include/net/flow.h:81: error: requested alignment is not a constant
In file included from NetworkManagerSystem.c:30:
/usr/include/net/route.h:36:2: warning: #warning This file is not supposed to be used outside of kernel.
In file included from NetworkManagerSystem.c:30:
/usr/include/net/route.h:52: error: field `dst' has incomplete type
/usr/include/net/route.h:199: error: parse error before "ipv4_route_table"
In file included from /usr/include/iwlib.h:87,
                 from NetworkManagerUtils.h:29,
                 from NetworkManagerSystem.c:46:
/usr/include/net/if.h:45: error: parse error before numeric constant
/usr/include/net/if.h:111: error: redefinition of `struct ifmap'
/usr/include/net/if.h:126: error: redefinition of `struct ifreq'
/usr/include/net/if.h:176: error: redefinition of `struct ifconf'
NetworkManagerSystem.c: In function `nm_system_device_set_up_down_with_iface':
NetworkManagerSystem.c:506: error: `IFF_UP' undeclared (first use in this function)
NetworkManagerSystem.c: At top level:
/usr/include/net/route.h:199: warning: array 'ipv4_route_table' assumed to have one element
/usr/include/net/dst.h:77: error: storage size of `rcu_head' isn't known
make[3]: *** [NetworkManager-NetworkManagerSystem.o] Error 1
make[3]: Leaving directory `/home/cathectic/src/SlackBuild/networkmanager/NetworkManager-0.6.3/src'
make[2]: *** [all-recursive] Error 1
make[2]: Leaving directory `/home/cathectic/src/SlackBuild/networkmanager/NetworkManager-0.6.3/src'
make[1]: *** [all-recursive] Error 1
make[1]: Leaving directory `/home/cathectic/src/SlackBuild/networkmanager/NetworkManager-0.6.3'
make: *** [all] Error 2