All pastes #640762 Raw Edit

Jemand

public text v1 · immutable
#640762 ·published 2007-07-31 17:16 UTC
rendered paste body
  CC      drivers/base/transport_class.o
  CC      drivers/base/power/shutdown.o
  LD      drivers/base/power/built-in.o
  CC      drivers/base/dma-mapping.o
  CC      drivers/base/dmapool.o
  CC      drivers/base/firmware_class.o
  LD      drivers/base/built-in.o
  LD      drivers/block/built-in.o
  LD      drivers/cdrom/built-in.o
  CC      drivers/char/mem.o
  CC      drivers/char/random.o
  CC      drivers/char/tty_io.o
  CC      drivers/char/n_tty.o
  CC      drivers/char/tty_ioctl.o
drivers/char/tty_ioctl.c: In function 'set_termios':
drivers/char/tty_ioctl.c:420: warning: 'tmp' may be used uninitialized in this function
  CC      drivers/char/pty.o
  CC      drivers/char/misc.o
  CC      drivers/char/hw_random/core.o
  LD      drivers/char/hw_random/rng-core.o
  LD      drivers/char/hw_random/built-in.o
  CC      drivers/char/watchdog/ar7_wdt.o
  LD      drivers/char/watchdog/built-in.o
  CC      drivers/char/ar7_gpio.o
  LD      drivers/char/built-in.o
  LD      drivers/clocksource/built-in.o
  LD      drivers/crypto/built-in.o
  LD      drivers/firmware/built-in.o
  LD      drivers/i2c/algos/built-in.o
  LD      drivers/i2c/busses/built-in.o
  LD      drivers/i2c/chips/built-in.o
  LD      drivers/i2c/built-in.o
  CC      drivers/leds/led-core.o
  CC      drivers/leds/led-class.o
  CC      drivers/leds/led-triggers.o
  CC      drivers/leds/leds-ar7.o
drivers/leds/leds-ar7.c: In function 'ar7_status_led_set':
drivers/leds/leds-ar7.c:40: error: 'AR7_GPIO_BIT_STATUS_LED' undeclared (first use in this function)
drivers/leds/leds-ar7.c:40: error: (Each undeclared identifier is reported only once
drivers/leds/leds-ar7.c:40: error: for each function it appears in.)
drivers/leds/leds-ar7.c: In function 'ar7_leds_probe':
drivers/leds/leds-ar7.c:74: error: 'AR7_GPIO_BIT_STATUS_LED' undeclared (first use in this function)
make[7]: *** [drivers/leds/leds-ar7.o] Error 1
make[6]: *** [drivers/leds] Error 2
make[5]: *** [drivers] Error 2
make[5]: Leaving directory `/home/jan/buildroot/trunk/build_mipsel/linux-2.6-ar7/linux-2.6.22.1'
make[4]: *** [/home/jan/buildroot/trunk/build_mipsel/linux-2.6-ar7/linux-2.6.22.1/.image] Error 2
make[4]: Leaving directory `/home/jan/buildroot/trunk/target/linux/ar7-2.6'
make[3]: *** [install] Error 2
make[3]: Leaving directory `/home/jan/buildroot/trunk/target/linux'
make[2]: *** [target/linux/install] Error 2
make[2]: Leaving directory `/home/jan/buildroot/trunk'
make[1]: *** [/home/jan/buildroot/trunk/staging_dir_mipsel/stampfiles/.target_install] Error 2
make[1]: Leaving directory `/home/jan/buildroot/trunk'
make: *** [world] Fehler 2