All pastes #64009 Raw Edit

Zeroth404

public text v1 · immutable
#64009 ·published 2006-06-11 00:43 UTC
rendered paste body
.libs/kaudioplaystream.o:(.gnu.linkonce.d._ZTV18KByteSoundProducer+0x80): undefined reference to `virtual thunk to Arts::StdSynthModule::start()'
.libs/kaudioplaystream.o:(.gnu.linkonce.d._ZTV18KByteSoundProducer+0x84): undefined reference to `virtual thunk to Arts::StdSynthModule::stop()'
.libs/kaudioplaystream.o:(.gnu.linkonce.d._ZTV18KByteSoundProducer+0x88): undefined reference to `virtual thunk to Arts::StdSynthModule::streamInit()'
.libs/kdatarequest_impl.o:(.gnu.linkonce.d._ZTCN4Arts17KDataRequest_implE132_NS_14StdSynthModuleE+0xa4): undefined reference to `virtual thunk to Arts::StdSynthModule::autoSuspend()'
.libs/kdatarequest_impl.o:(.gnu.linkonce.d._ZTCN4Arts17KDataRequest_implE132_NS_14StdSynthModuleE+0xa8): undefined reference to `virtual thunk to Arts::StdSynthModule::start()'
.libs/kdatarequest_impl.o:(.gnu.linkonce.d._ZTCN4Arts17KDataRequest_implE132_NS_14StdSynthModuleE+0xac): undefined reference to `virtual thunk to Arts::StdSynthModule::stop()'
.libs/kdatarequest_impl.o:(.gnu.linkonce.d._ZTCN4Arts17KDataRequest_implE132_NS_14StdSynthModuleE+0xb0): undefined reference to `virtual thunk to Arts::StdSynthModule::streamInit()'
.libs/kdatarequest_impl.o:(.gnu.linkonce.d._ZTCN4Arts17KDataRequest_implE132_NS_14StdSynthModuleE+0xb4): undefined reference to `virtual thunk to Arts::StdSynthModule::streamStart()'
.libs/kdatarequest_impl.o:(.gnu.linkonce.d._ZTCN4Arts17KDataRequest_implE132_NS_14StdSynthModuleE+0xb8): undefined reference to `virtual thunk to Arts::StdSynthModule::streamEnd()'
.libs/kdatarequest_impl.o:(.gnu.linkonce.d._ZTVN4Arts17KDataRequest_implE+0xe8): undefined reference to `virtual thunk to Arts::StdSynthModule::autoSuspend()'
.libs/kdatarequest_impl.o:(.gnu.linkonce.d._ZTVN4Arts17KDataRequest_implE+0xec): undefined reference to `virtual thunk to Arts::StdSynthModule::start()'
.libs/kdatarequest_impl.o:(.gnu.linkonce.d._ZTVN4Arts17KDataRequest_implE+0xf0): undefined reference to `virtual thunk to Arts::StdSynthModule::stop()'
.libs/kdatarequest_impl.o:(.gnu.linkonce.d._ZTVN4Arts17KDataRequest_implE+0xf8): undefined reference to `virtual thunk to Arts::StdSynthModule::streamStart()'
collect2: ld returned 1 exit status
make[3]: *** [libartskde.la] Error 1
make[3]: Leaving directory `/var/tmp/portage/kdelibs-3.5.3-r1/work/kdelibs-3.5.3/arts/kde'
make[2]: *** [all-recursive] Error 1
make[2]: Leaving directory `/var/tmp/portage/kdelibs-3.5.3-r1/work/kdelibs-3.5.3/arts'
make[1]: *** [all-recursive] Error 1
make[1]: Leaving directory `/var/tmp/portage/kdelibs-3.5.3-r1/work/kdelibs-3.5.3'
make: *** [all] Error 2

!!! ERROR: kde-base/kdelibs-3.5.3-r1 failed.
!!! Function kde_src_compile, Line 275, Exitcode 2
!!! died running emake, kde_src_compile:make
!!! If you need support, post the topmost build error, NOT this status message.

root@helix~#