rendered paste bodyMaking all in .
make[3]: Entering directory `/var/tmp/portage/kdelibs-3.5.3-r1/work/kdelibs-3.5.3/kio'
echo >dummy.cpp
/bin/sh ../libtool --silent --tag=CXX --mode=compile i686-pc-linux-gnu-g++ -DHAVE_CONFIG_H -I. -I. -I.. -I../dcop -I../kdecore -I../kio/kssl -I../kjs -I./.. -I../dcop -I../libltdl -I../kdefx -I../kdecore -I../kdecore -I../kdeui -I../kio -I../kio/kio -I../kio/kfile -I.. -I/usr/qt/3/include -I. -I/usr/kde/3.5/include -D_LARGEFILE64_SOURCE -DQT_THREAD_SUPPORT -D_REENTRANT -Wno-long-long -Wundef -ansi -D_XOPEN_SOURCE=500 -D_BSD_SOURCE -Wcast-align -Wconversion -Wchar-subscripts -Wall -W -Wpointer-arith -DNDEBUG -DNO_DEBUG -O2 -O2 -march=pentium4 -pipe -Wformat-security -Wmissing-format-attribute -Wno-non-virtual-dtor -fno-exceptions -fno-check-new -fno-common -DQT_CLEAN_NAMESPACE -DQT_NO_ASCII_CAST -DQT_NO_STL -DQT_NO_COMPAT -DQT_NO_TRANSLATION -c -o dummy.lo dummy.cpp
/bin/sh ../libtool --silent --tag=CXX --mode=link i686-pc-linux-gnu-g++ -Wno-long-long -Wundef -ansi -D_XOPEN_SOURCE=500 -D_BSD_SOURCE -Wcast-align -Wconversion -Wchar-subscripts -Wall -W -Wpointer-arith -DNDEBUG -DNO_DEBUG -O2 -O2 -march=pentium4 -pipe -Wformat-security -Wmissing-format-attribute -Wno-non-virtual-dtor -fno-exceptions -fno-check-new -fno-common -DQT_CLEAN_NAMESPACE -DQT_NO_ASCII_CAST -DQT_NO_STL -DQT_NO_COMPAT -DQT_NO_TRANSLATION -o libkio.la -rpath /usr/kde/3.5/lib -version-info 6:0:2 -no-undefined -Wl,--no-undefined -Wl,--allow-shlib-undefined -L/usr/kde/3.5/lib -L/usr/qt/3/lib -L/usr/lib dummy.lo kssl/libkssl.la kio/libkiocore.la kio/libksycoca.la bookmarks/libkbookmarks.la kfile/libkfile.la ../kdeui/libkdeui.la ../kdesu/libkdesu.la ../kwallet/client/libkwalletclient.la -lz -lfam
grep: /usr/lib/gcc-lib/i686-pc-linux-gnu/3.3.6/libstdc++.la: No such file or directory
/bin/sed: can't read /usr/lib/gcc-lib/i686-pc-linux-gnu/3.3.6/libstdc++.la: No such file or directory
libtool: link: `/usr/lib/gcc-lib/i686-pc-linux-gnu/3.3.6/libstdc++.la' is not a valid libtool archive
make[3]: *** [libkio.la] Error 1
make[3]: Leaving directory `/var/tmp/portage/kdelibs-3.5.3-r1/work/kdelibs-3.5.3/kio'
make[2]: *** [all-recursive] Error 1
make[2]: Leaving directory `/var/tmp/portage/kdelibs-3.5.3-r1/work/kdelibs-3.5.3/kio'
make[1]: *** [all-recursive] Error 1
make[1]: Leaving directory `/var/tmp/portage/kdelibs-3.5.3-r1/work/kdelibs-3.5.3'
make: *** [all] Error 2
!!! ERROR: kde-base/kdelibs-3.5.3-r1 failed.
!!! Function kde_src_compile, Line 275, Exitcode 2
!!! died running emake, kde_src_compile:make
!!! If you need support, post the topmost build error, NOT this status message.