All pastes #638167 Raw Edit

Mine

public text v1 · immutable
#638167 ·published 2007-07-29 16:12 UTC
rendered paste body
/gtk-2.0/include -I/usr/include/atk-1.0 -I/usr/include/cairo -I/usr/include/pango-1.0 -I/usr/include/glib-2.0 -I/usr/lib/glib-2.0/include -I/usr/include/freetype2 -I/usr/include/libpng12 -I/usr/include/libglade-2.0 -I/usr/include/libxml2 -I/usr/include/libgnomeui-2.0 -I/usr/include/libgnome-2.0 -I/usr/include/libgnomecanvas-2.0 -I/usr/include/libart-2.0 -I/usr/include/gconf/2 -I/usr/include/libbonoboui-2.0 -I/usr/include/gnome-vfs-2.0 -I/usr/lib/gnome-vfs-2.0/include -I/usr/include/gnome-keyring-1 -I/usr/include/orbit-2.0 -I/usr/include/libbonobo-2.0 -I/usr/include/bonobo-activation-2.0 -I/usr/include/libgnomeprint-2.2 -I/usr/include/gtksourceview-1.0 -I/usr/include/libgnomeprintui-2.2 src/print.c
src/print.c: In function 'print_draw_text':
src/print.c:115: warning: pointer targets in passing argument 2 of 'gnome_print_show' differ in signedness
src/print.c: In function 'print_page':
src/print.c:139: warning: pointer targets in passing argument 2 of 'gnome_print_beginpage' differ in signedness
src/print.c: At top level:
src/print.c:165: warning: type defaults to 'int' in declaration of 'GnomePrintPaper'
src/print.c:165: error: expected ';', ',' or ')' before '*' token
src/print.c: In function 'print_schematic':
src/print.c:279: error: expected '=', ',', ';', 'asm' or '__attribute__' before '*' token
src/print.c:279: error: 'paper' undeclared (first use in this function)
src/print.c:279: error: (Each undeclared identifier is reported only once
src/print.c:279: error: for each function it appears in.)
src/print.c:297: warning: pointer targets in passing argument 2 of 'gnome_print_dialog_construct' differ in signedness
src/print.c:305: warning: pointer targets in passing argument 5 of 'gnome_print_dialog_construct_range_page' differ in signedness
src/print.c:305: warning: pointer targets in passing argument 6 of 'gnome_print_dialog_construct_range_page' differ in signedness
src/print.c:328: warning: pointer targets in passing argument 2 of 'gnome_print_config_get' differ in signedness
src/print.c:328: warning: pointer targets in assignment differ in signedness
src/print.c:337: warning: implicit declaration of function 'gnome_print_paper_get_by_name'
src/print.c:340: warning: implicit declaration of function 'gnome_print_paper_get_default'
src/print.c:349: warning: pointer targets in passing argument 1 of 'gnome_font_face_find_closest' differ in signedness
src/print.c:356: warning: implicit declaration of function 'paginate'
src/print.c:367: warning: pointer targets in passing argument 2 of 'gnome_print_job_preview_new' differ in signedness
scons: *** [src/print.o] Error 1
scons: building terminated because of errors.
 *
 * ERROR: sci-electronics/oregano-0.60.0 failed.
 * Call stack:
 *   ebuild.sh, line 1648:   Called dyn_compile
 *   ebuild.sh, line 988:   Called qa_call 'src_compile'
 *   ebuild.sh, line 44:   Called src_compile
 *   oregano-0.60.0.ebuild, line 38:   Called die
 *
 * scons make failed
 * If you need support, post the topmost build error, and the call stack if relevant.
 * A complete build log is located at '/var/tmp/portage/sci-electronics/oregano-0.60.0/temp/build.log'.
 *