All pastes #637950 Raw Edit

Unbenannt

public text v1 · immutable
#637950 ·published 2007-07-29 12:09 UTC
rendered paste body
In file included from ../../boost/type_traits/is_base_and_derived.hpp:14,
                 from ../../boost/foreach.hpp:73,
                 from ../../boost.hpp:4,
                 from ../input/input.hpp:13,
                 from common-output.hpp:7,
                 from renderer.hpp:13,
                 from renderer.cpp:3:
../../boost/type_traits/is_convertible.hpp:343:40: warning: "__HP_aCC" is not defined
In file included from ../../boost/foreach.hpp:73,
                 from ../../boost.hpp:4,
                 from ../input/input.hpp:13,
                 from common-output.hpp:7,
                 from renderer.hpp:13,
                 from renderer.cpp:3:
../../boost/type_traits/is_base_and_derived.hpp:26:59: warning: "__BORLANDC__" is not defined
../../boost/type_traits/is_base_and_derived.hpp:27:45: warning: "__SUNPRO_CC" is not defined
../../boost/type_traits/is_base_and_derived.hpp:28:46: warning: "__EDG_VERSION__" is not defined
../../boost/type_traits/is_base_and_derived.hpp:29:54: warning: "__DMC__" is not defined
../../boost/type_traits/is_base_and_derived.hpp:118:42: warning: "BOOST_MSVC" is not defined
../../boost/type_traits/is_base_and_derived.hpp:133:42: warning: "BOOST_MSVC" is not defined
In file included from ../../boost/foreach.hpp:75,
                 from ../../boost.hpp:4,
                 from ../input/input.hpp:13,
                 from common-output.hpp:7,
                 from renderer.hpp:13,
                 from renderer.cpp:3:
../../boost/utility/addressof.hpp:22:42: warning: "BOOST_MSVC" is not defined
../../boost/utility/addressof.hpp:42:59: warning: "__BORLANDC__" is not defined
In file included from ../../boost.hpp:4,
                 from ../input/input.hpp:13,
                 from common-output.hpp:7,
                 from renderer.hpp:13,
                 from renderer.cpp:3:
../../boost/foreach.hpp:330:58: warning: "__BORLANDC__" is not defined
../../boost/foreach.hpp:519:61: warning: "__SUNPRO_CC" is not defined
../../print.hpp:80: warning: unused parameter mode
../../boost/type_traits/is_abstract.hpp:81: warning: use of old-style cast
../input/input.hpp: In member function std::pair<bool, Input> InputDevice::generate_string(std::string&, int&, F*, std::list<Input, std::allocator<Input> >):
../input/input.hpp:184: warning: declaration of input shadows a member of 'this'
../input/input.hpp: In member function int InputDevice::graphical_search(const std::vector<T, std::allocator<_CharT> >&, F*, K*, J*, G*, int, bool&, std::string&, std::string&, std::string&, int&, int&, BusyIndicator*):
../input/input.hpp:281: warning: declaration of _foreach_col shadows a previous local
../input/input.hpp:280: warning: shadowed declaration is here
../input/input.hpp:281: warning: declaration of _foreach_cur shadows a previous local
../input/input.hpp:280: warning: shadowed declaration is here
../input/input.hpp:281: warning: declaration of _foreach_end shadows a previous local
../input/input.hpp:280: warning: shadowed declaration is here
../input/input.hpp:281: warning: declaration of _foreach_continue shadows a previous local
../input/input.hpp:280: warning: shadowed declaration is here
renderer.cpp: In member function void Render::remove_overlapping_objects():
renderer.cpp:202: warning: declaration of rectangle shadows a member of 'this'
renderer.cpp: In member function void Render::draw(const std::string&, bool):
renderer.cpp:242: warning: declaration of _foreach_col shadows a previous local
renderer.cpp:239: warning: shadowed declaration is here
renderer.cpp:242: warning: declaration of _foreach_cur shadows a previous local
renderer.cpp:239: warning: shadowed declaration is here
renderer.cpp:242: warning: declaration of _foreach_end shadows a previous local
renderer.cpp:239: warning: shadowed declaration is here
renderer.cpp:242: warning: declaration of _foreach_continue shadows a previous local
renderer.cpp:239: warning: shadowed declaration is here
renderer.cpp:245: warning: declaration of _foreach_col shadows a previous local
renderer.cpp:239: warning: shadowed declaration is here
renderer.cpp:245: warning: declaration of _foreach_cur shadows a previous local
renderer.cpp:239: warning: shadowed declaration is here
renderer.cpp:245: warning: declaration of _foreach_end shadows a previous local
renderer.cpp:239: warning: shadowed declaration is here
renderer.cpp:245: warning: declaration of _foreach_continue shadows a previous local
renderer.cpp:239: warning: shadowed declaration is here
renderer.cpp:251: warning: declaration of _foreach_col shadows a previous local
renderer.cpp:239: warning: shadowed declaration is here
renderer.cpp:251: warning: declaration of _foreach_cur shadows a previous local
renderer.cpp:239: warning: shadowed declaration is here
renderer.cpp:251: warning: declaration of _foreach_end shadows a previous local
renderer.cpp:239: warning: shadowed declaration is here
renderer.cpp:251: warning: declaration of _foreach_continue shadows a previous local
renderer.cpp:239: warning: shadowed declaration is here
renderer.cpp:253: warning: declaration of _foreach_col shadows a previous local
renderer.cpp:251: warning: shadowed declaration is here
renderer.cpp:253: warning: declaration of _foreach_cur shadows a previous local
renderer.cpp:251: warning: shadowed declaration is here
renderer.cpp:253: warning: declaration of _foreach_end shadows a previous local
renderer.cpp:251: warning: shadowed declaration is here
renderer.cpp:253: warning: declaration of _foreach_continue shadows a previous local
renderer.cpp:251: warning: shadowed declaration is here
renderer.cpp:262: warning: declaration of _foreach_col shadows a previous local
renderer.cpp:239: warning: shadowed declaration is here
renderer.cpp:262: warning: declaration of _foreach_cur shadows a previous local
renderer.cpp:239: warning: shadowed declaration is here
renderer.cpp:262: warning: declaration of _foreach_end shadows a previous local
renderer.cpp:239: warning: shadowed declaration is here
renderer.cpp:262: warning: declaration of _foreach_continue shadows a previous local
renderer.cpp:239: warning: shadowed declaration is here
renderer.cpp:264: warning: declaration of _foreach_col shadows a previous local
renderer.cpp:262: warning: shadowed declaration is here
renderer.cpp:264: warning: declaration of _foreach_cur shadows a previous local
renderer.cpp:262: warning: shadowed declaration is here
renderer.cpp:264: warning: declaration of _foreach_end shadows a previous local
renderer.cpp:262: warning: shadowed declaration is here
renderer.cpp:264: warning: declaration of _foreach_continue shadows a previous local
renderer.cpp:262: warning: shadowed declaration is here
renderer.cpp:292: warning: declaration of _foreach_col shadows a previous local
renderer.cpp:291: warning: shadowed declaration is here
renderer.cpp:292: warning: declaration of _foreach_cur shadows a previous local
renderer.cpp:291: warning: shadowed declaration is here
renderer.cpp:292: warning: declaration of _foreach_end shadows a previous local
renderer.cpp:291: warning: shadowed declaration is here
renderer.cpp:292: warning: declaration of _foreach_continue shadows a previous local
renderer.cpp:291: warning: shadowed declaration is here
renderer.cpp:302: warning: declaration of _foreach_col shadows a previous local
renderer.cpp:301: warning: shadowed declaration is here
renderer.cpp:302: warning: declaration of _foreach_cur shadows a previous local
renderer.cpp:301: warning: shadowed declaration is here
renderer.cpp:302: warning: declaration of _foreach_end shadows a previous local
renderer.cpp:301: warning: shadowed declaration is here
renderer.cpp:302: warning: declaration of _foreach_continue shadows a previous local
renderer.cpp:301: warning: shadowed declaration is here
renderer.cpp:365: warning: declaration of _foreach_col shadows a previous local
renderer.cpp:364: warning: shadowed declaration is here
renderer.cpp:365: warning: declaration of _foreach_cur shadows a previous local
renderer.cpp:364: warning: shadowed declaration is here
renderer.cpp:365: warning: declaration of _foreach_end shadows a previous local
renderer.cpp:364: warning: shadowed declaration is here
renderer.cpp:365: warning: declaration of _foreach_continue shadows a previous local
renderer.cpp:364: warning: shadowed declaration is here
renderer.cpp:373: warning: declaration of _foreach_col shadows a previous local
renderer.cpp:372: warning: shadowed declaration is here
renderer.cpp:373: warning: declaration of _foreach_cur shadows a previous local
renderer.cpp:372: warning: shadowed declaration is here
renderer.cpp:373: warning: declaration of _foreach_end shadows a previous local
renderer.cpp:372: warning: shadowed declaration is here
renderer.cpp:373: warning: declaration of _foreach_continue shadows a previous local
renderer.cpp:372: warning: shadowed declaration is here
renderer.cpp: At global scope:
renderer.cpp:217: warning: unused parameter module
renderer.cpp: In member function void Render::clean_up_for_next_draw(bool):
renderer.cpp:503: warning: declaration of _foreach_col shadows a previous local
renderer.cpp:502: warning: shadowed declaration is here
renderer.cpp:503: warning: declaration of _foreach_cur shadows a previous local
renderer.cpp:502: warning: shadowed declaration is here
renderer.cpp:503: warning: declaration of _foreach_end shadows a previous local
renderer.cpp:502: warning: shadowed declaration is here
renderer.cpp:503: warning: declaration of _foreach_continue shadows a previous local
renderer.cpp:502: warning: shadowed declaration is here
renderer.cpp: At global scope:
renderer.cpp:500: warning: unused parameter overlay
renderer.cpp: In member function void Render::complete_draw():
renderer.cpp:513: warning: declaration of _foreach_col shadows a previous local
renderer.cpp:512: warning: shadowed declaration is here
renderer.cpp:513: warning: declaration of _foreach_cur shadows a previous local
renderer.cpp:512: warning: shadowed declaration is here
renderer.cpp:513: warning: declaration of _foreach_end shadows a previous local
renderer.cpp:512: warning: shadowed declaration is here
renderer.cpp:513: warning: declaration of _foreach_continue shadows a previous local
renderer.cpp:512: warning: shadowed declaration is here
renderer.cpp: In member function void Render::image_rectangle(GObj*, int, int, int, int, int, int):
renderer.cpp:803: warning: declaration of pic shadows a previous local
renderer.cpp:735: warning: shadowed declaration is here
renderer.cpp: At global scope:
renderer.cpp:978: warning: unused parameter zoom_position
../../print.hpp:85: warning: void print_warning(const std::string&, const std::string&) defined but not used
../../print.hpp:90: warning: void print_info(const std::string&, const std::string&) defined but not used
../../libfspp.hpp:21: warning: void libfs_set_folders_first(std::string) defined but not used
g++ -I/usr/local/include -I/usr/include/ -I. -pthread -pipe -O0 -g -Wall -pedantic -W -Wno-sign-compare -Wold-style-cast -Wundef -Wshadow -Wno-long-long -D_GNU_SOURCE   -fno-exceptions -I../ -I../../ -I../input -I../feature -c render_device.cpp
../../print.hpp:80: warning: unused parameter mode
../../print.hpp:80: warning: void print_critical(const std::string&, const std::string&) defined but not used
../../print.hpp:85: warning: void print_warning(const std::string&, const std::string&) defined but not used
../../print.hpp:90: warning: void print_info(const std::string&, const std::string&) defined but not used
../../print.hpp:95: warning: void print_debug(const std::string&, const std::string&) defined but not used
make -C mpeg
make[3]: Entering directory `/usr/local/src/mms-1.1.0/plugins/output/mpeg'
g++ -I/usr/local/include -I/usr/include/ -I. -pthread -pipe -O0 -g -Wall -pedantic -W -Wno-sign-compare -Wold-style-cast -Wundef -Wshadow -Wno-long-long -D_GNU_SOURCE   -fno-exceptions -I../ -I../../ -I../../../ -I./libs/libavcodec/ -I./libs/libavutil/ -fPIC -shared -c mpeg.cpp
In file included from mpeg.cpp:18:
./libs/libavcodec/avcodec.h:3079:5: warning: "EINVAL" is not defined
../../../print.hpp:80: warning: unused parameter mode
./libs/libavutil/mathematics.h:31: error: comma at end of enumerator list
./libs/libavutil/avutil.h:110: error: comma at end of enumerator list
./libs/libavcodec/avcodec.h:260: error: comma at end of enumerator list
./libs/libavcodec/avcodec.h:287: error: comma at end of enumerator list
./libs/libavcodec/avcodec.h:318: error: comma at end of enumerator list
./libs/libavcodec/avcodec.h:329: error: comma at end of enumerator list
./libs/libavcodec/avcodec.h:2457: warning: attribute ignored in declaration of struct ImgReSampleContext
./libs/libavcodec/avcodec.h:2457: warning: attribute for struct ImgReSampleContext must follow the struct keyword
./libs/libavcodec/avcodec.h:2462: warning: ImgReSampleContext is deprecated (declared at ./libs/libavcodec/avcodec.h:2459)
./libs/libavcodec/avcodec.h:2469: warning: ImgReSampleContext is deprecated (declared at ./libs/libavcodec/avcodec.h:2459)
./libs/libavcodec/avcodec.h:2473: warning: ImgReSampleContext is deprecated (declared at ./libs/libavcodec/avcodec.h:2459)
./libs/libavcodec/avcodec.h:2475: warning: ImgReSampleContext is deprecated (declared at ./libs/libavcodec/avcodec.h:2459)
mpeg.cpp: In function mpeg_frame mpeg_draw(UINT8*):
mpeg.cpp:112: warning: img_convert is deprecated (declared at ./libs/libavcodec/avcodec.h:2600)
mpeg.cpp:112: warning: img_convert is deprecated (declared at ./libs/libavcodec/avcodec.h:2600)
../../../print.hpp: At global scope:
../../../print.hpp:85: warning: void print_warning(const std::string&, const std::string&) defined but not used
../../../print.hpp:90: warning: void print_info(const std::string&, const std::string&) defined but not used
../../../print.hpp:95: warning: void print_debug(const std::string&, const std::string&) defined but not used
make[3]: *** [mpeg.o] Fehler 1
make[3]: Leaving directory `/usr/local/src/mms-1.1.0/plugins/output/mpeg'
make[2]: *** [mpeg/dxr3/libdxr3out.so] Fehler 2
make[2]: Leaving directory `/usr/local/src/mms-1.1.0/plugins/output'
make[1]: Leaving directory `/usr/local/src/mms-1.1.0/plugins'
make -C plugins/output
make[1]: Entering directory `/usr/local/src/mms-1.1.0/plugins/output'
make -C mpeg
make[2]: Entering directory `/usr/local/src/mms-1.1.0/plugins/output/mpeg'
g++ -I/usr/local/include -I/usr/include/ -I. -pthread -pipe -O0 -g -Wall -pedantic -W -Wno-sign-compare -Wold-style-cast -Wundef -Wshadow -Wno-long-long -D_GNU_SOURCE   -fno-exceptions -I../ -I../../ -I../../../ -I./libs/libavcodec/ -I./libs/libavutil/ -fPIC -shared -c mpeg.cpp
In file included from mpeg.cpp:18:
./libs/libavcodec/avcodec.h:3079:5: warning: "EINVAL" is not defined
../../../print.hpp:80: warning: unused parameter mode
./libs/libavutil/mathematics.h:31: error: comma at end of enumerator list
./libs/libavutil/avutil.h:110: error: comma at end of enumerator list
./libs/libavcodec/avcodec.h:260: error: comma at end of enumerator list
./libs/libavcodec/avcodec.h:287: error: comma at end of enumerator list
./libs/libavcodec/avcodec.h:318: error: comma at end of enumerator list
./libs/libavcodec/avcodec.h:329: error: comma at end of enumerator list
./libs/libavcodec/avcodec.h:2457: warning: attribute ignored in declaration of struct ImgReSampleContext
./libs/libavcodec/avcodec.h:2457: warning: attribute for struct ImgReSampleContext must follow the struct keyword
./libs/libavcodec/avcodec.h:2462: warning: ImgReSampleContext is deprecated (declared at ./libs/libavcodec/avcodec.h:2459)
./libs/libavcodec/avcodec.h:2469: warning: ImgReSampleContext is deprecated (declared at ./libs/libavcodec/avcodec.h:2459)
./libs/libavcodec/avcodec.h:2473: warning: ImgReSampleContext is deprecated (declared at ./libs/libavcodec/avcodec.h:2459)
./libs/libavcodec/avcodec.h:2475: warning: ImgReSampleContext is deprecated (declared at ./libs/libavcodec/avcodec.h:2459)
mpeg.cpp: In function mpeg_frame mpeg_draw(UINT8*):
mpeg.cpp:112: warning: img_convert is deprecated (declared at ./libs/libavcodec/avcodec.h:2600)
mpeg.cpp:112: warning: img_convert is deprecated (declared at ./libs/libavcodec/avcodec.h:2600)
../../../print.hpp: At global scope:
../../../print.hpp:85: warning: void print_warning(const std::string&, const std::string&) defined but not used
../../../print.hpp:90: warning: void print_info(const std::string&, const std::string&) defined but not used
../../../print.hpp:95: warning: void print_debug(const std::string&, const std::string&) defined but not used
make[2]: *** [mpeg.o] Fehler 1
make[2]: Leaving directory `/usr/local/src/mms-1.1.0/plugins/output/mpeg'
make[1]: *** [mpeg/dxr3/libdxr3out.so] Fehler 2
make[1]: Leaving directory `/usr/local/src/mms-1.1.0/plugins/output'
make: *** [plugins/output/output.o] Fehler 2

real    5m56.006s
user    5m0.230s
sys     0m34.661s
j