All pastes #637427 Raw Edit

opennl

public text v1 · immutable
#637427 ·published 2007-07-28 21:46 UTC
rendered paste body
Compiling ==> 'opennl.c'
In file included from intern/opennl/intern/opennl.c:39:
intern/opennl/extern/ONL_opennl.h:134: error: syntax error before '<<' token
intern/opennl/intern/opennl.c: In function '__nlBeginMatrix':
intern/opennl/intern/opennl.c:786: warning: unused variable 'j'
intern/opennl/intern/opennl.c: At top level:
intern/opennl/intern/opennl.c:973: error: syntax error before '<<' token
intern/opennl/intern/opennl.c:978: error: syntax error before numeric constant
intern/opennl/intern/opennl.c:978: warning: type defaults to 'int' in declaration of '__nlCheckState'
intern/opennl/intern/opennl.c:978: error: conflicting types for '__nlCheckState'
intern/opennl/intern/opennl.c:553: error: previous definition of '__nlCheckState' was here
intern/opennl/intern/opennl.c:978: warning: data definition has no type or storage class
intern/opennl/intern/opennl.c:982: warning: type defaults to 'int' in declaration of 'b'
intern/opennl/intern/opennl.c:982: error: size of array 'b' has non-integer type
intern/opennl/intern/opennl.c:982: error: 'value' undeclared here (not in a function)
intern/opennl/intern/opennl.c:982: warning: data definition has no type or storage class
intern/opennl/intern/opennl.c:983: error: syntax error before '}' token
intern/opennl/intern/opennl.c:989: error: conflicting types for 'b'
intern/opennl/intern/opennl.c:982: error: previous definition of 'b' was here
intern/opennl/intern/opennl.c:989: error: 'context' undeclared here (not in a function)
intern/opennl/intern/opennl.c:991: error: syntax error before numeric constant
intern/opennl/intern/opennl.c:991: warning: type defaults to 'int' in declaration of '__nlCheckState'
intern/opennl/intern/opennl.c:991: warning: data definition has no type or storage class
intern/opennl/intern/opennl.c:998: warning: type defaults to 'int' in declaration of 'b'
intern/opennl/intern/opennl.c:998: error: size of array 'b' has non-integer type
intern/opennl/intern/opennl.c:998: error: redefinition of 'b'
intern/opennl/intern/opennl.c:982: error: previous definition of 'b' was here
intern/opennl/intern/opennl.c:998: warning: data definition has no type or storage class
intern/opennl/intern/opennl.c:999: error: syntax error before '}' token
intern/opennl/intern/opennl.c:1006: error: syntax error before numeric constant
intern/opennl/intern/opennl.c:1006: warning: type defaults to 'int' in declaration of '__nlCheckState'
intern/opennl/intern/opennl.c:1006: warning: data definition has no type or storage class
intern/opennl/intern/opennl.c:1008: warning: type defaults to 'int' in declaration of 'v'
intern/opennl/intern/opennl.c:1008: error: array subscript is not an integer
intern/opennl/intern/opennl.c:1008: warning: data definition has no type or storage class
intern/opennl/intern/opennl.c:1009: error: syntax error before 'if'
intern/opennl/intern/opennl.c: In function '__nlFactorize_SUPERLU':
intern/opennl/intern/opennl.c:1074: warning: unused variable 'Ri'
{standard input}:13:Ignoring attempt to re-define symbol.
{standard input}:16:Ignoring attempt to re-define symbol.
scons: *** [/Users/jandevera/Developer/build/darwin/intern/opennl/intern/opennl.o] Error 1
scons: building terminated because of errors.