All pastes #637285 Raw Edit

Someone

public text v1 · immutable
#637285 ·published 2007-07-28 18:59 UTC
rendered paste body
de\" -DORBIT2=1 -pthread -I/evo/checkout/gnome2/install/include/libxml2 -I/evo/checkout/gnome2/install/include/libbonobo-2.0 -I/evo/checkout/gnome2/install/include/glib-2.0 -I/evo/checkout/gnome2/install/lib/glib-2.0/include -I/evo/checkout/gnome2/install/include/orbit-2.0 -I/evo/checkout/gnome2/install/include/bonobo-activation-2.0 -I/evo/checkout/gnome2/install/include/gconf/2 -I -g -O2 -Wall -Wmissing-prototypes -Wno-sign-compare -MT e-msgport.lo -MD -MP -MF .deps/e-msgport.Tpo -c e-msgport.c  -fPIC -DPIC -o .libs/e-msgport.o
e-msgport.c:39:18: error: nspr.h: No such file or directory
e-msgport.c:492: error: expected specifier-qualifier-list before 'PRFileDesc'
e-msgport.c:504: error: expected ')' before '*' token
e-msgport.c:539: error: expected ')' before '*' token
e-msgport.c: In function 'e_msgport_new':
e-msgport.c:567: error: 'EMsgPort' has no member named 'prpipe'
e-msgport.c:568: error: 'EMsgPort' has no member named 'prpipe'
e-msgport.c: In function 'e_msgport_destroy':
e-msgport.c:584: error: 'EMsgPort' has no member named 'prpipe'
e-msgport.c:585: warning: implicit declaration of function 'PR_Close'
e-msgport.c:585: error: 'EMsgPort' has no member named 'prpipe'
e-msgport.c:586: error: 'EMsgPort' has no member named 'prpipe'
e-msgport.c: At top level:
e-msgport.c:611: error: expected '=', ',', ';', 'asm' or '__attribute__' before '*' token
e-msgport.c: In function 'e_msgport_put':
e-msgport.c:633: error: 'PRFileDesc' undeclared (first use in this function)
e-msgport.c:633: error: (Each undeclared identifier is reported only once
e-msgport.c:633: error: for each function it appears in.)
e-msgport.c:633: error: 'prfd' undeclared (first use in this function)
e-msgport.c:656: error: 'EMsgPort' has no member named 'prpipe'
e-msgport.c:658: warning: implicit declaration of function 'PR_Write'
e-msgport.c:661: warning: implicit declaration of function 'PR_GetError'
e-msgport.c:661: error: 'PR_PENDING_INTERRUPT_ERROR' undeclared (first use in this function)
e-msgport.c:662: warning: implicit declaration of function 'PR_GetErrorTextLength'
e-msgport.c:663: warning: implicit declaration of function 'PR_GetErrorText'
e-msgport.c: In function 'e_msgport_wait':
e-msgport.c:692: warning: implicit declaration of function 'msgport_sync_with_prpipe'
e-msgport.c:692: error: 'EMsgPort' has no member named 'prpipe'
e-msgport.c: In function 'e_msgport_get':
e-msgport.c:715: error: 'EMsgPort' has no member named 'prpipe'
make[2]: *** [e-msgport.lo] Error 1
make[2]: Leaving directory `/evo/checkout/gnome2/evolution-data-server/libedataserver'
make[1]: *** [all-recursive] Error 1
make[1]: Leaving directory `/evo/checkout/gnome2/evolution-data-server'
make: *** [all] Error 2
*** error during stage build of evolution-data-server: ########## Error running make   *** [1/6]


  [1] rerun stage build
  [2] ignore error and continue to install
  [3] give up on module
  [4] start shell
  [5] go to stage force_checkout
  [6] go to stage configure
choice: