All pastes #636557 Raw Edit

Unnamed

public text v1 · immutable
#636557 ·published 2007-07-28 00:38 UTC
rendered paste body
- e .......................... ERROR!      
--------------------------------------------------------------------------------

----------------------------------- Last loglines ------------------------------
e_fm.o: In function `_e_fm2_cb_dnd_drop':
/home/raventux/e17_cvs/e17/apps/e/src/bin/e_fm.c:4848: undefined reference to `e
core_file_file_get'
/home/raventux/e17_cvs/e17/apps/e/src/bin/e_fm.c:4906: undefined reference to `e
core_file_file_get'
/home/raventux/e17_cvs/e17/apps/e/src/bin/e_fm.c:4926: undefined reference to `e
core_file_file_get'
/home/raventux/e17_cvs/e17/apps/e/src/bin/e_fm.c:4972: undefined reference to `e
core_file_file_get'
e_fm.o:/home/raventux/e17_cvs/e17/apps/e/src/bin/e_fm.c:4948: more undefined ref
erences to `ecore_file_file_get' follow
e_fwin.o: In function `_e_fwin_cb_open':
/home/raventux/e17_cvs/e17/apps/e/src/bin/e_fwin.c:655: undefined reference to `
ecore_list_free_cb_set'
e_fwin.o: In function `e_fwin_new':
/home/raventux/e17_cvs/e17/apps/e/src/bin/e_fwin.c:203: undefined reference to `
ecore_file_file_get'
e_fwin.o: In function `_e_fwin_file_open_dialog':
/home/raventux/e17_cvs/e17/apps/e/src/bin/e_fwin.c:1033: undefined reference to 
`ecore_list_first_goto'
/home/raventux/e17_cvs/e17/apps/e/src/bin/e_fwin.c:1069: undefined reference to 
`ecore_list_free_cb_set'
e_order.o: In function `_e_order_read':
/home/raventux/e17_cvs/e17/apps/e/src/bin/e_order.c:201: undefined reference to 
`ecore_file_dir_get'
/home/raventux/e17_cvs/e17/apps/e/src/bin/e_order.c:227: undefined reference to 
`ecore_file_file_get'
/home/raventux/e17_cvs/e17/apps/e/src/bin/e_order.c:230: undefined reference to 
`ecore_file_file_get'
collect2: ld returned 1 exit status
make[3]: *** [enlightenment] Error 1
make[3]: Leaving directory `/home/raventux/e17_cvs/e17/apps/e/src/bin'
make[2]: *** [all-recursive] Error 1
make[2]: Leaving directory `/home/raventux/e17_cvs/e17/apps/e/src'
make[1]: *** [all-recursive] Error 1
make[1]: Leaving directory `/home/raventux/e17_cvs/e17/apps/e'
make: *** [all] Error 2