All pastes #636345 Raw Edit

zope_err

public text v1 · immutable
#636345 ·published 2007-07-27 20:30 UTC
rendered paste body
Dependencies/BTrees-Zope-3.3.1/BTrees/BTreeModuleTemplate.c:472: error: expected expression before ‘)’ token
Dependencies/BTrees-Zope-3.3.1/BTrees/BTreeModuleTemplate.c:475: warning: implicit declaration of function ‘PyModule_GetDict’
Dependencies/BTrees-Zope-3.3.1/BTrees/BTreeModuleTemplate.c:476: warning: implicit declaration of function ‘PyDict_SetItemString’
Dependencies/BTrees-Zope-3.3.1/BTrees/BTreeModuleTemplate.c:477: error: expected expression before ‘)’ token
Dependencies/BTrees-Zope-3.3.1/BTrees/BTreeModuleTemplate.c:480: error: expected expression before ‘)’ token
Dependencies/BTrees-Zope-3.3.1/BTrees/BTreeModuleTemplate.c:483: error: expected expression before ‘)’ token
Dependencies/BTrees-Zope-3.3.1/BTrees/BTreeModuleTemplate.c:486: error: expected expression before ‘)’ token
Dependencies/BTrees-Zope-3.3.1/BTrees/BTreeModuleTemplate.c:489: error: expected expression before ‘)’ token
error: command 'gcc' failed with exit status 1
make: *** [build] Error 1