All pastes #63578 Raw Edit

noaXess

public text v1 · immutable
#63578 ·published 2006-06-10 08:04 UTC
rendered paste body
drivers/usb/net/zd1211/zdpmfilter.c:155: warning: unused variable ‘RC4Key’
drivers/usb/net/zd1211/zdpmfilter.c:149: warning: unused variable ‘icv’
  CC [M]  drivers/usb/net/zd1211/zdpsmon.o
drivers/usb/net/zd1211/zdpsmon.c: In function ‘RxInfoIndicate’:
drivers/usb/net/zd1211/zdpsmon.c:351: warning: ‘asoc’ may be used uninitialized in this function
drivers/usb/net/zd1211/zdpsmon.c:350: warning: ‘oldPsm’ may be used uninitialized in this function
drivers/usb/net/zd1211/zdpsmon.c: In function ‘zd_SetKeyInfo’:
drivers/usb/net/zd1211/zdpsmon.c:600: warning: unused variable ‘KeyRsc’
  CC [M]  drivers/usb/net/zd1211/zdsynch.o
drivers/usb/net/zd1211/zdsynch.c: In function ‘ProbeRsp_Beacon’:
drivers/usb/net/zd1211/zdsynch.c:210: warning: unused variable ‘pWPA’
  CC [M]  drivers/usb/net/zd1211/zdbuf.o
drivers/usb/net/zd1211/zdbuf.c: In function ‘initFdescBuf’:
drivers/usb/net/zd1211/zdbuf.c:129: warning: unused variable ‘pFrmDesc’
  CC [M]  drivers/usb/net/zd1211/zdhw.o
drivers/usb/net/zd1211/zdhw.c: In function ‘HW_Set_AL2230_RF_Chips’:
drivers/usb/net/zd1211/zdhw.c:630: warning: ‘tmpvalue’ is used uninitialized in this function
drivers/usb/net/zd1211/zdhw.c: In function ‘HW_GetNow’:
drivers/usb/net/zd1211/zdhw.c:1332: warning: unused variable ‘reg’
drivers/usb/net/zd1211/zdhw.c: In function ‘HW_RadioOnOff’:
drivers/usb/net/zd1211/zdhw.c:1372: warning: ‘tmpvalue’ is used uninitialized in this function
drivers/usb/net/zd1211/zdhw.c: In function ‘HW_OverWritePhyRegFromE2P’:
drivers/usb/net/zd1211/zdhw.c:1697: warning: unused variable ‘PhyValue’
drivers/usb/net/zd1211/zdhw.c:1696: warning: unused variable ‘PhyIdx’
drivers/usb/net/zd1211/zdhw.c:1695: warning: unused variable ‘i’
drivers/usb/net/zd1211/zdhw.c:1693: warning: unused variable ‘NumOfReg’
drivers/usb/net/zd1211/zdhw.c: In function ‘HW_UpdateIntegrationValue’:
drivers/usb/net/zd1211/zdhw.c:1748: warning: unused variable ‘reg’
  CC [M]  drivers/usb/net/zd1211/zddebug.o
drivers/usb/net/zd1211/zddebug.c: In function ‘zd1205_dump_regs’:
drivers/usb/net/zd1211/zddebug.c:57: warning: unused variable ‘flags’
  CC [M]  drivers/usb/net/zd1211/zdtkipseed.o
  CC [M]  drivers/usb/net/zd1211/zdmic.o
  DEVLIST drivers/usb/net/zd1211/zddevlist.h
make[4]: *** [drivers/usb/net/zd1211/zddevlist.h] Error 1
make[3]: *** [drivers/usb/net/zd1211] Error 2
make[2]: *** [drivers/usb/net] Error 2
make[1]: *** [drivers/usb] Error 2
make: *** [drivers] Error 2