rendered paste bodyMaking all in doc...
make[5]: Entering directory `/home/ubuntu/openwrt/x86/build_i386/freeradius-1.1.6/doc'
make[6]: Entering directory `/home/ubuntu/openwrt/x86/build_i386/freeradius-1.1.6/doc'
Making all in examples...
make[7]: Entering directory `/home/ubuntu/openwrt/x86/build_i386/freeradius-1.1.6/doc/examples'
make[7]: Nothing to be done for `all'.
make[7]: Leaving directory `/home/ubuntu/openwrt/x86/build_i386/freeradius-1.1.6/doc/examples'
Making all in rfc...
make[7]: Entering directory `/home/ubuntu/openwrt/x86/build_i386/freeradius-1.1.6/doc/rfc'
make[7]: Nothing to be done for `all'.
make[7]: Leaving directory `/home/ubuntu/openwrt/x86/build_i386/freeradius-1.1.6/doc/rfc'
make[6]: Leaving directory `/home/ubuntu/openwrt/x86/build_i386/freeradius-1.1.6/doc'
make[5]: Leaving directory `/home/ubuntu/openwrt/x86/build_i386/freeradius-1.1.6/doc'
make[4]: Leaving directory `/home/ubuntu/openwrt/x86/build_i386/freeradius-1.1.6'
/home/ubuntu/openwrt/x86/build_i386/freeradius-1.1.6/install-sh -c -d -m 755 /home/ubuntu/openwrt/x86/build_i386/freeradius-1.1.6/ipkg-install/usr/sbin
/home/ubuntu/openwrt/x86/build_i386/freeradius-1.1.6/install-sh -c -d -m 755 /home/ubuntu/openwrt/x86/build_i386/freeradius-1.1.6/ipkg-install/usr/bin
/home/ubuntu/openwrt/x86/build_i386/freeradius-1.1.6/install-sh -c -d -m 755 /home/ubuntu/openwrt/x86/build_i386/freeradius-1.1.6/ipkg-install/usr/lib/
mkdir: cannot create directory `/home/ubuntu/openwrt/x86/build_i386/freeradius-1.1.6/ipkg-install/usr/lib/': File exists
make[3]: *** [install] Error 1
make[3]: Leaving directory `/home/ubuntu/openwrt/x86/build_i386/freeradius-1.1.6'
make[2]: *** [/home/ubuntu/openwrt/x86/build_i386/freeradius-1.1.6/.built] Error 2
make[2]: Leaving directory `/home/ubuntu/openwrt/x86/feeds/original-packages/net/freeradius'
*** freeradius compile failed
make[1]: *** [freeradius-compile] Error 1
make[1]: Leaving directory `/home/ubuntu/openwrt/x86/package'
Build failed. Please re-run make with V=99 to see what's going on
make: *** [package/freeradius-compile] Fehler 1